iOS Question error after upgrade 4.40

ykucuk

Well-Known Member
Licensed User
Hello,

i use Mac local builder. I copied libraries (4.3) to new BuildServer(4.4) folder.

Run B4iBuildServer.jar from new folder. Everything looks like work but I got bellow error when i run project.
Any help?

B4X:
B4i Version: 4.40
Parsing code.    (0.00s)
Compiling code.    (0.09s)
Compiling layouts code.    (0.01s)
Compiling debugger engine code.    (2.16s)
Building Xcode project    (0.63s)
Sending data to remote compiler.    Error
Out: Build settings from command line:
    ARCHS = x86_64
    CODE_SIGNING_REQUIRED = NO
    CONFIGURATION_BUILD_DIR = /Users/mkucuk/Desktop/B4iBuildServer5/UploadedProjects/<user id>/Payload
    PRODUCT_NAME = B4i Example
    SDKROOT = iphonesimulator11.2

=== BUILD TARGET B4iProject OF PROJECT B4iProject WITH CONFIGURATION Release ===

Check dependencies

Write auxiliary files
write-file /Users/mkucuk/Desktop/B4iBuildServer5/UploadedProjects/<user id>/build/B4iProject.build/Release-iphonesimulator/B4iProject.build/B4i\ Example-generated-files.hmap
write-file /Users/mkucuk/Desktop/B4iBuildServer5/UploadedProjects/<user id>/build/B4iProject.build/Release-iphonesimulator/B4iProject.build/B4i\ Example-all-target-headers.hmap
write-file /Users/mkucuk/Desktop/B4iBuildServer5/UploadedProjects/<user id>/build/B4iProject.build/Release-iphonesimulator/B4iProject.build/B4i\ Example.hmap
write-file /Users/mkucuk/Desktop/B4iBuildServer5/UploadedProjects/<user id>/build/B4iProject.build/Release-iphonesimulator/B4iProject.build/B4i\ Example-all-non-framework-target-headers.hmap
write-file /Users/mkucuk/Desktop/B4iBuildServer5/UploadedProjects/<user id>/build/B4iProject.build/Release-iphonesimulator/B4iProject.build/Objects-normal/x86_64/B4i\ Example.LinkFileList
write-file /Users/mkucuk/Desktop/B4iBuildServer5/UploadedProjects/<user id>/build/B4iProject.build/Release-iphonesimulator/B4iProject.build/B4i\ Example-own-target-headers.hmap
write-file /Users/mkucuk/Desktop/B4iBuildServer5/UploadedProjects/<user id>/build/B4iProject.build/Release-iphonesimulator/B4iProject.build/B4i\ Example-project-headers.hmap

Create product structure
/bin/mkdir -p /Users/mkucuk/Desktop/B4iBuildServer5/UploadedProjects/<user id>/Payload/B4i\ Example.app

ProcessProductPackaging "" build/B4iProject.build/Release-iphonesimulator/B4iProject.build/B4i\ Example.app.xcent
    cd /Users/mkucuk/Desktop/B4iBuildServer5/UploadedProjects/<user id>
    export PATH="/Applications/Xcode.app/Contents/Developer/Platforms/iPhoneSimulator.platform/Developer/usr/bin:/Applications/Xcode.app/Contents/Developer/usr/bin:/usr/local/bin:/usr/bin:/bin:/usr/sbin:/sbin:/opt/X11/bin:/Library/Frameworks/Mono.framework/Versions/Current/Commands"
    builtin-productPackagingUtility -entitlements -format xml -o /Users/mkucuk/Desktop/B4iBuildServer5/UploadedProjects/<user id>/build/B4iProject.build/Release-iphonesimulator/B4iProject.build/B4i\ Example.app.xcent

CompileC build/B4iProject.build/Release-iphonesimulator/B4iProject.build/Objects-normal/x86_64/LS_main.o B4iProject/LS_main.m normal x86_64 objective-c com.apple.compilers.llvm.clang.1_0.compiler
    cd /Users/mkucuk/Desktop/B4iBuildServer5/UploadedProjects/<user id>
    export LANG=en_US.US-ASCII
    export PATH="/Applications/Xcode.app/Contents/Developer/Platforms/iPhoneSimulator.platform/Developer/usr/bin:/Applications/Xcode.app/Contents/Developer/usr/bin:/usr/local/bin:/usr/bin:/bin:/usr/sbin:/sbin:/opt/X11/bin:/Library/Frameworks/Mono.framework/Versions/Current/Commands"
    /Applications/Xcode.app/Contents/Developer/Toolchains/XcodeDefault.xctoolchain/usr/bin/clang -x objective-c -arch x86_64 -fmessage-length=0 -fdiagnostics-show-note-include-stack -fmacro-backtrace-limit=0 -std=gnu99 -fobjc-arc -fmodules -gmodules -fmodules-prune-interval=86400 -fmodules-prune-after=345600 -fbuild-session-file=/var/folders/9p/k4nz5hks5p13wd729t2zc8rr0000gn/C/org.llvm.clang/ModuleCache/Session.modulevalidation -fmodules-validate-once-per-build-session -Wnon-modular-include-in-framework-module -Werror=non-modular-include-in-framework-module -Wno-trigraphs -fpascal-strings -O0 -Wno-missing-field-initializers -Wno-missing-prototypes -Werror=return-type -Wno-implicit-atomic-properties -Werror=deprecated-objc-isa-usage -Werror=objc-root-class -Wno-arc-repeated-use-of-weak -Wduplicate-method-match -Wno-missing-braces -Wparentheses -Wswitch -Wunused-function -Wno-unused-label -Wno-unused-parameter -Wunused-variable -Wunused-value -Wempty-body -Wuninitialized -Wconditional-uninitialized -Wno-unknown-pragmas -Wno-shadow -Wno-four-char-constants -Wno-conversion -Wconstant-conversion -Wint-conversion -Wbool-conversion -Wenum-conversion -Wno-float-conversion -Wno-non-literal-null-conversion -Wno-objc-literal-conversion -Wshorten-64-to-32 -Wpointer-sign -Wno-newline-eof -Wno-selector -Wno-strict-selector-match -Wundeclared-selector -Wno-deprecated-implementations -DNS_BLOCK_ASSERTIONS=1 -isysroot /Applications/Xcode.app/Contents/Developer/Platforms/iPhoneSimulator.platform/Developer/SDKs/iPhoneSimulator11.2.sdk -fasm-blocks -fstrict-aliasing -Wprotocol -Wdeprecated-declarations -mios-simulator-version-min=7.0 -fvisibility=hidden -Wno-sign-conversion -Wno-infinite-recursion -Wno-comma -Wno-block-capture-autoreleasing -Wno-strict-prototypes -fobjc-abi-version=2 -fobjc-legacy-dispatch -iquote /Users/mkucuk/Desktop/B4iBuildServer5/UploadedProjects/<user id>/build/B4iProject.build/Release-iphonesimulator/B4iProject.build/B4i\ Example-generated-files.hmap -I/Users/mkucuk/Desktop/B4iBuildServer5/UploadedProjects/<user id>/build/B4iProject.build/Release-iphonesimulator/B4iProject.build/B4i\ Example-own-target-headers.hmap -I/Users/mkucuk/Desktop/B4iBuildServer5/UploadedProjects/<user id>/build/B4iProject.build/Release-iphonesimulator/B4iProject.build/B4i\ Example-all-target-headers.hmap -iquote /Users/mkucuk/Desktop/B4iBuildServer5/UploadedProjects/<user id>/build/B4iProject.build/Release-iphonesimulator/B4iProject.build/B4i\ Example-project-headers.hmap -I/Users/mkucuk/Desktop/B4iBuildServer5/UploadedProjects/<user id>/Payload/include -I/Users/mkucuk/Desktop/B4iBuildServer5/UploadedProjects/<user id>/build/B4iProject.build/Release-iphonesimulator/B4iProject.build/DerivedSources/x86_64 -I/Users/mkucuk/Desktop/B4iBuildServer5/UploadedProjects/<user id>/build/B4iProject.build/Release-iphonesimulator/B4iProject.build/DerivedSources -F/Users/mkucuk/Desktop/B4iBuildServer5/UploadedProjects/<user id>/Payload -F../../Libs -MMD -MT dependencies -MF /Users/mkucuk/Desktop/B4iBuildServer5/UploadedProjects/<user id>/build/B4iProject.build/Release-iphonesimulator/B4iProject.build/Objects-normal/x86_64/LS_main.d --serialize-diagnostics /Users/mkucuk/Desktop/B4iBuildServer5/UploadedProjects/<user id>/build/B4iProject.build/Release-iphonesimulator/B4iProject.build/Objects-normal/x86_64/LS_main.dia -c /Users/mkucuk/Desktop/B4iBuildServer5/UploadedProjects/<user id>/B4iProject/LS_main.m -o /Users/mkucuk/Desktop/B4iBuildServer5/UploadedProjects/<user id>/build/B4iProject.build/Release-iphonesimulator/B4iProject.build/Objects-normal/x86_64/LS_main.o

CompileC build/B4iProject.build/Release-iphonesimulator/B4iProject.build/Objects-normal/x86_64/main.o B4iProject/main.m normal x86_64 objective-c com.apple.compilers.llvm.clang.1_0.compiler
    cd /Users/mkucuk/Desktop/B4iBuildServer5/UploadedProjects/<user id>
    export LANG=en_US.US-ASCII
    export PATH="/Applications/Xcode.app/Contents/Developer/Platforms/iPhoneSimulator.platform/Developer/usr/bin:/Applications/Xcode.app/Contents/Developer/usr/bin:/usr/local/bin:/usr/bin:/bin:/usr/sbin:/sbin:/opt/X11/bin:/Library/Frameworks/Mono.framework/Versions/Current/Commands"
    /Applications/Xcode.app/Contents/Developer/Toolchains/XcodeDefault.xctoolchain/usr/bin/clang -x objective-c -arch x86_64 -fmessage-length=0 -fdiagnostics-show-note-include-stack -fmacro-backtrace-limit=0 -std=gnu99 -fobjc-arc -fmodules -gmodules -fmodules-prune-interval=86400 -fmodules-prune-after=345600 -fbuild-session-file=/var/folders/9p/k4nz5hks5p13wd729t2zc8rr0000gn/C/org.llvm.clang/ModuleCache/Session.modulevalidation -fmodules-validate-once-per-build-session -Wnon-modular-include-in-framework-module -Werror=non-modular-include-in-framework-module -Wno-trigraphs -fpascal-strings -O0 -Wno-missing-field-initializers -Wno-missing-prototypes -Werror=return-type -Wno-implicit-atomic-properties -Werror=deprecated-objc-isa-usage -Werror=objc-root-class -Wno-arc-repeated-use-of-weak -Wduplicate-method-match -Wno-missing-braces -Wparentheses -Wswitch -Wunused-function -Wno-unused-label -Wno-unused-parameter -Wunused-variable -Wunused-value -Wempty-body -Wuninitialized -Wconditional-uninitialized -Wno-unknown-pragmas -Wno-shadow -Wno-four-char-constants -Wno-conversion -Wconstant-conversion -Wint-conversion -Wbool-conversion -Wenum-conversion -Wno-float-conversion -Wno-non-literal-null-conversion -Wno-objc-literal-conversion -Wshorten-64-to-32 -Wpointer-sign -Wno-newline-eof -Wno-selector -Wno-strict-selector-match -Wundeclared-selector -Wno-deprecated-implementations -DNS_BLOCK_ASSERTIONS=1 -isysroot /Applications/Xcode.app/Contents/Developer/Platforms/iPhoneSimulator.platform/Developer/SDKs/iPhoneSimulator11.2.sdk -fasm-blocks -fstrict-aliasing -Wprotocol -Wdeprecated-declarations -mios-simulator-version-min=7.0 -fvisibility=hidden -Wno-sign-conversion -Wno-infinite-recursion -Wno-comma -Wno-block-capture-autoreleasing -Wno-strict-prototypes -fobjc-abi-version=2 -fobjc-legacy-dispatch -iquote /Users/mkucuk/Desktop/B4iBuildServer5/UploadedProjects/<user id>/build/B4iProject.build/Release-iphonesimulator/B4iProject.build/B4i\ Example-generated-files.hmap -I/Users/mkucuk/Desktop/B4iBuildServer5/UploadedProjects/<user id>/build/B4iProject.build/Release-iphonesimulator/B4iProject.build/B4i\ Example-own-target-headers.hmap -I/Users/mkucuk/Desktop/B4iBuildServer5/UploadedProjects/<user id>/build/B4iProject.build/Release-iphonesimulator/B4iProject.build/B4i\ Example-all-target-headers.hmap -iquote /Users/mkucuk/Desktop/B4iBuildServer5/UploadedProjects/<user id>/build/B4iProject.build/Release-iphonesimulator/B4iProject.build/B4i\ Example-project-headers.hmap -I/Users/mkucuk/Desktop/B4iBuildServer5/UploadedProjects/<user id>/Payload/include -I/Users/mkucuk/Desktop/B4iBuildServer5/UploadedProjects/<user id>/build/B4iProject.build/Release-iphonesimulator/B4iProject.build/DerivedSources/x86_64 -I/Users/mkucuk/Desktop/B4iBuildServer5/UploadedProjects/<user id>/build/B4iProject.build/Release-iphonesimulator/B4iProject.build/DerivedSources -F/Users/mkucuk/Desktop/B4iBuildServer5/UploadedProjects/<user id>/Payload -F../../Libs -MMD -MT dependencies -MF /Users/mkucuk/Desktop/B4iBuildServer5/UploadedProjects/<user id>/build/B4iProject.build/Release-iphonesimulator/B4iProject.build/Objects-normal/x86_64/main.d --serialize-diagnostics /Users/mkucuk/Desktop/B4iBuildServer5/UploadedProjects/<user id>/build/B4iProject.build/Release-iphonesimulator/B4iProject.build/Objects-normal/x86_64/main.dia -c /Users/mkucuk/Desktop/B4iBuildServer5/UploadedProjects/<user id>/B4iProject/main.m -o /Users/mkucuk/Desktop/B4iBuildServer5/UploadedProjects/<user id>/build/B4iProject.build/Release-iphonesimulator/B4iProject.build/Objects-normal/x86_64/main.o

CompileC build/B4iProject.build/Release-iphonesimulator/B4iProject.build/Objects-normal/x86_64/b4i_main.o B4iProject/b4i_main.m normal x86_64 objective-c com.apple.compilers.llvm.clang.1_0.compiler
    cd /Users/mkucuk/Desktop/B4iBuildServer5/UploadedProjects/<user id>
    export LANG=en_US.US-ASCII
    export PATH="/Applications/Xcode.app/Contents/Developer/Platforms/iPhoneSimulator.platform/Developer/usr/bin:/Applications/Xcode.app/Contents/Developer/usr/bin:/usr/local/bin:/usr/bin:/bin:/usr/sbin:/sbin:/opt/X11/bin:/Library/Frameworks/Mono.framework/Versions/Current/Commands"
    /Applications/Xcode.app/Contents/Developer/Toolchains/XcodeDefault.xctoolchain/usr/bin/clang -x objective-c -arch x86_64 -fmessage-length=0 -fdiagnostics-show-note-include-stack -fmacro-backtrace-limit=0 -std=gnu99 -fobjc-arc -fmodules -gmodules -fmodules-prune-interval=86400 -fmodules-prune-after=345600 -fbuild-session-file=/var/folders/9p/k4nz5hks5p13wd729t2zc8rr0000gn/C/org.llvm.clang/ModuleCache/Session.modulevalidation -fmodules-validate-once-per-build-session -Wnon-modular-include-in-framework-module -Werror=non-modular-include-in-framework-module -Wno-trigraphs -fpascal-strings -O0 -Wno-missing-field-initializers -Wno-missing-prototypes -Werror=return-type -Wno-implicit-atomic-properties -Werror=deprecated-objc-isa-usage -Werror=objc-root-class -Wno-arc-repeated-use-of-weak -Wduplicate-method-match -Wno-missing-braces -Wparentheses -Wswitch -Wunused-function -Wno-unused-label -Wno-unused-parameter -Wunused-variable -Wunused-value -Wempty-body -Wuninitialized -Wconditional-uninitialized -Wno-unknown-pragmas -Wno-shadow -Wno-four-char-constants -Wno-conversion -Wconstant-conversion -Wint-conversion -Wbool-conversion -Wenum-conversion -Wno-float-conversion -Wno-non-literal-null-conversion -Wno-objc-literal-conversion -Wshorten-64-to-32 -Wpointer-sign -Wno-newline-eof -Wno-selector -Wno-strict-selector-match -Wundeclared-selector -Wno-deprecated-implementations -DNS_BLOCK_ASSERTIONS=1 -isysroot /Applications/Xcode.app/Contents/Developer/Platforms/iPhoneSimulator.platform/Developer/SDKs/iPhoneSimulator11.2.sdk -fasm-blocks -fstrict-aliasing -Wprotocol -Wdeprecated-declarations -mios-simulator-version-min=7.0 -fvisibility=hidden -Wno-sign-conversion -Wno-infinite-recursion -Wno-comma -Wno-block-capture-autoreleasing -Wno-strict-prototypes -fobjc-abi-version=2 -fobjc-legacy-dispatch -iquote /Users/mkucuk/Desktop/B4iBuildServer5/UploadedProjects/<user id>/build/B4iProject.build/Release-iphonesimulator/B4iProject.build/B4i\ Example-generated-files.hmap -I/Users/mkucuk/Desktop/B4iBuildServer5/UploadedProjects/<user id>/build/B4iProject.build/Release-iphonesimulator/B4iProject.build/B4i\ Example-own-target-headers.hmap -I/Users/mkucuk/Desktop/B4iBuildServer5/UploadedProjects/<user id>/build/B4iProject.build/Release-iphonesimulator/B4iProject.build/B4i\ Example-all-target-headers.hmap -iquote /Users/mkucuk/Desktop/B4iBuildServer5/UploadedProjects/<user id>/build/B4iProject.build/Release-iphonesimulator/B4iProject.build/B4i\ Example-project-headers.hmap -I/Users/mkucuk/Desktop/B4iBuildServer5/UploadedProjects/<user id>/Payload/include -I/Users/mkucuk/Desktop/B4iBuildServer5/UploadedProjects/<user id>/build/B4iProject.build/Release-iphonesimulator/B4iProject.build/DerivedSources/x86_64 -I/Users/mkucuk/Desktop/B4iBuildServer5/UploadedProjects/<user id>/build/B4iProject.build/Release-iphonesimulator/B4iProject.build/DerivedSources -F/Users/mkucuk/Desktop/B4iBuildServer5/UploadedProjects/<user id>/Payload -F../../Libs -MMD -MT dependencies -MF /Users/mkucuk/Desktop/B4iBuildServer5/UploadedProjects/<user id>/build/B4iProject.build/Release-iphonesimulator/B4iProject.build/Objects-normal/x86_64/b4i_main.d --serialize-diagnostics /Users/mkucuk/Desktop/B4iBuildServer5/UploadedProjects/<user id>/build/B4iProject.build/Release-iphonesimulator/B4iProject.build/Objects-normal/x86_64/b4i_main.dia -c /Users/mkucuk/Desktop/B4iBuildServer5/UploadedProjects/<user id>/B4iProject/b4i_main.m -o /Users/mkucuk/Desktop/B4iBuildServer5/UploadedProjects/<user id>/build/B4iProject.build/Release-iphonesimulator/B4iProject.build/Objects-normal/x86_64/b4i_main.o

CompileC build/B4iProject.build/Release-iphonesimulator/B4iProject.build/Objects-normal/x86_64/LS_tab1.o B4iProject/LS_tab1.m normal x86_64 objective-c com.apple.compilers.llvm.clang.1_0.compiler
    cd /Users/mkucuk/Desktop/B4iBuildServer5/UploadedProjects/<user id>
    export LANG=en_US.US-ASCII
    export PATH="/Applications/Xcode.app/Contents/Developer/Platforms/iPhoneSimulator.platform/Developer/usr/bin:/Applications/Xcode.app/Contents/Developer/usr/bin:/usr/local/bin:/usr/bin:/bin:/usr/sbin:/sbin:/opt/X11/bin:/Library/Frameworks/Mono.framework/Versions/Current/Commands"
    /Applications/Xcode.app/Contents/Developer/Toolchains/XcodeDefault.xctoolchain/usr/bin/clang -x objective-c -arch x86_64 -fmessage-length=0 -fdiagnostics-show-note-include-stack -fmacro-backtrace-limit=0 -std=gnu99 -fobjc-arc -fmodules -gmodules -fmodules-prune-interval=86400 -fmodules-prune-after=345600 -fbuild-session-file=/var/folders/9p/k4nz5hks5p13wd729t2zc8rr0000gn/C/org.llvm.clang/ModuleCache/Session.modulevalidation -fmodules-validate-once-per-build-session -Wnon-modular-include-in-framework-module -Werror=non-modular-include-in-framework-module -Wno-trigraphs -fpascal-strings -O0 -Wno-missing-field-initializers -Wno-missing-prototypes -Werror=return-type -Wno-implicit-atomic-properties -Werror=deprecated-objc-isa-usage -Werror=objc-root-class -Wno-arc-repeated-use-of-weak -Wduplicate-method-match -Wno-missing-braces -Wparentheses -Wswitch -Wunused-function -Wno-unused-label -Wno-unused-parameter -Wunused-variable -Wunused-value -Wempty-body -Wuninitialized -Wconditional-uninitialized -Wno-unknown-pragmas -Wno-shadow -Wno-four-char-constants -Wno-conversion -Wconstant-conversion -Wint-conversion -Wbool-conversion -Wenum-conversion -Wno-float-conversion -Wno-non-literal-null-conversion -Wno-objc-literal-conversion -Wshorten-64-to-32 -Wpointer-sign -Wno-newline-eof -Wno-selector -Wno-strict-selector-match -Wundeclared-selector -Wno-deprecated-implementations -DNS_BLOCK_ASSERTIONS=1 -isysroot /Applications/Xcode.app/Contents/Developer/Platforms/iPhoneSimulator.platform/Developer/SDKs/iPhoneSimulator11.2.sdk -fasm-blocks -fstrict-aliasing -Wprotocol -Wdeprecated-declarations -mios-simulator-version-min=7.0 -fvisibility=hidden -Wno-sign-conversion -Wno-infinite-recursion -Wno-comma -Wno-block-capture-autoreleasing -Wno-strict-prototypes -fobjc-abi-version=2 -fobjc-legacy-dispatch -iquote /Users/mkucuk/Desktop/B4iBuildServer5/UploadedProjects/<user id>/build/B4iProject.build/Release-iphonesimulator/B4iProject.build/B4i\ Example-generated-files.hmap -I/Users/mkucuk/Desktop/B4iBuildServer5/UploadedProjects/<user id>/build/B4iProject.build/Release-iphonesimulator/B4iProject.build/B4i\ Example-own-target-headers.hmap -I/Users/mkucuk/Desktop/B4iBuildServer5/UploadedProjects/<user id>/build/B4iProject.build/Release-iphonesimulator/B4iProject.build/B4i\ Example-all-target-headers.hmap -iquote /Users/mkucuk/Desktop/B4iBuildServer5/UploadedProjects/<user id>/build/B4iProject.build/Release-iphonesimulator/B4iProject.build/B4i\ Example-project-headers.hmap -I/Users/mkucuk/Desktop/B4iBuildServer5/UploadedProjects/<user id>/Payload/include -I/Users/mkucuk/Desktop/B4iBuildServer5/UploadedProjects/<user id>/build/B4iProject.build/Release-iphonesimulator/B4iProject.build/DerivedSources/x86_64 -I/Users/mkucuk/Desktop/B4iBuildServer5/UploadedProjects/<user id>/build/B4iProject.build/Release-iphonesimulator/B4iProject.build/DerivedSources -F/Users/mkucuk/Desktop/B4iBuildServer5/UploadedProjects/<user id>/Payload -F../../Libs -MMD -MT dependencies -MF /Users/mkucuk/Desktop/B4iBuildServer5/UploadedProjects/<user id>/build/B4iProject.build/Release-iphonesimulator/B4iProject.build/Objects-normal/x86_64/LS_tab1.d --serialize-diagnostics /Users/mkucuk/Desktop/B4iBuildServer5/UploadedProjects/<user id>/build/B4iProject.build/Release-iphonesimulator/B4iProject.build/Objects-normal/x86_64/LS_tab1.dia -c /Users/mkucuk/Desktop/B4iBuildServer5/UploadedProjects/<user id>/B4iProject/LS_tab1.m -o /Users/mkucuk/Desktop/B4iBuildServer5/UploadedProjects/<user id>/build/B4iProject.build/Release-iphonesimulator/B4iProject.build/Objects-normal/x86_64/LS_tab1.o

Ld Payload/B4i\ Example.app/B4i\ Example normal x86_64
    cd /Users/mkucuk/Desktop/B4iBuildServer5/UploadedProjects/<user id>
    export IPHONEOS_DEPLOYMENT_TARGET=7.0
    export PATH="/Applications/Xcode.app/Contents/Developer/Platforms/iPhoneSimulator.platform/Developer/usr/bin:/Applications/Xcode.app/Contents/Developer/usr/bin:/usr/local/bin:/usr/bin:/bin:/usr/sbin:/sbin:/opt/X11/bin:/Library/Frameworks/Mono.framework/Versions/Current/Commands"
    /Applications/Xcode.app/Contents/Developer/Toolchains/XcodeDefault.xctoolchain/usr/bin/clang -arch x86_64 -isysroot /Applications/Xcode.app/Contents/Developer/Platforms/iPhoneSimulator.platform/Developer/SDKs/iPhoneSimulator11.2.sdk -L/Users/mkucuk/Desktop/B4iBuildServer5/UploadedProjects/<user id>/Payload -L../../Libs -F/Users/mkucuk/Desktop/B4iBuildServer5/UploadedProjects/<user id>/Payload -F../../Libs -filelist /Users/mkucuk/Desktop/B4iBuildServer5/UploadedProjects/<user id>/build/B4iProject.build/Release-iphonesimulator/B4iProject.build/Objects-normal/x86_64/B4i\ Example.LinkFileList -Xlinker -rpath -Xlinker @executable_path/Frameworks -mios-simulator-version-min=7.0 -Xlinker -object_path_lto -Xlinker /Users/mkucuk/Desktop/B4iBuildServer5/UploadedProjects/<user id>/build/B4iProject.build/Release-iphonesimulator/B4iProject.build/Objects-normal/x86_64/B4i\ Example_lto.o -Xlinker -no_deduplicate -Xlinker -objc_abi_version -Xlinker 2 -fobjc-arc -fobjc-link-runtime -ObjC -Xlinker -sectcreate -Xlinker __TEXT -Xlinker __entitlements -Xlinker /Users/mkucuk/Desktop/B4iBuildServer5/UploadedProjects/<user id>/build/B4iProject.build/Release-iphonesimulator/B4iProject.build/B4i\ Example.app.xcent -lCore -framework Foundation -framework CoreGraphics -framework UIKit -liTabStrip -framework AVFoundation -liDebug2 -Xlinker -dependency_info -Xlinker /Users/mkucuk/Desktop/B4iBuildServer5/UploadedProjects/<user id>/build/B4iProject.build/Release-iphonesimulator/B4iProject.build/Objects-normal/x86_64/B4i\ Example_dependency_info.dat -o /Users/mkucuk/Desktop/B4iBuildServer5/UploadedProjects/<user id>/Payload/B4i\ Example.app/B4i\ Example
ld: warning: ignoring file ../../Libs/libCore.a, missing required architecture x86_64 in file ../../Libs/libCore.a (3 slices)
ld: warning: ignoring file ../../Libs/libiTabStrip.a, missing required architecture x86_64 in file ../../Libs/libiTabStrip.a (3 slices)
ld: warning: ignoring file ../../Libs/libiDebug2.a, missing required architecture x86_64 in file ../../Libs/libiDebug2.a (3 slices)
Undefined symbols for architecture x86_64:
  "_OBJC_CLASS_$_B4I", referenced from:
      objc-class-ref in b4i_main.o
  "_OBJC_CLASS_$_B4IAppDelegate", referenced from:
      objc-class-ref in main.o
  "_OBJC_CLASS_$_B4IApplicationWrapper", referenced from:
      objc-class-ref in b4i_main.o
  "_OBJC_CLASS_$_B4IAttributedString", referenced from:
      objc-class-ref in b4i_main.o
  "_OBJC_CLASS_$_B4ICSBuilder", referenced from:
      objc-class-ref in b4i_main.o
  "_OBJC_CLASS_$_B4ICommon", referenced from:
      objc-class-ref in b4i_main.o
  "_OBJC_CLASS_$_B4IDebug", referenced from:
      objc-class-ref in b4i_main.o
  "_OBJC_CLASS_$_B4ILabelWrapper", referenced from:
      objc-class-ref in b4i_main.o
  "_OBJC_CLASS_$_B4ILayoutBuilder", referenced from:
      objc-class-ref in LS_main.o
      objc-class-ref in LS_tab1.o
  "_OBJC_CLASS_$_B4IList", referenced from:
      objc-class-ref in b4i_main.o
  "_OBJC_CLASS_$_B4INavigationControllerWrapper", referenced from:
      objc-class-ref in b4i_main.o
  "_OBJC_CLASS_$_B4IObjectWrapper", referenced from:
      objc-class-ref in b4i_main.o
  "_OBJC_CLASS_$_B4IPage", referenced from:
      objc-class-ref in b4i_main.o
  "_OBJC_CLASS_$_B4IRDebugUtils", referenced from:
      objc-class-ref in b4i_main.o
  "_OBJC_CLASS_$_B4IShellBI", referenced from:
      objc-class-ref in b4i_main.o
  "_OBJC_CLASS_$_B4IStaticModule", referenced from:
      _OBJC_CLASS_$_b4i_main in b4i_main.o
  "_OBJC_CLASS_$_B4ITabStrip", referenced from:
      objc-class-ref in b4i_main.o
  "_OBJC_CLASS_$_B4IViewWrapper", referenced from:
      objc-class-ref in b4i_main.o
  "_OBJC_CLASS_$_B4IWebViewWrapper", referenced from:
      objc-class-ref in b4i_main.o
  "_OBJC_METACLASS_$_B4IStaticModule", referenced from:
      _OBJC_METACLASS_$_b4i_main in b4i_main.o
ld: symbol(s) not found for architecture x86_64
clang: error: linker command failed with exit code 1 (use -v to see invocation)


Error: ** BUILD FAILED **


The following build commands failed:
    Ld Payload/B4i\ Example.app/B4i\ Example normal x86_64
(1 failure)
 

ykucuk

Well-Known Member
Licensed User
This is a mistake. You should copy the libraries from v4.4 builder zip to the Libs folder.
Thank you. 1 of projects worked. Other one still have error.
B4X:
B4i Version: 4.40
Parsing code.    (0.04s)
Compiling code.    (0.17s)
Compiling layouts code.    (0.01s)
Compiling debugger engine code.    (7.90s)
Building Xcode project    (0.25s)
Sending data to remote compiler.    Error
Out: Build settings from command line:
    ARCHS = x86_64
    CODE_SIGNING_REQUIRED = NO
    CONFIGURATION_BUILD_DIR = /Users/mkucuk/Desktop/B4iBuildServer5/UploadedProjects/<user id>/Payload
    PRODUCT_NAME = Citicon
    SDKROOT = iphonesimulator11.2

=== BUILD TARGET B4iProject OF PROJECT B4iProject WITH CONFIGURATION Release ===

Check dependencies

Write auxiliary files
write-file /Users/mkucuk/Desktop/B4iBuildServer5/UploadedProjects/<user id>/build/B4iProject.build/Release-iphonesimulator/B4iProject.build/Citicon-project-headers.hmap
write-file /Users/mkucuk/Desktop/B4iBuildServer5/UploadedProjects/<user id>/build/B4iProject.build/Release-iphonesimulator/B4iProject.build/Citicon.hmap

Create product structure
/bin/mkdir -p /Users/mkucuk/Desktop/B4iBuildServer5/UploadedProjects/<user id>/Payload/Citicon.app

CompileC build/B4iProject.build/Release-iphonesimulator/B4iProject.build/Objects-normal/x86_64/b4i_modshare.o B4iProject/b4i_modshare.m normal x86_64 objective-c com.apple.compilers.llvm.clang.1_0.compiler
    cd /Users/mkucuk/Desktop/B4iBuildServer5/UploadedProjects/<user id>
    export LANG=en_US.US-ASCII
    export PATH="/Applications/Xcode.app/Contents/Developer/Platforms/iPhoneSimulator.platform/Developer/usr/bin:/Applications/Xcode.app/Contents/Developer/usr/bin:/usr/local/bin:/usr/bin:/bin:/usr/sbin:/sbin:/opt/X11/bin:/Library/Frameworks/Mono.framework/Versions/Current/Commands"
    /Applications/Xcode.app/Contents/Developer/Toolchains/XcodeDefault.xctoolchain/usr/bin/clang -x objective-c -arch x86_64 -fmessage-length=0 -fdiagnostics-show-note-include-stack -fmacro-backtrace-limit=0 -std=gnu99 -fobjc-arc -fmodules -gmodules -fmodules-prune-interval=86400 -fmodules-prune-after=345600 -fbuild-session-file=/var/folders/9p/k4nz5hks5p13wd729t2zc8rr0000gn/C/org.llvm.clang/ModuleCache/Session.modulevalidation -fmodules-validate-once-per-build-session -Wnon-modular-include-in-framework-module -Werror=non-modular-include-in-framework-module -Wno-trigraphs -fpascal-strings -O0 -Wno-missing-field-initializers -Wno-missing-prototypes -Werror=return-type -Wno-implicit-atomic-properties -Werror=deprecated-objc-isa-usage -Werror=objc-root-class -Wno-arc-repeated-use-of-weak -Wduplicate-method-match -Wno-missing-braces -Wparentheses -Wswitch -Wunused-function -Wno-unused-label -Wno-unused-parameter -Wunused-variable -Wunused-value -Wempty-body -Wuninitialized -Wconditional-uninitialized -Wno-unknown-pragmas -Wno-shadow -Wno-four-char-constants -Wno-conversion -Wconstant-conversion -Wint-conversion -Wbool-conversion -Wenum-conversion -Wno-float-conversion -Wno-non-literal-null-conversion -Wno-objc-literal-conversion -Wshorten-64-to-32 -Wpointer-sign -Wno-newline-eof -Wno-selector -Wno-strict-selector-match -Wundeclared-selector -Wno-deprecated-implementations -DNS_BLOCK_ASSERTIONS=1 -isysroot /Applications/Xcode.app/Contents/Developer/Platforms/iPhoneSimulator.platform/Developer/SDKs/iPhoneSimulator11.2.sdk -fasm-blocks -fstrict-aliasing -Wprotocol -Wdeprecated-declarations -mios-simulator-version-min=8.0 -fvisibility=hidden -Wno-sign-conversion -Wno-infinite-recursion -Wno-comma -Wno-block-capture-autoreleasing -Wno-strict-prototypes -fobjc-abi-version=2 -fobjc-legacy-dispatch -iquote /Users/mkucuk/Desktop/B4iBuildServer5/UploadedProjects/<user id>/build/B4iProject.build/Release-iphonesimulator/B4iProject.build/Citicon-generated-files.hmap -I/Users/mkucuk/Desktop/B4iBuildServer5/UploadedProjects/<user id>/build/B4iProject.build/Release-iphonesimulator/B4iProject.build/Citicon-own-target-headers.hmap -I/Users/mkucuk/Desktop/B4iBuildServer5/UploadedProjects/<user id>/build/B4iProject.build/Release-iphonesimulator/B4iProject.build/Citicon-all-target-headers.hmap -iquote /Users/mkucuk/Desktop/B4iBuildServer5/UploadedProjects/<user id>/build/B4iProject.build/Release-iphonesimulator/B4iProject.build/Citicon-project-headers.hmap -I/Users/mkucuk/Desktop/B4iBuildServer5/UploadedProjects/<user id>/Payload/include -I/Users/mkucuk/Desktop/B4iBuildServer5/UploadedProjects/<user id>/build/B4iProject.build/Release-iphonesimulator/B4iProject.build/DerivedSources/x86_64 -I/Users/mkucuk/Desktop/B4iBuildServer5/UploadedProjects/<user id>/build/B4iProject.build/Release-iphonesimulator/B4iProject.build/DerivedSources -F/Users/mkucuk/Desktop/B4iBuildServer5/UploadedProjects/<user id>/Payload -F../../Libs -MMD -MT dependencies -MF /Users/mkucuk/Desktop/B4iBuildServer5/UploadedProjects/<user id>/build/B4iProject.build/Release-iphonesimulator/B4iProject.build/Objects-normal/x86_64/b4i_modshare.d --serialize-diagnostics /Users/mkucuk/Desktop/B4iBuildServer5/UploadedProjects/<user id>/build/B4iProject.build/Release-iphonesimulator/B4iProject.build/Objects-normal/x86_64/b4i_modshare.dia -c /Users/mkucuk/Desktop/B4iBuildServer5/UploadedProjects/<user id>/B4iProject/b4i_modshare.m -o /Users/mkucuk/Desktop/B4iBuildServer5/UploadedProjects/<user id>/build/B4iProject.build/Release-iphonesimulator/B4iProject.build/Objects-normal/x86_64/b4i_modshare.o
In file included from /Users/mkucuk/Desktop/B4iBuildServer5/UploadedProjects/<user id>/B4iProject/b4i_modshare.m:2:
/Users/mkucuk/Desktop/B4iBuildServer5/UploadedProjects/<user id>/B4iProject/b4i_modshare.h:16:9: warning: non-portable path to file '"iHttp.h"'; specified path differs in case from file name on disk [-Wnonportable-include-path]
#import "ihttp.h"
        ^~~~~~~~~
        "iHttp.h"
In file included from /Users/mkucuk/Desktop/B4iBuildServer5/UploadedProjects/<user id>/B4iProject/b4i_modshare.m:3:
/Users/mkucuk/Desktop/B4iBuildServer5/UploadedProjects/<user id>/B4iProject/b4i_main.h:16:9: warning: non-portable path to file '"iHttp.h"'; specified path differs in case from file name on disk [-Wnonportable-include-path]
#import "ihttp.h"
        ^~~~~~~~~
        "iHttp.h"
In file included from /Users/mkucuk/Desktop/B4iBuildServer5/UploadedProjects/<user id>/B4iProject/b4i_modshare.m:4:
/Users/mkucuk/Desktop/B4iBuildServer5/UploadedProjects/<user id>/B4iProject/b4i_imagedownloader.h:16:9: warning: non-portable path to file '"iHttp.h"'; specified path differs in case from file name on disk [-Wnonportable-include-path]
#import "ihttp.h"
        ^~~~~~~~~
        "iHttp.h"
In file included from /Users/mkucuk/Desktop/B4iBuildServer5/UploadedProjects/<user id>/B4iProject/b4i_modshare.m:5:
/Users/mkucuk/Desktop/B4iBuildServer5/UploadedProjects/<user id>/B4iProject/b4i_statemanager.h:16:9: warning: non-portable path to file '"iHttp.h"'; specified path differs in case from file name on disk [-Wnonportable-include-path]
#import "ihttp.h"
        ^~~~~~~~~
        "iHttp.h"
/Users/mkucuk/Desktop/B4iBuildServer5/UploadedProjects/<user id>/B4iProject/b4i_modshare.m:143:18: warning: 'setCompletionHandler:' is deprecated: first deprecated in iOS 8.0 - Use completionWithItemsHandler instead. [-Wdeprecated-declarations]
     [controller setCompletionHandler:^(NSString*activityType, BOOL completed) {
                 ^
In module 'UIKit' imported from ../../Libs/iCore.h:7:
/Applications/Xcode.app/Contents/Developer/Platforms/iPhoneSimulator.platform/Developer/SDKs/iPhoneSimulator11.2.sdk/System/Library/Frameworks/UIKit.framework/Headers/UIActivityViewController.h:25:80: note: property 'completionHandler' is declared deprecated here
@property(nullable, nonatomic, copy) UIActivityViewControllerCompletionHandler completionHandler NS_DEPRECATED_IOS(6_0, 8_0, "Use completionWithItemsHandler instead.");  // set to nil after call
                                                                               ^
/Applications/Xcode.app/Contents/Developer/Platforms/iPhoneSimulator.platform/Developer/SDKs/iPhoneSimulator11.2.sdk/System/Library/Frameworks/UIKit.framework/Headers/UIActivityViewController.h:25:80: note: 'setCompletionHandler:' has been explicitly marked deprecated here
5 warnings generated.

CompileC build/B4iProject.build/Release-iphonesimulator/B4iProject.build/Objects-normal/x86_64/b4i_statemanager.o B4iProject/b4i_statemanager.m normal x86_64 objective-c com.apple.compilers.llvm.clang.1_0.compiler
    cd /Users/mkucuk/Desktop/B4iBuildServer5/UploadedProjects/<user id>
    export LANG=en_US.US-ASCII
    export PATH="/Applications/Xcode.app/Contents/Developer/Platforms/iPhoneSimulator.platform/Developer/usr/bin:/Applications/Xcode.app/Contents/Developer/usr/bin:/usr/local/bin:/usr/bin:/bin:/usr/sbin:/sbin:/opt/X11/bin:/Library/Frameworks/Mono.framework/Versions/Current/Commands"
    /Applications/Xcode.app/Contents/Developer/Toolchains/XcodeDefault.xctoolchain/usr/bin/clang -x objective-c -arch x86_64 -fmessage-length=0 -fdiagnostics-show-note-include-stack -fmacro-backtrace-limit=0 -std=gnu99 -fobjc-arc -fmodules -gmodules -fmodules-prune-interval=86400 -fmodules-prune-after=345600 -fbuild-session-file=/var/folders/9p/k4nz5hks5p13wd729t2zc8rr0000gn/C/org.llvm.clang/ModuleCache/Session.modulevalidation -fmodules-validate-once-per-build-session -Wnon-modular-include-in-framework-module -Werror=non-modular-include-in-framework-module -Wno-trigraphs -fpascal-strings -O0 -Wno-missing-field-initializers -Wno-missing-prototypes -Werror=return-type -Wno-implicit-atomic-properties -Werror=deprecated-objc-isa-usage -Werror=objc-root-class -Wno-arc-repeated-use-of-weak -Wduplicate-method-match -Wno-missing-braces -Wparentheses -Wswitch -Wunused-function -Wno-unused-label -Wno-unused-parameter -Wunused-variable -Wunused-value -Wempty-body -Wuninitialized -Wconditional-uninitialized -Wno-unknown-pragmas -Wno-shadow -Wno-four-char-constants -Wno-conversion -Wconstant-conversion -Wint-conversion -Wbool-conversion -Wenum-conversion -Wno-float-conversion -Wno-non-literal-null-conversion -Wno-objc-literal-conversion -Wshorten-64-to-32 -Wpointer-sign -Wno-newline-eof -Wno-selector -Wno-strict-selector-match -Wundeclared-selector -Wno-deprecated-implementations -DNS_BLOCK_ASSERTIONS=1 -isysroot /Applications/Xcode.app/Contents/Developer/Platforms/iPhoneSimulator.platform/Developer/SDKs/iPhoneSimulator11.2.sdk -fasm-blocks -fstrict-aliasing -Wprotocol -Wdeprecated-declarations -mios-simulator-version-min=8.0 -fvisibility=hidden -Wno-sign-conversion -Wno-infinite-recursion -Wno-comma -Wno-block-capture-autoreleasing -Wno-strict-prototypes -fobjc-abi-version=2 -fobjc-legacy-dispatch -iquote /Users/mkucuk/Desktop/B4iBuildServer5/UploadedProjects/<user id>/build/B4iProject.build/Release-iphonesimulator/B4iProject.build/Citicon-generated-files.hmap -I/Users/mkucuk/Desktop/B4iBuildServer5/UploadedProjects/<user id>/build/B4iProject.build/Release-iphonesimulator/B4iProject.build/Citicon-own-target-headers.hmap -I/Users/mkucuk/Desktop/B4iBuildServer5/UploadedProjects/<user id>/build/B4iProject.build/Release-iphonesimulator/B4iProject.build/Citicon-all-target-headers.hmap -iquote /Users/mkucuk/Desktop/B4iBuildServer5/UploadedProjects/<user id>/build/B4iProject.build/Release-iphonesimulator/B4iProject.build/Citicon-project-headers.hmap -I/Users/mkucuk/Desktop/B4iBuildServer5/UploadedProjects/<user id>/Payload/include -I/Users/mkucuk/Desktop/B4iBuildServer5/UploadedProjects/<user id>/build/B4iProject.build/Release-iphonesimulator/B4iProject.build/DerivedSources/x86_64 -I/Users/mkucuk/Desktop/B4iBuildServer5/UploadedProjects/<user id>/build/B4iProject.build/Release-iphonesimulator/B4iProject.build/DerivedSources -F/Users/mkucuk/Desktop/B4iBuildServer5/UploadedProjects/<user id>/Payload -F../../Libs -MMD -MT dependencies -MF /Users/mkucuk/Desktop/B4iBuildServer5/UploadedProjects/<user id>/build/B4iProject.build/Release-iphonesimulator/B4iProject.build/Objects-normal/x86_64/b4i_statemanager.d --serialize-diagnostics /Users/mkucuk/Desktop/B4iBuildServer5/UploadedProjects/<user id>/build/B4iProject.build/Release-iphonesimulator/B4iProject.build/Objects-normal/x86_64/b4i_statemanager.dia -c /Users/mkucuk/Desktop/B4iBuildServer5/UploadedProjects/<user id>/B4iProject/b4i_statemanager.m -o /Users/mkucuk/Desktop/B4iBuildServer5/UploadedProjects/<user id>/build/B4iProject.build/Release-iphonesimulator/B4iProject.build/Objects-normal/x86_64/b4i_statemanager.o
In file included from /Users/mkucuk/Desktop/B4iBuildServer5/UploadedProjects/<user id>/B4iProject/b4i_statemanager.m:2:
/Users/mkucuk/Desktop/B4iBuildServer5/UploadedProjects/<user id>/B4iProject/b4i_statemanager.h:16:9: warning: non-portable path to file '"iHttp.h"'; specified path differs in case from file name on disk [-Wnonportable-include-path]
#import "ihttp.h"
        ^~~~~~~~~
        "iHttp.h"
In file included from /Users/mkucuk/Desktop/B4iBuildServer5/UploadedProjects/<user id>/B4iProject/b4i_statemanager.m:3:
/Users/mkucuk/Desktop/B4iBuildServer5/UploadedProjects/<user id>/B4iProject/b4i_main.h:16:9: warning: non-portable path to file '"iHttp.h"'; specified path differs in case from file name on disk [-Wnonportable-include-path]
#import "ihttp.h"
        ^~~~~~~~~
        "iHttp.h"
In file included from /Users/mkucuk/Desktop/B4iBuildServer5/UploadedProjects/<user id>/B4iProject/b4i_statemanager.m:4:
/Users/mkucuk/Desktop/B4iBuildServer5/UploadedProjects/<user id>/B4iProject/b4i_imagedownloader.h:16:9: warning: non-portable path to file '"iHttp.h"'; specified path differs in case from file name on disk [-Wnonportable-include-path]
#import "ihttp.h"
        ^~~~~~~~~
        "iHttp.h"
In file included from /Users/mkucuk/Desktop/B4iBuildServer5/UploadedProjects/<user id>/B4iProject/b4i_statemanager.m:5:
/Users/mkucuk/Desktop/B4iBuildServer5/UploadedProjects/<user id>/B4iProject/b4i_modshare.h:16:9: warning: non-portable path to file '"iHttp.h"'; specified path differs in case from file name on disk [-Wnonportable-include-path]
#import "ihttp.h"
        ^~~~~~~~~
        "iHttp.h"
4 warnings generated.

CompileC build/B4iProject.build/Release-iphonesimulator/B4iProject.build/Objects-normal/x86_64/b4i_imagedownloader.o B4iProject/b4i_imagedownloader.m normal x86_64 objective-c com.apple.compilers.llvm.clang.1_0.compiler
    cd /Users/mkucuk/Desktop/B4iBuildServer5/UploadedProjects/<user id>
    export LANG=en_US.US-ASCII
    export PATH="/Applications/Xcode.app/Contents/Developer/Platforms/iPhoneSimulator.platform/Developer/usr/bin:/Applications/Xcode.app/Contents/Developer/usr/bin:/usr/local/bin:/usr/bin:/bin:/usr/sbin:/sbin:/opt/X11/bin:/Library/Frameworks/Mono.framework/Versions/Current/Commands"
    /Applications/Xcode.app/Contents/Developer/Toolchains/XcodeDefault.xctoolchain/usr/bin/clang -x objective-c -arch x86_64 -fmessage-length=0 -fdiagnostics-show-note-include-stack -fmacro-backtrace-limit=0 -std=gnu99 -fobjc-arc -fmodules -gmodules -fmodules-prune-interval=86400 -fmodules-prune-after=345600 -fbuild-session-file=/var/folders/9p/k4nz5hks5p13wd729t2zc8rr0000gn/C/org.llvm.clang/ModuleCache/Session.modulevalidation -fmodules-validate-once-per-build-session -Wnon-modular-include-in-framework-module -Werror=non-modular-include-in-framework-module -Wno-trigraphs -fpascal-strings -O0 -Wno-missing-field-initializers -Wno-missing-prototypes -Werror=return-type -Wno-implicit-atomic-properties -Werror=deprecated-objc-isa-usage -Werror=objc-root-class -Wno-arc-repeated-use-of-weak -Wduplicate-method-match -Wno-missing-braces -Wparentheses -Wswitch -Wunused-function -Wno-unused-label -Wno-unused-parameter -Wunused-variable -Wunused-value -Wempty-body -Wuninitialized -Wconditional-uninitialized -Wno-unknown-pragmas -Wno-shadow -Wno-four-char-constants -Wno-conversion -Wconstant-conversion -Wint-conversion -Wbool-conversion -Wenum-conversion -Wno-float-conversion -Wno-non-literal-null-conversion -Wno-objc-literal-conversion -Wshorten-64-to-32 -Wpointer-sign -Wno-newline-eof -Wno-selector -Wno-strict-selector-match -Wundeclared-selector -Wno-deprecated-implementations -DNS_BLOCK_ASSERTIONS=1 -isysroot /Applications/Xcode.app/Contents/Developer/Platforms/iPhoneSimulator.platform/Developer/SDKs/iPhoneSimulator11.2.sdk -fasm-blocks -fstrict-aliasing -Wprotocol -Wdeprecated-declarations -mios-simulator-version-min=8.0 -fvisibility=hidden -Wno-sign-conversion -Wno-infinite-recursion -Wno-comma -Wno-block-capture-autoreleasing -Wno-strict-prototypes -fobjc-abi-version=2 -fobjc-legacy-dispatch -iquote /Users/mkucuk/Desktop/B4iBuildServer5/UploadedProjects/<user id>/build/B4iProject.build/Release-iphonesimulator/B4iProject.build/Citicon-generated-files.hmap -I/Users/mkucuk/Desktop/B4iBuildServer5/UploadedProjects/<user id>/build/B4iProject.build/Release-iphonesimulator/B4iProject.build/Citicon-own-target-headers.hmap -I/Users/mkucuk/Desktop/B4iBuildServer5/UploadedProjects/<user id>/build/B4iProject.build/Release-iphonesimulator/B4iProject.build/Citicon-all-target-headers.hmap -iquote /Users/mkucuk/Desktop/B4iBuildServer5/UploadedProjects/<user id>/build/B4iProject.build/Release-iphonesimulator/B4iProject.build/Citicon-project-headers.hmap -I/Users/mkucuk/Desktop/B4iBuildServer5/UploadedProjects/<user id>/Payload/include -I/Users/mkucuk/Desktop/B4iBuildServer5/UploadedProjects/<user id>/build/B4iProject.build/Release-iphonesimulator/B4iProject.build/DerivedSources/x86_64 -I/Users/mkucuk/Desktop/B4iBuildServer5/UploadedProjects/<user id>/build/B4iProject.build/Release-iphonesimulator/B4iProject.build/DerivedSources -F/Users/mkucuk/Desktop/B4iBuildServer5/UploadedProjects/<user id>/Payload -F../../Libs -MMD -MT dependencies -MF /Users/mkucuk/Desktop/B4iBuildServer5/UploadedProjects/<user id>/build/B4iProject.build/Release-iphonesimulator/B4iProject.build/Objects-normal/x86_64/b4i_imagedownloader.d --serialize-diagnostics /Users/mkucuk/Desktop/B4iBuildServer5/UploadedProjects/<user id>/build/B4iProject.build/Release-iphonesimulator/B4iProject.build/Objects-normal/x86_64/b4i_imagedownloader.dia -c /Users/mkucuk/Desktop/B4iBuildServer5/UploadedProjects/<user id>/B4iProject/b4i_imagedownloader.m -o /Users/mkucuk/Desktop/B4iBuildServer5/UploadedProjects/<user id>/build/B4iProject.build/Release-iphonesimulator/B4iProject.build/Objects-normal/x86_64/b4i_imagedownloader.o
In file included from /Users/mkucuk/Desktop/B4iBuildServer5/UploadedProjects/<user id>/B4iProject/b4i_imagedownloader.m:2:
/Users/mkucuk/Desktop/B4iBuildServer5/UploadedProjects/<user id>/B4iProject/b4i_imagedownloader.h:16:9: warning: non-portable path to file '"iHttp.h"'; specified path differs in case from file name on disk [-Wnonportable-include-path]
#import "ihttp.h"
        ^~~~~~~~~
        "iHttp.h"
In file included from /Users/mkucuk/Desktop/B4iBuildServer5/UploadedProjects/<user id>/B4iProject/b4i_imagedownloader.m:3:
/Users/mkucuk/Desktop/B4iBuildServer5/UploadedProjects/<user id>/B4iProject/b4i_main.h:16:9: warning: non-portable path to file '"iHttp.h"'; specified path differs in case from file name on disk [-Wnonportable-include-path]
#import "ihttp.h"
        ^~~~~~~~~
        "iHttp.h"
In file included from /Users/mkucuk/Desktop/B4iBuildServer5/UploadedProjects/<user id>/B4iProject/b4i_imagedownloader.m:4:
/Users/mkucuk/Desktop/B4iBuildServer5/UploadedProjects/<user id>/B4iProject/b4i_modshare.h:16:9: warning: non-portable path to file '"iHttp.h"'; specified path differs in case from file name on disk [-Wnonportable-include-path]
#import "ihttp.h"
        ^~~~~~~~~
        "iHttp.h"
In file included from /Users/mkucuk/Desktop/B4iBuildServer5/UploadedProjects/<user id>/B4iProject/b4i_imagedownloader.m:5:
/Users/mkucuk/Desktop/B4iBuildServer5/UploadedProjects/<user id>/B4iProject/b4i_statemanager.h:16:9: warning: non-portable path to file '"iHttp.h"'; specified path differs in case from file name on disk [-Wnonportable-include-path]
#import "ihttp.h"
        ^~~~~~~~~
        "iHttp.h"
4 warnings generated.

CompileC build/B4iProject.build/Release-iphonesimulator/B4iProject.build/Objects-normal/x86_64/LS_game2.o B4iProject/LS_game2.m normal x86_64 objective-c com.apple.compilers.llvm.clang.1_0.compiler
    cd /Users/mkucuk/Desktop/B4iBuildServer5/UploadedProjects/<user id>
    export LANG=en_US.US-ASCII
    export PATH="/Applications/Xcode.app/Contents/Developer/Platforms/iPhoneSimulator.platform/Developer/usr/bin:/Applications/Xcode.app/Contents/Developer/usr/bin:/usr/local/bin:/usr/bin:/bin:/usr/sbin:/sbin:/opt/X11/bin:/Library/Frameworks/Mono.framework/Versions/Current/Commands"
    /Applications/Xcode.app/Contents/Developer/Toolchains/XcodeDefault.xctoolchain/usr/bin/clang -x objective-c -arch x86_64 -fmessage-length=0 -fdiagnostics-show-note-include-stack -fmacro-backtrace-limit=0 -std=gnu99 -fobjc-arc -fmodules -gmodules -fmodules-prune-interval=86400 -fmodules-prune-after=345600 -fbuild-session-file=/var/folders/9p/k4nz5hks5p13wd729t2zc8rr0000gn/C/org.llvm.clang/ModuleCache/Session.modulevalidation -fmodules-validate-once-per-build-session -Wnon-modular-include-in-framework-module -Werror=non-modular-include-in-framework-module -Wno-trigraphs -fpascal-strings -O0 -Wno-missing-field-initializers -Wno-missing-prototypes -Werror=return-type -Wno-implicit-atomic-properties -Werror=deprecated-objc-isa-usage -Werror=objc-root-class -Wno-arc-repeated-use-of-weak -Wduplicate-method-match -Wno-missing-braces -Wparentheses -Wswitch -Wunused-function -Wno-unused-label -Wno-unused-parameter -Wunused-variable -Wunused-value -Wempty-body -Wuninitialized -Wconditional-uninitialized -Wno-unknown-pragmas -Wno-shadow -Wno-four-char-constants -Wno-conversion -Wconstant-conversion -Wint-conversion -Wbool-conversion -Wenum-conversion -Wno-float-conversion -Wno-non-literal-null-conversion -Wno-objc-literal-conversion -Wshorten-64-to-32 -Wpointer-sign -Wno-newline-eof -Wno-selector -Wno-strict-selector-match -Wundeclared-selector -Wno-deprecated-implementations -DNS_BLOCK_ASSERTIONS=1 -isysroot /Applications/Xcode.app/Contents/Developer/Platforms/iPhoneSimulator.platform/Developer/SDKs/iPhoneSimulator11.2.sdk -fasm-blocks -fstrict-aliasing -Wprotocol -Wdeprecated-declarations -mios-simulator-version-min=8.0 -fvisibility=hidden -Wno-sign-conversion -Wno-infinite-recursion -Wno-comma -Wno-block-capture-autoreleasing -Wno-strict-prototypes -fobjc-abi-version=2 -fobjc-legacy-dispatch -iquote /Users/mkucuk/Desktop/B4iBuildServer5/UploadedProjects/<user id>/build/B4iProject.build/Release-iphonesimulator/B4iProject.build/Citicon-generated-files.hmap -I/Users/mkucuk/Desktop/B4iBuildServer5/UploadedProjects/<user id>/build/B4iProject.build/Release-iphonesimulator/B4iProject.build/Citicon-own-target-headers.hmap -I/Users/mkucuk/Desktop/B4iBuildServer5/UploadedProjects/<user id>/build/B4iProject.build/Release-iphonesimulator/B4iProject.build/Citicon-all-target-headers.hmap -iquote /Users/mkucuk/Desktop/B4iBuildServer5/UploadedProjects/<user id>/build/B4iProject.build/Release-iphonesimulator/B4iProject.build/Citicon-project-headers.hmap -I/Users/mkucuk/Desktop/B4iBuildServer5/UploadedProjects/<user id>/Payload/include -I/Users/mkucuk/Desktop/B4iBuildServer5/UploadedProjects/<user id>/build/B4iProject.build/Release-iphonesimulator/B4iProject.build/DerivedSources/x86_64 -I/Users/mkucuk/Desktop/B4iBuildServer5/UploadedProjects/<user id>/build/B4iProject.build/Release-iphonesimulator/B4iProject.build/DerivedSources -F/Users/mkucuk/Desktop/B4iBuildServer5/UploadedProjects/<user id>/Payload -F../../Libs -MMD -MT dependencies -MF /Users/mkucuk/Desktop/B4iBuildServer5/UploadedProjects/<user id>/build/B4iProject.build/Release-iphonesimulator/B4iProject.build/Objects-normal/x86_64/LS_game2.d --serialize-diagnostics /Users/mkucuk/Desktop/B4iBuildServer5/UploadedProjects/<user id>/build/B4iProject.build/Release-iphonesimulator/B4iProject.build/Objects-normal/x86_64/LS_game2.dia -c /Users/mkucuk/Desktop/B4iBuildServer5/UploadedProjects/<user id>/B4iProject/LS_game2.m -o /Users/mkucuk/Desktop/B4iBuildServer5/UploadedProjects/<user id>/build/B4iProject.build/Release-iphonesimulator/B4iProject.build/Objects-normal/x86_64/LS_game2.o

CompileC build/B4iProject.build/Release-iphonesimulator/B4iProject.build/Objects-normal/x86_64/main.o B4iProject/main.m normal x86_64 objective-c com.apple.compilers.llvm.clang.1_0.compiler
    cd /Users/mkucuk/Desktop/B4iBuildServer5/UploadedProjects/<user id>
    export LANG=en_US.US-ASCII
    export PATH="/Applications/Xcode.app/Contents/Developer/Platforms/iPhoneSimulator.platform/Developer/usr/bin:/Applications/Xcode.app/Contents/Developer/usr/bin:/usr/local/bin:/usr/bin:/bin:/usr/sbin:/sbin:/opt/X11/bin:/Library/Frameworks/Mono.framework/Versions/Current/Commands"
    /Applications/Xcode.app/Contents/Developer/Toolchains/XcodeDefault.xctoolchain/usr/bin/clang -x objective-c -arch x86_64 -fmessage-length=0 -fdiagnostics-show-note-include-stack -fmacro-backtrace-limit=0 -std=gnu99 -fobjc-arc -fmodules -gmodules -fmodules-prune-interval=86400 -fmodules-prune-after=345600 -fbuild-session-file=/var/folders/9p/k4nz5hks5p13wd729t2zc8rr0000gn/C/org.llvm.clang/ModuleCache/Session.modulevalidation -fmodules-validate-once-per-build-session -Wnon-modular-include-in-framework-module -Werror=non-modular-include-in-framework-module -Wno-trigraphs -fpascal-strings -O0 -Wno-missing-field-initializers -Wno-missing-prototypes -Werror=return-type -Wno-implicit-atomic-properties -Werror=deprecated-objc-isa-usage -Werror=objc-root-class -Wno-arc-repeated-use-of-weak -Wduplicate-method-match -Wno-missing-braces -Wparentheses -Wswitch -Wunused-function -Wno-unused-label -Wno-unused-parameter -Wunused-variable -Wunused-value -Wempty-body -Wuninitialized -Wconditional-uninitialized -Wno-unknown-pragmas -Wno-shadow -Wno-four-char-constants -Wno-conversion -Wconstant-conversion -Wint-conversion -Wbool-conversion -Wenum-conversion -Wno-float-conversion -Wno-non-literal-null-conversion -Wno-objc-literal-conversion -Wshorten-64-to-32 -Wpointer-sign -Wno-newline-eof -Wno-selector -Wno-strict-selector-match -Wundeclared-selector -Wno-deprecated-implementations -DNS_BLOCK_ASSERTIONS=1 -isysroot /Applications/Xcode.app/Contents/Developer/Platforms/iPhoneSimulator.platform/Developer/SDKs/iPhoneSimulator11.2.sdk -fasm-blocks -fstrict-aliasing -Wprotocol -Wdeprecated-declarations -mios-simulator-version-min=8.0 -fvisibility=hidden -Wno-sign-conversion -Wno-infinite-recursion -Wno-comma -Wno-block-capture-autoreleasing -Wno-strict-prototypes -fobjc-abi-version=2 -fobjc-legacy-dispatch -iquote /Users/mkucuk/Desktop/B4iBuildServer5/UploadedProjects/<user id>/build/B4iProject.build/Release-iphonesimulator/B4iProject.build/Citicon-generated-files.hmap -I/Users/mkucuk/Desktop/B4iBuildServer5/UploadedProjects/<user id>/build/B4iProject.build/Release-iphonesimulator/B4iProject.build/Citicon-own-target-headers.hmap -I/Users/mkucuk/Desktop/B4iBuildServer5/UploadedProjects/<user id>/build/B4iProject.build/Release-iphonesimulator/B4iProject.build/Citicon-all-target-headers.hmap -iquote /Users/mkucuk/Desktop/B4iBuildServer5/UploadedProjects/<user id>/build/B4iProject.build/Release-iphonesimulator/B4iProject.build/Citicon-project-headers.hmap -I/Users/mkucuk/Desktop/B4iBuildServer5/UploadedProjects/<user id>/Payload/include -I/Users/mkucuk/Desktop/B4iBuildServer5/UploadedProjects/<user id>/build/B4iProject.build/Release-iphonesimulator/B4iProject.build/DerivedSources/x86_64 -I/Users/mkucuk/Desktop/B4iBuildServer5/UploadedProjects/<user id>/build/B4iProject.build/Release-iphonesimulator/B4iProject.build/DerivedSources -F/Users/mkucuk/Desktop/B4iBuildServer5/UploadedProjects/<user id>/Payload -F../../Libs -MMD -MT dependencies -MF /Users/mkucuk/Desktop/B4iBuildServer5/UploadedProjects/<user id>/build/B4iProject.build/Release-iphonesimulator/B4iProject.build/Objects-normal/x86_64/main.d --serialize-diagnostics /Users/mkucuk/Desktop/B4iBuildServer5/UploadedProjects/<user id>/build/B4iProject.build/Release-iphonesimulator/B4iProject.build/Objects-normal/x86_64/main.dia -c /Users/mkucuk/Desktop/B4iBuildServer5/UploadedProjects/<user id>/B4iProject/main.m -o /Users/mkucuk/Desktop/B4iBuildServer5/UploadedProjects/<user id>/build/B4iProject.build/Release-iphonesimulator/B4iProject.build/Objects-normal/x86_64/main.o

CompileC build/B4iProject.build/Release-iphonesimulator/B4iProject.build/Objects-normal/x86_64/LS_game.o B4iProject/LS_game.m normal x86_64 objective-c com.apple.compilers.llvm.clang.1_0.compiler
    cd /Users/mkucuk/Desktop/B4iBuildServer5/UploadedProjects/<user id>
    export LANG=en_US.US-ASCII
    export PATH="/Applications/Xcode.app/Contents/Developer/Platforms/iPhoneSimulator.platform/Developer/usr/bin:/Applications/Xcode.app/Contents/Developer/usr/bin:/usr/local/bin:/usr/bin:/bin:/usr/sbin:/sbin:/opt/X11/bin:/Library/Frameworks/Mono.framework/Versions/Current/Commands"
    /Applications/Xcode.app/Contents/Developer/Toolchains/XcodeDefault.xctoolchain/usr/bin/clang -x objective-c -arch x86_64 -fmessage-length=0 -fdiagnostics-show-note-include-stack -fmacro-backtrace-limit=0 -std=gnu99 -fobjc-arc -fmodules -gmodules -fmodules-prune-interval=86400 -fmodules-prune-after=345600 -fbuild-session-file=/var/folders/9p/k4nz5hks5p13wd729t2zc8rr0000gn/C/org.llvm.clang/ModuleCache/Session.modulevalidation -fmodules-validate-once-per-build-session -Wnon-modular-include-in-framework-module -Werror=non-modular-include-in-framework-module -Wno-trigraphs -fpascal-strings -O0 -Wno-missing-field-initializers -Wno-missing-prototypes -Werror=return-type -Wno-implicit-atomic-properties -Werror=deprecated-objc-isa-usage -Werror=objc-root-class -Wno-arc-repeated-use-of-weak -Wduplicate-method-match -Wno-missing-braces -Wparentheses -Wswitch -Wunused-function -Wno-unused-label -Wno-unused-parameter -Wunused-variable -Wunused-value -Wempty-body -Wuninitialized -Wconditional-uninitialized -Wno-unknown-pragmas -Wno-shadow -Wno-four-char-constants -Wno-conversion -Wconstant-conversion -Wint-conversion -Wbool-conversion -Wenum-conversion -Wno-float-conversion -Wno-non-literal-null-conversion -Wno-objc-literal-conversion -Wshorten-64-to-32 -Wpointer-sign -Wno-newline-eof -Wno-selector -Wno-strict-selector-match -Wundeclared-selector -Wno-deprecated-implementations -DNS_BLOCK_ASSERTIONS=1 -isysroot /Applications/Xcode.app/Contents/Developer/Platforms/iPhoneSimulator.platform/Developer/SDKs/iPhoneSimulator11.2.sdk -fasm-blocks -fstrict-aliasing -Wprotocol -Wdeprecated-declarations -mios-simulator-version-min=8.0 -fvisibility=hidden -Wno-sign-conversion -Wno-infinite-recursion -Wno-comma -Wno-block-capture-autoreleasing -Wno-strict-prototypes -fobjc-abi-version=2 -fobjc-legacy-dispatch -iquote /Users/mkucuk/Desktop/B4iBuildServer5/UploadedProjects/<user id>/build/B4iProject.build/Release-iphonesimulator/B4iProject.build/Citicon-generated-files.hmap -I/Users/mkucuk/Desktop/B4iBuildServer5/UploadedProjects/<user id>/build/B4iProject.build/Release-iphonesimulator/B4iProject.build/Citicon-own-target-headers.hmap -I/Users/mkucuk/Desktop/B4iBuildServer5/UploadedProjects/<user id>/build/B4iProject.build/Release-iphonesimulator/B4iProject.build/Citicon-all-target-headers.hmap -iquote /Users/mkucuk/Desktop/B4iBuildServer5/UploadedProjects/<user id>/build/B4iProject.build/Release-iphonesimulator/B4iProject.build/Citicon-project-headers.hmap -I/Users/mkucuk/Desktop/B4iBuildServer5/UploadedProjects/<user id>/Payload/include -I/Users/mkucuk/Desktop/B4iBuildServer5/UploadedProjects/<user id>/build/B4iProject.build/Release-iphonesimulator/B4iProject.build/DerivedSources/x86_64 -I/Users/mkucuk/Desktop/B4iBuildServer5/UploadedProjects/<user id>/build/B4iProject.build/Release-iphonesimulator/B4iProject.build/DerivedSources -F/Users/mkucuk/Desktop/B4iBuildServer5/UploadedProjects/<user id>/Payload -F../../Libs -MMD -MT dependencies -MF /Users/mkucuk/Desktop/B4iBuildServer5/UploadedProjects/<user id>/build/B4iProject.build/Release-iphonesimulator/B4iProject.build/Objects-normal/x86_64/LS_game.d --serialize-diagnostics /Users/mkucuk/Desktop/B4iBuildServer5/UploadedProjects/<user id>/build/B4iProject.build/Release-iphonesimulator/B4iProject.build/Objects-normal/x86_64/LS_game.dia -c /Users/mkucuk/Desktop/B4iBuildServer5/UploadedProjects/<user id>/B4iProject/LS_game.m -o /Users/mkucuk/Desktop/B4iBuildServer5/UploadedProjects/<user id>/build/B4iProject.build/Release-iphonesimulator/B4iProject.build/Objects-normal/x86_64/LS_game.o

CompileC build/B4iProject.build/Release-iphonesimulator/B4iProject.build/Objects-normal/x86_64/b4i_main.o B4iProject/b4i_main.m normal x86_64 objective-c com.apple.compilers.llvm.clang.1_0.compiler
    cd /Users/mkucuk/Desktop/B4iBuildServer5/UploadedProjects/<user id>
    export LANG=en_US.US-ASCII
    export PATH="/Applications/Xcode.app/Contents/Developer/Platforms/iPhoneSimulator.platform/Developer/usr/bin:/Applications/Xcode.app/Contents/Developer/usr/bin:/usr/local/bin:/usr/bin:/bin:/usr/sbin:/sbin:/opt/X11/bin:/Library/Frameworks/Mono.framework/Versions/Current/Commands"
    /Applications/Xcode.app/Contents/Developer/Toolchains/XcodeDefault.xctoolchain/usr/bin/clang -x objective-c -arch x86_64 -fmessage-length=0 -fdiagnostics-show-note-include-stack -fmacro-backtrace-limit=0 -std=gnu99 -fobjc-arc -fmodules -gmodules -fmodules-prune-interval=86400 -fmodules-prune-after=345600 -fbuild-session-file=/var/folders/9p/k4nz5hks5p13wd729t2zc8rr0000gn/C/org.llvm.clang/ModuleCache/Session.modulevalidation -fmodules-validate-once-per-build-session -Wnon-modular-include-in-framework-module -Werror=non-modular-include-in-framework-module -Wno-trigraphs -fpascal-strings -O0 -Wno-missing-field-initializers -Wno-missing-prototypes -Werror=return-type -Wno-implicit-atomic-properties -Werror=deprecated-objc-isa-usage -Werror=objc-root-class -Wno-arc-repeated-use-of-weak -Wduplicate-method-match -Wno-missing-braces -Wparentheses -Wswitch -Wunused-function -Wno-unused-label -Wno-unused-parameter -Wunused-variable -Wunused-value -Wempty-body -Wuninitialized -Wconditional-uninitialized -Wno-unknown-pragmas -Wno-shadow -Wno-four-char-constants -Wno-conversion -Wconstant-conversion -Wint-conversion -Wbool-conversion -Wenum-conversion -Wno-float-conversion -Wno-non-literal-null-conversion -Wno-objc-literal-conversion -Wshorten-64-to-32 -Wpointer-sign -Wno-newline-eof -Wno-selector -Wno-strict-selector-match -Wundeclared-selector -Wno-deprecated-implementations -DNS_BLOCK_ASSERTIONS=1 -isysroot /Applications/Xcode.app/Contents/Developer/Platforms/iPhoneSimulator.platform/Developer/SDKs/iPhoneSimulator11.2.sdk -fasm-blocks -fstrict-aliasing -Wprotocol -Wdeprecated-declarations -mios-simulator-version-min=8.0 -fvisibility=hidden -Wno-sign-conversion -Wno-infinite-recursion -Wno-comma -Wno-block-capture-autoreleasing -Wno-strict-prototypes -fobjc-abi-version=2 -fobjc-legacy-dispatch -iquote /Users/mkucuk/Desktop/B4iBuildServer5/UploadedProjects/<user id>/build/B4iProject.build/Release-iphonesimulator/B4iProject.build/Citicon-generated-files.hmap -I/Users/mkucuk/Desktop/B4iBuildServer5/UploadedProjects/<user id>/build/B4iProject.build/Release-iphonesimulator/B4iProject.build/Citicon-own-target-headers.hmap -I/Users/mkucuk/Desktop/B4iBuildServer5/UploadedProjects/<user id>/build/B4iProject.build/Release-iphonesimulator/B4iProject.build/Citicon-all-target-headers.hmap -iquote /Users/mkucuk/Desktop/B4iBuildServer5/UploadedProjects/<user id>/build/B4iProject.build/Release-iphonesimulator/B4iProject.build/Citicon-project-headers.hmap -I/Users/mkucuk/Desktop/B4iBuildServer5/UploadedProjects/<user id>/Payload/include -I/Users/mkucuk/Desktop/B4iBuildServer5/UploadedProjects/<user id>/build/B4iProject.build/Release-iphonesimulator/B4iProject.build/DerivedSources/x86_64 -I/Users/mkucuk/Desktop/B4iBuildServer5/UploadedProjects/<user id>/build/B4iProject.build/Release-iphonesimulator/B4iProject.build/DerivedSources -F/Users/mkucuk/Desktop/B4iBuildServer5/UploadedProjects/<user id>/Payload -F../../Libs -MMD -MT dependencies -MF /Users/mkucuk/Desktop/B4iBuildServer5/UploadedProjects/<user id>/build/B4iProject.build/Release-iphonesimulator/B4iProject.build/Objects-normal/x86_64/b4i_main.d --serialize-diagnostics /Users/mkucuk/Desktop/B4iBuildServer5/UploadedProjects/<user id>/build/B4iProject.build/Release-iphonesimulator/B4iProject.build/Objects-normal/x86_64/b4i_main.dia -c /Users/mkucuk/Desktop/B4iBuildServer5/UploadedProjects/<user id>/B4iProject/b4i_main.m -o /Users/mkucuk/Desktop/B4iBuildServer5/UploadedProjects/<user id>/build/B4iProject.build/Release-iphonesimulator/B4iProject.build/Objects-normal/x86_64/b4i_main.o
In file included from /Users/mkucuk/Desktop/B4iBuildServer5/UploadedProjects/<user id>/B4iProject/b4i_main.m:2:
/Users/mkucuk/Desktop/B4iBuildServer5/UploadedProjects/<user id>/B4iProject/b4i_main.h:16:9: warning: non-portable path to file '"iHttp.h"'; specified path differs in case from file name on disk [-Wnonportable-include-path]
#import "ihttp.h"
        ^~~~~~~~~
        "iHttp.h"
In file included from /Users/mkucuk/Desktop/B4iBuildServer5/UploadedProjects/<user id>/B4iProject/b4i_main.m:3:
/Users/mkucuk/Desktop/B4iBuildServer5/UploadedProjects/<user id>/B4iProject/b4i_imagedownloader.h:16:9: warning: non-portable path to file '"iHttp.h"'; specified path differs in case from file name on disk [-Wnonportable-include-path]
#import "ihttp.h"
        ^~~~~~~~~
        "iHttp.h"
In file included from /Users/mkucuk/Desktop/B4iBuildServer5/UploadedProjects/<user id>/B4iProject/b4i_main.m:4:
/Users/mkucuk/Desktop/B4iBuildServer5/UploadedProjects/<user id>/B4iProject/b4i_modshare.h:16:9: warning: non-portable path to file '"iHttp.h"'; specified path differs in case from file name on disk [-Wnonportable-include-path]
#import "ihttp.h"
        ^~~~~~~~~
        "iHttp.h"
In file included from /Users/mkucuk/Desktop/B4iBuildServer5/UploadedProjects/<user id>/B4iProject/b4i_main.m:5:
/Users/mkucuk/Desktop/B4iBuildServer5/UploadedProjects/<user id>/B4iProject/b4i_statemanager.h:16:9: warning: non-portable path to file '"iHttp.h"'; specified path differs in case from file name on disk [-Wnonportable-include-path]
#import "ihttp.h"
        ^~~~~~~~~
        "iHttp.h"
4 warnings generated.

Ld Payload/Citicon.app/Citicon normal x86_64
    cd /Users/mkucuk/Desktop/B4iBuildServer5/UploadedProjects/<user id>
    export IPHONEOS_DEPLOYMENT_TARGET=8.0
    export PATH="/Applications/Xcode.app/Contents/Developer/Platforms/iPhoneSimulator.platform/Developer/usr/bin:/Applications/Xcode.app/Contents/Developer/usr/bin:/usr/local/bin:/usr/bin:/bin:/usr/sbin:/sbin:/opt/X11/bin:/Library/Frameworks/Mono.framework/Versions/Current/Commands"
    /Applications/Xcode.app/Contents/Developer/Toolchains/XcodeDefault.xctoolchain/usr/bin/clang -arch x86_64 -isysroot /Applications/Xcode.app/Contents/Developer/Platforms/iPhoneSimulator.platform/Developer/SDKs/iPhoneSimulator11.2.sdk -L/Users/mkucuk/Desktop/B4iBuildServer5/UploadedProjects/<user id>/Payload -L../../Libs -F/Users/mkucuk/Desktop/B4iBuildServer5/UploadedProjects/<user id>/Payload -F../../Libs -filelist /Users/mkucuk/Desktop/B4iBuildServer5/UploadedProjects/<user id>/build/B4iProject.build/Release-iphonesimulator/B4iProject.build/Objects-normal/x86_64/Citicon.LinkFileList -Xlinker -rpath -Xlinker @executable_path/Frameworks -mios-simulator-version-min=8.0 -Xlinker -object_path_lto -Xlinker /Users/mkucuk/Desktop/B4iBuildServer5/UploadedProjects/<user id>/build/B4iProject.build/Release-iphonesimulator/B4iProject.build/Objects-normal/x86_64/Citicon_lto.o -Xlinker -no_deduplicate -Xlinker -objc_abi_version -Xlinker 2 -fobjc-arc -fobjc-link-runtime -ObjC -Xlinker -sectcreate -Xlinker __TEXT -Xlinker __entitlements -Xlinker /Users/mkucuk/Desktop/B4iBuildServer5/UploadedProjects/<user id>/build/B4iProject.build/Release-iphonesimulator/B4iProject.build/Citicon.app.xcent -lCore -framework Foundation -framework CoreGraphics -framework UIKit -liHttpUtils2 -liLoadingIndicatorView -liRandomAccessFile -liHUD -liAdMob -liStore -liFirebaseAnalytics -liFirebaseNotifications -liUI8 -liJSON -liAlertView -liMedia -liCallSubUtils -liStringUtils -framework AVFoundation -lihttp -lz -framework AudioToolbox -framework AdSupport -framework CoreGraphics -framework CoreTelephony -framework EventKit -framework EventKitUI -framework MessageUI -framework StoreKit -framework SystemConfiguration -framework CoreMedia -framework GoogleMobileAds -framework MediaPlayer -framework SafariServices -framework CoreBluetooth -framework MobileCoreServices -framework FirebaseAnalytics -framework FirebaseInstanceID -framework GoogleInterchangeUtilities -framework GoogleSymbolUtilities -framework GoogleUtilities -framework FirebaseMessaging -framework GoogleIPhoneUtilities -framework InMobiSDK -lAdapterInMobi -lsqlite3 -framework WebKit -liDebug2 -Xlinker -dependency_info -Xlinker /Users/mkucuk/Desktop/B4iBuildServer5/UploadedProjects/<user id>/build/B4iProject.build/Release-iphonesimulator/B4iProject.build/Objects-normal/x86_64/Citicon_dependency_info.dat -o /Users/mkucuk/Desktop/B4iBuildServer5/UploadedProjects/<user id>/Payload/Citicon.app/Citicon
ld: warning: ignoring file ../../Libs/libiLoadingIndicatorView.a, missing required architecture x86_64 in file ../../Libs/libiLoadingIndicatorView.a (3 slices)
ld: warning: ignoring file ../../Libs/libiAlertView.a, missing required architecture x86_64 in file ../../Libs/libiAlertView.a (3 slices)
ld: warning: object file (../../Libs/libiFirebaseAnalytics.a(iFirebaseAnalytics.o)) was built for newer iOS version (9.3) than being linked (8.0)
ld: warning: object file (../../Libs/libiFirebaseNotifications.a(iFirebaseNotifications.o)) was built for newer iOS version (9.3) than being linked (8.0)
Undefined symbols for architecture x86_64:
  "_OBJC_CLASS_$_iAlertView", referenced from:
      objc-class-ref in b4i_main.o
ld: symbol(s) not found for architecture x86_64
clang: error: linker command failed with exit code 1 (use -v to see invocation)


Error: ** BUILD FAILED **


The following build commands failed:
    Ld Payload/Citicon.app/Citicon normal x86_64
(1 failure)
 
Upvote 0
Top