iOS Question error in install on ios Simulator

Discussion in 'iOS Questions' started by omidaghakhani1368, Jul 5, 2015.

  1. omidaghakhani1368

    omidaghakhani1368 Well-Known Member Licensed User

    Hi.
    I connect to iOS designer and anything add to layout,show in ios simulator
    But when i want to compile project get below error:
    {i install xcode 6.4 and mac server version 2}

    I get error when run project on ios simulator state
    B4i version: 2.00 BETA 2
    Parsing code. (0.00s)
    Compiling code. (0.07s)
    Compiling layouts code. (0.00s)
    Compiling debugger engine code. (1.33s)
    Building Xcode project (0.01s)
    Sending data to remote compiler. Error
    Out: Build settings from command line:
    ARCHS = i386
    CODE_SIGNING_REQUIRED = NO
    CONFIGURATION_BUILD_DIR = /Users/omid/UploadedProjects/default/Payload
    PRODUCT_NAME = B4i Example
    SDKROOT = iphonesimulator8.2

    === BUILD TARGET B4iProject OF PROJECT B4iProject WITH CONFIGURATION Release ===

    Check dependencies

    Write auxiliary files
    /bin/mkdir -p /Users/omid/UploadedProjects/default/build/B4iProject.build/Release-iphonesimulator/B4iProject.build
    write-file /Users/omid/UploadedProjects/default/build/B4iProject.build/Release-iphonesimulator/B4iProject.build/B4i\ Example-all-target-headers.hmap
    write-file /Users/omid/UploadedProjects/default/build/B4iProject.build/Release-iphonesimulator/B4iProject.build/B4i\ Example-all-non-framework-target-headers.hmap
    write-file /Users/omid/UploadedProjects/default/build/B4iProject.build/Release-iphonesimulator/B4iProject.build/B4i\ Example-project-headers.hmap
    /bin/mkdir -p /Users/omid/UploadedProjects/default/build/B4iProject.build/Release-iphonesimulator/B4iProject.build/Objects-normal/i386
    write-file /Users/omid/UploadedProjects/default/build/B4iProject.build/Release-iphonesimulator/B4iProject.build/Objects-normal/i386/B4i\ Example.LinkFileList
    write-file /Users/omid/UploadedProjects/default/build/B4iProject.build/Release-iphonesimulator/B4iProject.build/B4i\ Example.hmap
    write-file /Users/omid/UploadedProjects/default/build/B4iProject.build/Release-iphonesimulator/B4iProject.build/B4i\ Example-generated-files.hmap
    write-file /Users/omid/UploadedProjects/default/build/B4iProject.build/Release-iphonesimulator/B4iProject.build/B4i\ Example-own-target-headers.hmap

    Create product structure
    /bin/mkdir -p /Users/omid/UploadedProjects/default/Payload/B4i\ Example.app

    ProcessInfoPlistFile Payload/B4i\ Example.app/Info.plist B4iProject/B4iProject-Info.plist
    cd /Users/omid/UploadedProjects/default
    export PATH="/Applications/Xcode.app/Contents/Developer/Platforms/iPhoneSimulator.platform/Developer/usr/bin:/Applications/Xcode.app/Contents/Developer/usr/bin:/usr/local/bin:/usr/bin:/bin:/usr/sbin:/sbin:/Users/omid/Documents/Software/eclipse/android-sdk-macosx/platform-tools"
    builtin-infoPlistUtility /Users/omid/UploadedProjects/default/B4iProject/B4iProject-Info.plist -genpkginfo /Users/omid/UploadedProjects/default/Payload/B4i\ Example.app/PkgInfo -expandbuildsettings -format binary -platform iphonesimulator -o /Users/omid/UploadedProjects/default/Payload/B4i\ Example.app/Info.plist

    CompileC build/B4iProject.build/Release-iphonesimulator/B4iProject.build/Objects-normal/i386/main.o B4iProject/main.m normal i386 objective-c com.apple.compilers.llvm.clang.1_0.compiler
    cd /Users/omid/UploadedProjects/default
    export LANG=en_US.US-ASCII
    export PATH="/Applications/Xcode.app/Contents/Developer/Platforms/iPhoneSimulator.platform/Developer/usr/bin:/Applications/Xcode.app/Contents/Developer/usr/bin:/usr/local/bin:/usr/bin:/bin:/usr/sbin:/sbin:/Users/omid/Documents/Software/eclipse/android-sdk-macosx/platform-tools"
    /Applications/Xcode.app/Contents/Developer/Toolchains/XcodeDefault.xctoolchain/usr/bin/clang -x objective-c -arch i386 -fmessage-length=0 -fdiagnostics-show-note-include-stack -fmacro-backtrace-limit=0 -std=gnu99 -fobjc-arc -fmodules -fmodules-prune-interval=86400 -fmodules-prune-after=345600 -Wnon-modular-include-in-framework-module -Werror=non-modular-include-in-framework-module -Wno-trigraphs -fpascal-strings -O0 -Wno-missing-field-initializers -Wno-missing-prototypes -Werror=return-type -Wno-implicit-atomic-properties -Werror=deprecated-objc-isa-usage -Werror=objc-root-class -Wno-receiver-is-weak -Wno-arc-repeated-use-of-weak -Wduplicate-method-match -Wno-missing-braces -Wparentheses -Wswitch -Wunused-function -Wno-unused-label -Wno-unused-parameter -Wunused-variable -Wunused-value -Wempty-body -Wconditional-uninitialized -Wno-unknown-pragmas -Wno-shadow -Wno-four-char-constants -Wno-conversion -Wconstant-conversion -Wint-conversion -Wbool-conversion -Wenum-conversion -Wshorten-64-to-32 -Wpointer-sign -Wno-newline-eof -Wno-selector -Wno-strict-selector-match -Wundeclared-selector -Wno-deprecated-implementations -DNS_BLOCK_ASSERTIONS=1 -isysroot /Applications/Xcode.app/Contents/Developer/Platforms/iPhoneSimulator.platform/Developer/SDKs/iPhoneSimulator8.2.sdk -fexceptions -fasm-blocks -fstrict-aliasing -Wprotocol -Wdeprecated-declarations -fvisibility=hidden -Wno-sign-conversion -fobjc-abi-version=2 -fobjc-legacy-dispatch -mios-simulator-version-min=7.0 -iquote /Users/omid/UploadedProjects/default/build/B4iProject.build/Release-iphonesimulator/B4iProject.build/B4i\ Example-generated-files.hmap -I/Users/omid/UploadedProjects/default/build/B4iProject.build/Release-iphonesimulator/B4iProject.build/B4i\ Example-own-target-headers.hmap -I/Users/omid/UploadedProjects/default/build/B4iProject.build/Release-iphonesimulator/B4iProject.build/B4i\ Example-all-target-headers.hmap -iquote /Users/omid/UploadedProjects/default/build/B4iProject.build/Release-iphonesimulator/B4iProject.build/B4i\ Example-project-headers.hmap -I/Users/omid/UploadedProjects/default/Payload/include -I/Applications/Xcode.app/Contents/Developer/Toolchains/XcodeDefault.xctoolchain/usr/include -I/Users/omid/UploadedProjects/default/build/B4iProject.build/Release-iphonesimulator/B4iProject.build/DerivedSources/i386 -I/Users/omid/UploadedProjects/default/build/B4iProject.build/Release-iphonesimulator/B4iProject.build/DerivedSources -F/Users/omid/UploadedProjects/default/Payload -F../../Libs -MMD -MT dependencies -MF /Users/omid/UploadedProjects/default/build/B4iProject.build/Release-iphonesimulator/B4iProject.build/Objects-normal/i386/main.d --serialize-diagnostics /Users/omid/UploadedProjects/default/build/B4iProject.build/Release-iphonesimulator/B4iProject.build/Objects-normal/i386/main.dia -c /Users/omid/UploadedProjects/default/B4iProject/main.m -o /Users/omid/UploadedProjects/default/build/B4iProject.build/Release-iphonesimulator/B4iProject.build/Objects-normal/i386/main.o
    /Users/omid/UploadedProjects/default/B4iProject/main.m:11:9: fatal error: 'iCore.h' file not found
    #import "iCore.h"
    ^
    1 error generated.

    CompileC build/B4iProject.build/Release-iphonesimulator/B4iProject.build/Objects-normal/i386/b4i_main.o B4iProject/b4i_main.m normal i386 objective-c com.apple.compilers.llvm.clang.1_0.compiler
    cd /Users/omid/UploadedProjects/default
    export LANG=en_US.US-ASCII
    export PATH="/Applications/Xcode.app/Contents/Developer/Platforms/iPhoneSimulator.platform/Developer/usr/bin:/Applications/Xcode.app/Contents/Developer/usr/bin:/usr/local/bin:/usr/bin:/bin:/usr/sbin:/sbin:/Users/omid/Documents/Software/eclipse/android-sdk-macosx/platform-tools"
    /Applications/Xcode.app/Contents/Developer/Toolchains/XcodeDefault.xctoolchain/usr/bin/clang -x objective-c -arch i386 -fmessage-length=0 -fdiagnostics-show-note-include-stack -fmacro-backtrace-limit=0 -std=gnu99 -fobjc-arc -fmodules -fmodules-prune-interval=86400 -fmodules-prune-after=345600 -Wnon-modular-include-in-framework-module -Werror=non-modular-include-in-framework-module -Wno-trigraphs -fpascal-strings -O0 -Wno-missing-field-initializers -Wno-missing-prototypes -Werror=return-type -Wno-implicit-atomic-properties -Werror=deprecated-objc-isa-usage -Werror=objc-root-class -Wno-receiver-is-weak -Wno-arc-repeated-use-of-weak -Wduplicate-method-match -Wno-missing-braces -Wparentheses -Wswitch -Wunused-function -Wno-unused-label -Wno-unused-parameter -Wunused-variable -Wunused-value -Wempty-body -Wconditional-uninitialized -Wno-unknown-pragmas -Wno-shadow -Wno-four-char-constants -Wno-conversion -Wconstant-conversion -Wint-conversion -Wbool-conversion -Wenum-conversion -Wshorten-64-to-32 -Wpointer-sign -Wno-newline-eof -Wno-selector -Wno-strict-selector-match -Wundeclared-selector -Wno-deprecated-implementations -DNS_BLOCK_ASSERTIONS=1 -isysroot /Applications/Xcode.app/Contents/Developer/Platforms/iPhoneSimulator.platform/Developer/SDKs/iPhoneSimulator8.2.sdk -fexceptions -fasm-blocks -fstrict-aliasing -Wprotocol -Wdeprecated-declarations -fvisibility=hidden -Wno-sign-conversion -fobjc-abi-version=2 -fobjc-legacy-dispatch -mios-simulator-version-min=7.0 -iquote /Users/omid/UploadedProjects/default/build/B4iProject.build/Release-iphonesimulator/B4iProject.build/B4i\ Example-generated-files.hmap -I/Users/omid/UploadedProjects/default/build/B4iProject.build/Release-iphonesimulator/B4iProject.build/B4i\ Example-own-target-headers.hmap -I/Users/omid/UploadedProjects/default/build/B4iProject.build/Release-iphonesimulator/B4iProject.build/B4i\ Example-all-target-headers.hmap -iquote /Users/omid/UploadedProjects/default/build/B4iProject.build/Release-iphonesimulator/B4iProject.build/B4i\ Example-project-headers.hmap -I/Users/omid/UploadedProjects/default/Payload/include -I/Applications/Xcode.app/Contents/Developer/Toolchains/XcodeDefault.xctoolchain/usr/include -I/Users/omid/UploadedProjects/default/build/B4iProject.build/Release-iphonesimulator/B4iProject.build/DerivedSources/i386 -I/Users/omid/UploadedProjects/default/build/B4iProject.build/Release-iphonesimulator/B4iProject.build/DerivedSources -F/Users/omid/UploadedProjects/default/Payload -F../../Libs -MMD -MT dependencies -MF /Users/omid/UploadedProjects/default/build/B4iProject.build/Release-iphonesimulator/B4iProject.build/Objects-normal/i386/b4i_main.d --serialize-diagnostics /Users/omid/UploadedProjects/default/build/B4iProject.build/Release-iphonesimulator/B4iProject.build/Objects-normal/i386/b4i_main.dia -c /Users/omid/UploadedProjects/default/B4iProject/b4i_main.m -o /Users/omid/UploadedProjects/default/build/B4iProject.build/Release-iphonesimulator/B4iProject.build/Objects-normal/i386/b4i_main.o
    In file included from /Users/omid/UploadedProjects/default/B4iProject/b4i_main.m:2:
    /Users/omid/UploadedProjects/default/B4iProject/b4i_main.h:1:9: fatal error: 'iCore.h' file not found
    #import "iCore.h"
    ^
    1 error generated.


    Error: ** BUILD FAILED **


    The following build commands failed:
    CompileC build/B4iProject.build/Release-iphonesimulator/B4iProject.build/Objects-normal/i386/main.o B4iProject/main.m normal i386 objective-c com.apple.compilers.llvm.clang.1_0.compiler
    CompileC build/B4iProject.build/Release-iphonesimulator/B4iProject.build/Objects-normal/i386/b4i_main.o B4iProject/b4i_main.m normal i386 objective-c com.apple.compilers.llvm.clang.1_0.compiler
    (2 failures)
     
  2. Erel

    Erel Administrator Staff Member Licensed User

    Based on the error message you haven't copied the files from the Libs folder (in the zip file) to the builder Libs folder.
     
  3. omidaghakhani1368

    omidaghakhani1368 Well-Known Member Licensed User

    Which Zip file?You send me macserver2 and b4i v2
     
  4. omidaghakhani1368

    omidaghakhani1368 Well-Known Member Licensed User

    Can you send me zip file?
     
  5. Erel

    Erel Administrator Staff Member Licensed User

    The libraries are included in the mac server zip file.
     
  6. omidaghakhani1368

    omidaghakhani1368 Well-Known Member Licensed User

    It solved.I copied file to mac lib but not select overwrite.thank you erel
     
Loading...
  1. This site uses cookies to help personalise content, tailor your experience and to keep you logged in if you register.
    By continuing to use this site, you are consenting to our use of cookies.
    Dismiss Notice