iOS Question Error when running debug with local builder

Keith Yong

Active Member
Licensed User
I got this error message when compile with local builder


B4X:
B4i version: 4.00
Parsing code.    (0.32s)
Compiling code.    (0.40s)
Compiling layouts code.    (0.00s)
Compiling debugger engine code.    (1.84s)
Building Xcode project    (0.10s)
Sending data to remote compiler.    Error
Out: Build settings from command line:
    ARCHS = i386
    CODE_SIGNING_REQUIRED = NO
    CONFIGURATION_BUILD_DIR = /Users/Keith/Documents/macserver/UploadedProjects/<user id>/Payload
    PRODUCT_NAME = goGolf
    SDKROOT = iphonesimulator10.3

=== BUILD TARGET B4iProject OF PROJECT B4iProject WITH CONFIGURATION Release ===

Check dependencies

Create product structure
/bin/mkdir -p /Users/Keith/Documents/macserver/UploadedProjects/<user id>/Payload/goGolf.app

ProcessInfoPlistFile Payload/goGolf.app/Info.plist B4iProject/B4iProject-Info.plist
    cd /Users/Keith/Documents/macserver/UploadedProjects/<user id>
    export PATH="/Applications/Xcode.app/Contents/Developer/Platforms/iPhoneSimulator.platform/Developer/usr/bin:/Applications/Xcode.app/Contents/Developer/usr/bin:/usr/local/bin:/usr/bin:/bin:/usr/sbin:/sbin"
    builtin-infoPlistUtility /Users/Keith/Documents/macserver/UploadedProjects/<user id>/B4iProject/B4iProject-Info.plist -genpkginfo /Users/Keith/Documents/macserver/UploadedProjects/<user id>/Payload/goGolf.app/PkgInfo -expandbuildsettings -format binary -platform iphonesimulator -o /Users/Keith/Documents/macserver/UploadedProjects/<user id>/Payload/goGolf.app/Info.plist

CompileC build/B4iProject.build/Release-iphonesimulator/B4iProject.build/Objects-normal/i386/main.o B4iProject/main.m normal i386 objective-c com.apple.compilers.llvm.clang.1_0.compiler
    cd /Users/Keith/Documents/macserver/UploadedProjects/<user id>
    export LANG=en_US.US-ASCII
    export PATH="/Applications/Xcode.app/Contents/Developer/Platforms/iPhoneSimulator.platform/Developer/usr/bin:/Applications/Xcode.app/Contents/Developer/usr/bin:/usr/local/bin:/usr/bin:/bin:/usr/sbin:/sbin"
    /Applications/Xcode.app/Contents/Developer/Toolchains/XcodeDefault.xctoolchain/usr/bin/clang -x objective-c -arch i386 -fmessage-length=0 -fdiagnostics-show-note-include-stack -fmacro-backtrace-limit=0 -std=gnu99 -fobjc-arc -fmodules -gmodules -fmodules-prune-interval=86400 -fmodules-prune-after=345600 -fbuild-session-file=/var/folders/mw/zf5ysbj56438692_3rmvwq780000gn/C/org.llvm.clang/ModuleCache/Session.modulevalidation -fmodules-validate-once-per-build-session -Wnon-modular-include-in-framework-module -Werror=non-modular-include-in-framework-module -Wno-trigraphs -fpascal-strings -O0 -Wno-missing-field-initializers -Wno-missing-prototypes -Werror=return-type -Wno-implicit-atomic-properties -Werror=deprecated-objc-isa-usage -Werror=objc-root-class -Wno-arc-repeated-use-of-weak -Wduplicate-method-match -Wno-missing-braces -Wparentheses -Wswitch -Wunused-function -Wno-unused-label -Wno-unused-parameter -Wunused-variable -Wunused-value -Wempty-body -Wuninitialized -Wconditional-uninitialized -Wno-unknown-pragmas -Wno-shadow -Wno-four-char-constants -Wno-conversion -Wconstant-conversion -Wint-conversion -Wbool-conversion -Wenum-conversion -Wshorten-64-to-32 -Wpointer-sign -Wno-newline-eof -Wno-selector -Wno-strict-selector-match -Wundeclared-selector -Wno-deprecated-implementations -DNS_BLOCK_ASSERTIONS=1 -isysroot /Applications/Xcode.app/Contents/Developer/Platforms/iPhoneSimulator.platform/Developer/SDKs/iPhoneSimulator10.3.sdk -fasm-blocks -fstrict-aliasing -Wprotocol -Wdeprecated-declarations -mios-simulator-version-min=8.0 -fvisibility=hidden -Wno-sign-conversion -Wno-infinite-recursion -fobjc-abi-version=2 -fobjc-legacy-dispatch -iquote /Users/Keith/Documents/macserver/UploadedProjects/<user id>/build/B4iProject.build/Release-iphonesimulator/B4iProject.build/goGolf-generated-files.hmap -I/Users/Keith/Documents/macserver/UploadedProjects/<user id>/build/B4iProject.build/Release-iphonesimulator/B4iProject.build/goGolf-own-target-headers.hmap -I/Users/Keith/Documents/macserver/UploadedProjects/<user id>/build/B4iProject.build/Release-iphonesimulator/B4iProject.build/goGolf-all-target-headers.hmap -iquote /Users/Keith/Documents/macserver/UploadedProjects/<user id>/build/B4iProject.build/Release-iphonesimulator/B4iProject.build/goGolf-project-headers.hmap -I/Users/Keith/Documents/macserver/UploadedProjects/<user id>/Payload/include -I/Users/Keith/Documents/macserver/UploadedProjects/<user id>/build/B4iProject.build/Release-iphonesimulator/B4iProject.build/DerivedSources/i386 -I/Users/Keith/Documents/macserver/UploadedProjects/<user id>/build/B4iProject.build/Release-iphonesimulator/B4iProject.build/DerivedSources -F/Users/Keith/Documents/macserver/UploadedProjects/<user id>/Payload -F../../Libs -MMD -MT dependencies -MF /Users/Keith/Documents/macserver/UploadedProjects/<user id>/build/B4iProject.build/Release-iphonesimulator/B4iProject.build/Objects-normal/i386/main.d --serialize-diagnostics /Users/Keith/Documents/macserver/UploadedProjects/<user id>/build/B4iProject.build/Release-iphonesimulator/B4iProject.build/Objects-normal/i386/main.dia -c /Users/Keith/Documents/macserver/UploadedProjects/<user id>/B4iProject/main.m -o /Users/Keith/Documents/macserver/UploadedProjects/<user id>/build/B4iProject.build/Release-iphonesimulator/B4iProject.build/Objects-normal/i386/main.o

CompileC build/B4iProject.build/Release-iphonesimulator/B4iProject.build/Objects-normal/i386/b4i_callsubutils.o B4iProject/b4i_callsubutils.m normal i386 objective-c com.apple.compilers.llvm.clang.1_0.compiler
    cd /Users/Keith/Documents/macserver/UploadedProjects/<user id>
    export LANG=en_US.US-ASCII
    export PATH="/Applications/Xcode.app/Contents/Developer/Platforms/iPhoneSimulator.platform/Developer/usr/bin:/Applications/Xcode.app/Contents/Developer/usr/bin:/usr/local/bin:/usr/bin:/bin:/usr/sbin:/sbin"
    /Applications/Xcode.app/Contents/Developer/Toolchains/XcodeDefault.xctoolchain/usr/bin/clang -x objective-c -arch i386 -fmessage-length=0 -fdiagnostics-show-note-include-stack -fmacro-backtrace-limit=0 -std=gnu99 -fobjc-arc -fmodules -gmodules -fmodules-prune-interval=86400 -fmodules-prune-after=345600 -fbuild-session-file=/var/folders/mw/zf5ysbj56438692_3rmvwq780000gn/C/org.llvm.clang/ModuleCache/Session.modulevalidation -fmodules-validate-once-per-build-session -Wnon-modular-include-in-framework-module -Werror=non-modular-include-in-framework-module -Wno-trigraphs -fpascal-strings -O0 -Wno-missing-field-initializers -Wno-missing-prototypes -Werror=return-type -Wno-implicit-atomic-properties -Werror=deprecated-objc-isa-usage -Werror=objc-root-class -Wno-arc-repeated-use-of-weak -Wduplicate-method-match -Wno-missing-braces -Wparentheses -Wswitch -Wunused-function -Wno-unused-label -Wno-unused-parameter -Wunused-variable -Wunused-value -Wempty-body -Wuninitialized -Wconditional-uninitialized -Wno-unknown-pragmas -Wno-shadow -Wno-four-char-constants -Wno-conversion -Wconstant-conversion -Wint-conversion -Wbool-conversion -Wenum-conversion -Wshorten-64-to-32 -Wpointer-sign -Wno-newline-eof -Wno-selector -Wno-strict-selector-match -Wundeclared-selector -Wno-deprecated-implementations -DNS_BLOCK_ASSERTIONS=1 -isysroot /Applications/Xcode.app/Contents/Developer/Platforms/iPhoneSimulator.platform/Developer/SDKs/iPhoneSimulator10.3.sdk -fasm-blocks -fstrict-aliasing -Wprotocol -Wdeprecated-declarations -mios-simulator-version-min=8.0 -fvisibility=hidden -Wno-sign-conversion -Wno-infinite-recursion -fobjc-abi-version=2 -fobjc-legacy-dispatch -iquote /Users/Keith/Documents/macserver/UploadedProjects/<user id>/build/B4iProject.build/Release-iphonesimulator/B4iProject.build/goGolf-generated-files.hmap -I/Users/Keith/Documents/macserver/UploadedProjects/<user id>/build/B4iProject.build/Release-iphonesimulator/B4iProject.build/goGolf-own-target-headers.hmap -I/Users/Keith/Documents/macserver/UploadedProjects/<user id>/build/B4iProject.build/Release-iphonesimulator/B4iProject.build/goGolf-all-target-headers.hmap -iquote /Users/Keith/Documents/macserver/UploadedProjects/<user id>/build/B4iProject.build/Release-iphonesimulator/B4iProject.build/goGolf-project-headers.hmap -I/Users/Keith/Documents/macserver/UploadedProjects/<user id>/Payload/include -I/Users/Keith/Documents/macserver/UploadedProjects/<user id>/build/B4iProject.build/Release-iphonesimulator/B4iProject.build/DerivedSources/i386 -I/Users/Keith/Documents/macserver/UploadedProjects/<user id>/build/B4iProject.build/Release-iphonesimulator/B4iProject.build/DerivedSources -F/Users/Keith/Documents/macserver/UploadedProjects/<user id>/Payload -F../../Libs -MMD -MT dependencies -MF /Users/Keith/Documents/macserver/UploadedProjects/<user id>/build/B4iProject.build/Release-iphonesimulator/B4iProject.build/Objects-normal/i386/b4i_callsubutils.d --serialize-diagnostics /Users/Keith/Documents/macserver/UploadedProjects/<user id>/build/B4iProject.build/Release-iphonesimulator/B4iProject.build/Objects-normal/i386/b4i_callsubutils.dia -c /Users/Keith/Documents/macserver/UploadedProjects/<user id>/B4iProject/b4i_callsubutils.m -o /Users/Keith/Documents/macserver/UploadedProjects/<user id>/build/B4iProject.build/Release-iphonesimulator/B4iProject.build/Objects-normal/i386/b4i_callsubutils.o
In file included from /Users/Keith/Documents/macserver/UploadedProjects/<user id>/B4iProject/b4i_callsubutils.m:2:
In file included from /Users/Keith/Documents/macserver/UploadedProjects/<user id>/B4iProject/b4i_callsubutils.h:12:
/Users/Keith/Documents/macserver/Libs/iFacebook.h:3:9: fatal error: 'FBSDKCoreKit/FBSDKCoreKit.h' file not found
#import <FBSDKCoreKit/FBSDKCoreKit.h>
        ^
1 error generated.

CompileC build/B4iProject.build/Release-iphonesimulator/B4iProject.build/Objects-normal/i386/b4i_anotherdatepicker.o B4iProject/b4i_anotherdatepicker.m normal i386 objective-c com.apple.compilers.llvm.clang.1_0.compiler
    cd /Users/Keith/Documents/macserver/UploadedProjects/<user id>
    export LANG=en_US.US-ASCII
    export PATH="/Applications/Xcode.app/Contents/Developer/Platforms/iPhoneSimulator.platform/Developer/usr/bin:/Applications/Xcode.app/Contents/Developer/usr/bin:/usr/local/bin:/usr/bin:/bin:/usr/sbin:/sbin"
    /Applications/Xcode.app/Contents/Developer/Toolchains/XcodeDefault.xctoolchain/usr/bin/clang -x objective-c -arch i386 -fmessage-length=0 -fdiagnostics-show-note-include-stack -fmacro-backtrace-limit=0 -std=gnu99 -fobjc-arc -fmodules -gmodules -fmodules-prune-interval=86400 -fmodules-prune-after=345600 -fbuild-session-file=/var/folders/mw/zf5ysbj56438692_3rmvwq780000gn/C/org.llvm.clang/ModuleCache/Session.modulevalidation -fmodules-validate-once-per-build-session -Wnon-modular-include-in-framework-module -Werror=non-modular-include-in-framework-module -Wno-trigraphs -fpascal-strings -O0 -Wno-missing-field-initializers -Wno-missing-prototypes -Werror=return-type -Wno-implicit-atomic-properties -Werror=deprecated-objc-isa-usage -Werror=objc-root-class -Wno-arc-repeated-use-of-weak -Wduplicate-method-match -Wno-missing-braces -Wparentheses -Wswitch -Wunused-function -Wno-unused-label -Wno-unused-parameter -Wunused-variable -Wunused-value -Wempty-body -Wuninitialized -Wconditional-uninitialized -Wno-unknown-pragmas -Wno-shadow -Wno-four-char-constants -Wno-conversion -Wconstant-conversion -Wint-conversion -Wbool-conversion -Wenum-conversion -Wshorten-64-to-32 -Wpointer-sign -Wno-newline-eof -Wno-selector -Wno-strict-selector-match -Wundeclared-selector -Wno-deprecated-implementations -DNS_BLOCK_ASSERTIONS=1 -isysroot /Applications/Xcode.app/Contents/Developer/Platforms/iPhoneSimulator.platform/Developer/SDKs/iPhoneSimulator10.3.sdk -fasm-blocks -fstrict-aliasing -Wprotocol -Wdeprecated-declarations -mios-simulator-version-min=8.0 -fvisibility=hidden -Wno-sign-conversion -Wno-infinite-recursion -fobjc-abi-version=2 -fobjc-legacy-dispatch -iquote /Users/Keith/Documents/macserver/UploadedProjects/<user id>/build/B4iProject.build/Release-iphonesimulator/B4iProject.build/goGolf-generated-files.hmap -I/Users/Keith/Documents/macserver/UploadedProjects/<user id>/build/B4iProject.build/Release-iphonesimulator/B4iProject.build/goGolf-own-target-headers.hmap -I/Users/Keith/Documents/macserver/UploadedProjects/<user id>/build/B4iProject.build/Release-iphonesimulator/B4iProject.build/goGolf-all-target-headers.hmap -iquote /Users/Keith/Documents/macserver/UploadedProjects/<user id>/build/B4iProject.build/Release-iphonesimulator/B4iProject.build/goGolf-project-headers.hmap -I/Users/Keith/Documents/macserver/UploadedProjects/<user id>/Payload/include -I/Users/Keith/Documents/macserver/UploadedProjects/<user id>/build/B4iProject.build/Release-iphonesimulator/B4iProject.build/DerivedSources/i386 -I/Users/Keith/Documents/macserver/UploadedProjects/<user id>/build/B4iProject.build/Release-iphonesimulator/B4iProject.build/DerivedSources -F/Users/Keith/Documents/macserver/UploadedProjects/<user id>/Payload -F../../Libs -MMD -MT dependencies -MF /Users/Keith/Documents/macserver/UploadedProjects/<user id>/build/B4iProject.build/Release-iphonesimulator/B4iProject.build/Objects-normal/i386/b4i_anotherdatepicker.d --serialize-diagnostics /Users/Keith/Documents/macserver/UploadedProjects/<user id>/build/B4iProject.build/Release-iphonesimulator/B4iProject.build/Objects-normal/i386/b4i_anotherdatepicker.dia -c /Users/Keith/Documents/macserver/UploadedProjects/<user id>/B4iProject/b4i_anotherdatepicker.m -o /Users/Keith/Documents/macserver/UploadedProjects/<user id>/build/B4iProject.build/Release-iphonesimulator/B4iProject.build/Objects-normal/i386/b4i_anotherdatepicker.o
In file included from /Users/Keith/Documents/macserver/UploadedProjects/<user id>/B4iProject/b4i_anotherdatepicker.m:2:
In file included from /Users/Keith/Documents/macserver/UploadedProjects/<user id>/B4iProject/b4i_anotherdatepicker.h:12:
/Users/Keith/Documents/macserver/Libs/iFacebook.h:3:9: fatal error: 'FBSDKCoreKit/FBSDKCoreKit.h' file not found
#import <FBSDKCoreKit/FBSDKCoreKit.h>
        ^
1 error generated.

CompileC build/B4iProject.build/Release-iphonesimulator/B4iProject.build/Objects-normal/i386/b4i_clsbooking.o B4iProject/b4i_clsbooking.m normal i386 objective-c com.apple.compilers.llvm.clang.1_0.compiler
    cd /Users/Keith/Documents/macserver/UploadedProjects/<user id>
    export LANG=en_US.US-ASCII
    export PATH="/Applications/Xcode.app/Contents/Developer/Platforms/iPhoneSimulator.platform/Developer/usr/bin:/Applications/Xcode.app/Contents/Developer/usr/bin:/usr/local/bin:/usr/bin:/bin:/usr/sbin:/sbin"
    /Applications/Xcode.app/Contents/Developer/Toolchains/XcodeDefault.xctoolchain/usr/bin/clang -x objective-c -arch i386 -fmessage-length=0 -fdiagnostics-show-note-include-stack -fmacro-backtrace-limit=0 -std=gnu99 -fobjc-arc -fmodules -gmodules -fmodules-prune-interval=86400 -fmodules-prune-after=345600 -fbuild-session-file=/var/folders/mw/zf5ysbj56438692_3rmvwq780000gn/C/org.llvm.clang/ModuleCache/Session.modulevalidation -fmodules-validate-once-per-build-session -Wnon-modular-include-in-framework-module -Werror=non-modular-include-in-framework-module -Wno-trigraphs -fpascal-strings -O0 -Wno-missing-field-initializers -Wno-missing-prototypes -Werror=return-type -Wno-implicit-atomic-properties -Werror=deprecated-objc-isa-usage -Werror=objc-root-class -Wno-arc-repeated-use-of-weak -Wduplicate-method-match -Wno-missing-braces -Wparentheses -Wswitch -Wunused-function -Wno-unused-label -Wno-unused-parameter -Wunused-variable -Wunused-value -Wempty-body -Wuninitialized -Wconditional-uninitialized -Wno-unknown-pragmas -Wno-shadow -Wno-four-char-constants -Wno-conversion -Wconstant-conversion -Wint-conversion -Wbool-conversion -Wenum-conversion -Wshorten-64-to-32 -Wpointer-sign -Wno-newline-eof -Wno-selector -Wno-strict-selector-match -Wundeclared-selector -Wno-deprecated-implementations -DNS_BLOCK_ASSERTIONS=1 -isysroot /Applications/Xcode.app/Contents/Developer/Platforms/iPhoneSimulator.platform/Developer/SDKs/iPhoneSimulator10.3.sdk -fasm-blocks -fstrict-aliasing -Wprotocol -Wdeprecated-declarations -mios-simulator-version-min=8.0 -fvisibility=hidden -Wno-sign-conversion -Wno-infinite-recursion -fobjc-abi-version=2 -fobjc-legacy-dispatch -iquote /Users/Keith/Documents/macserver/UploadedProjects/<user id>/build/B4iProject.build/Release-iphonesimulator/B4iProject.build/goGolf-generated-files.hmap -I/Users/Keith/Documents/macserver/UploadedProjects/<user id>/build/B4iProject.build/Release-iphonesimulator/B4iProject.build/goGolf-own-target-headers.hmap -I/Users/Keith/Documents/macserver/UploadedProjects/<user id>/build/B4iProject.build/Release-iphonesimulator/B4iProject.build/goGolf-all-target-headers.hmap -iquote /Users/Keith/Documents/macserver/UploadedProjects/<user id>/build/B4iProject.build/Release-iphonesimulator/B4iProject.build/goGolf-project-headers.hmap -I/Users/Keith/Documents/macserver/UploadedProjects/<user id>/Payload/include -I/Users/Keith/Documents/macserver/UploadedProjects/<user id>/build/B4iProject.build/Release-iphonesimulator/B4iProject.build/DerivedSources/i386 -I/Users/Keith/Documents/macserver/UploadedProjects/<user id>/build/B4iProject.build/Release-iphonesimulator/B4iProject.build/DerivedSources -F/Users/Keith/Documents/macserver/UploadedProjects/<user id>/Payload -F../../Libs -MMD -MT dependencies -MF /Users/Keith/Documents/macserver/UploadedProjects/<user id>/build/B4iProject.build/Release-iphonesimulator/B4iProject.build/Objects-normal/i386/b4i_clsbooking.d --serialize-diagnostics /Users/Keith/Documents/macserver/UploadedProjects/<user id>/build/B4iProject.build/Release-iphonesimulator/B4iProject.build/Objects-normal/i386/b4i_clsbooking.dia -c /Users/Keith/Documents/macserver/UploadedProjects/<user id>/B4iProject/b4i_clsbooking.m -o /Users/Keith/Documents/macserver/UploadedProjects/<user id>/build/B4iProject.build/Release-iphonesimulator/B4iProject.build/Objects-normal/i386/b4i_clsbooking.o
In file included from /Users/Keith/Documents/macserver/UploadedProjects/<user id>/B4iProject/b4i_clsbooking.m:2:
In file included from /Users/Keith/Documents/macserver/UploadedProjects/<user id>/B4iProject/b4i_clsbooking.h:12:
/Users/Keith/Documents/macserver/Libs/iFacebook.h:3:9: fatal error: 'FBSDKCoreKit/FBSDKCoreKit.h' file not found
#import <FBSDKCoreKit/FBSDKCoreKit.h>
        ^
1 error generated.


Error: ** BUILD FAILED **


The following build commands failed:
    CompileC build/B4iProject.build/Release-iphonesimulator/B4iProject.build/Objects-normal/i386/b4i_callsubutils.o B4iProject/b4i_callsubutils.m normal i386 objective-c com.apple.compilers.llvm.clang.1_0.compiler
    CompileC build/B4iProject.build/Release-iphonesimulator/B4iProject.build/Objects-normal/i386/b4i_anotherdatepicker.o B4iProject/b4i_anotherdatepicker.m normal i386 objective-c com.apple.compilers.llvm.clang.1_0.compiler
    CompileC build/B4iProject.build/Release-iphonesimulator/B4iProject.build/Objects-normal/i386/b4i_clsbooking.o B4iProject/b4i_clsbooking.m normal i386 objective-c com.apple.compilers.llvm.clang.1_0.compiler
(3 failures)
 
Top