iOS Question Local Mac Builder error

Similar threads

B4i Question Merging OBJC code
B4i Question Firebase error
B4i Question XCode 11 error
B4i Question compilation error with version b4i 6.5
B4i Question Error Build Release App
B4i Question TableView Local Mac Error

hanyelmehy

Active Member
Licensed User
i use Local Mac Builder
i am able to test http://myip:51041/test
when try to compile i get this error
B4X:
note: Using new build system
note: Planning build
note: Constructing build description
Build system information
warning: The iOS deployment target is set to 7.0, but the range of supported deployment target versions for this platform is 8.0 to 12.1. (in target 'B4iProject')

CreateBuildDirectory /Users/hany/Documents/B4iBuildServer53/UploadedProjects/<user id>/build (in target: B4iProject)
    cd /Users/hany/Documents/B4iBuildServer53/UploadedProjects/<user id>
    builtin-create-build-directory /Users/hany/Documents/B4iBuildServer53/UploadedProjects/<user id>/build

MkDir /Users/hany/Documents/B4iBuildServer53/UploadedProjects/<user id>/Payload/mushafalmoalem.app (in target: B4iProject)
    cd /Users/hany/Documents/B4iBuildServer53/UploadedProjects/<user id>
    /bin/mkdir -p /Users/hany/Documents/B4iBuildServer53/UploadedProjects/<user id>/Payload/mushafalmoalem.app

WriteAuxiliaryFile /Users/hany/Documents/B4iBuildServer53/UploadedProjects/<user id>/build/B4iProject.build/Release-iphoneos/B4iProject.build/DerivedSources/Entitlements.plist (in target: B4iProject)
    cd /Users/hany/Documents/B4iBuildServer53/UploadedProjects/<user id>
    write-file /Users/hany/Documents/B4iBuildServer53/UploadedProjects/<user id>/build/B4iProject.build/Release-iphoneos/B4iProject.build/DerivedSources/Entitlements.plist

ProcessProductPackaging /Users/hany/Library/MobileDevice/Provisioning\ Profiles/640bc706-7689-4345-bdfa-a0970be9026e.mobileprovision /Users/hany/Documents/B4iBuildServer53/UploadedProjects/<user id>/Payload/mushafalmoalem.app/embedded.mobileprovision (in target: B4iProject)
    cd /Users/hany/Documents/B4iBuildServer53/UploadedProjects/<user id>
    builtin-productPackagingUtility /Users/hany/Library/MobileDevice/Provisioning\ Profiles/640bc706-7689-4345-bdfa-a0970be9026e.mobileprovision -o /Users/hany/Documents/B4iBuildServer53/UploadedProjects/<user id>/Payload/mushafalmoalem.app/embedded.mobileprovision

ProcessProductPackaging "" /Users/hany/Documents/B4iBuildServer53/UploadedProjects/<user id>/build/B4iProject.build/Release-iphoneos/B4iProject.build/mushafalmoalem.app.xcent (in target: B4iProject)
    cd /Users/hany/Documents/B4iBuildServer53/UploadedProjects/<user id>
   

Entitlements:

{
    "application-identifier" = "V9M7S39TF7.com.developer.mushafalmoalem";
    "com.apple.developer.team-identifier" = V9M7S39TF7;
    "get-task-allow" = 1;
}


    builtin-productPackagingUtility -entitlements -format xml -o /Users/hany/Documents/B4iBuildServer53/UploadedProjects/<user id>/build/B4iProject.build/Release-iphoneos/B4iProject.build/mushafalmoalem.app.xcent

WriteAuxiliaryFile /Users/hany/Documents/B4iBuildServer53/UploadedProjects/<user id>/build/B4iProject.build/Release-iphoneos/B4iProject.build/mushafalmoalem.hmap (in target: B4iProject)
    cd /Users/hany/Documents/B4iBuildServer53/UploadedProjects/<user id>
    write-file /Users/hany/Documents/B4iBuildServer53/UploadedProjects/<user id>/build/B4iProject.build/Release-iphoneos/B4iProject.build/mushafalmoalem.hmap

WriteAuxiliaryFile /Users/hany/Documents/B4iBuildServer53/UploadedProjects/<user id>/build/B4iProject.build/Release-iphoneos/B4iProject.build/mushafalmoalem-project-headers.hmap (in target: B4iProject)
    cd /Users/hany/Documents/B4iBuildServer53/UploadedProjects/<user id>
    write-file /Users/hany/Documents/B4iBuildServer53/UploadedProjects/<user id>/build/B4iProject.build/Release-iphoneos/B4iProject.build/mushafalmoalem-project-headers.hmap

WriteAuxiliaryFile /Users/hany/Documents/B4iBuildServer53/UploadedProjects/<user id>/build/B4iProject.build/Release-iphoneos/B4iProject.build/mushafalmoalem-own-target-headers.hmap (in target: B4iProject)
    cd /Users/hany/Documents/B4iBuildServer53/UploadedProjects/<user id>
    write-file /Users/hany/Documents/B4iBuildServer53/UploadedProjects/<user id>/build/B4iProject.build/Release-iphoneos/B4iProject.build/mushafalmoalem-own-target-headers.hmap

WriteAuxiliaryFile /Users/hany/Documents/B4iBuildServer53/UploadedProjects/<user id>/build/B4iProject.build/Release-iphoneos/B4iProject.build/mushafalmoalem-generated-files.hmap (in target: B4iProject)
    cd /Users/hany/Documents/B4iBuildServer53/UploadedProjects/<user id>
    write-file /Users/hany/Documents/B4iBuildServer53/UploadedProjects/<user id>/build/B4iProject.build/Release-iphoneos/B4iProject.build/mushafalmoalem-generated-files.hmap

WriteAuxiliaryFile /Users/hany/Documents/B4iBuildServer53/UploadedProjects/<user id>/build/B4iProject.build/Release-iphoneos/B4iProject.build/mushafalmoalem-all-target-headers.hmap (in target: B4iProject)
    cd /Users/hany/Documents/B4iBuildServer53/UploadedProjects/<user id>
    write-file /Users/hany/Documents/B4iBuildServer53/UploadedProjects/<user id>/build/B4iProject.build/Release-iphoneos/B4iProject.build/mushafalmoalem-all-target-headers.hmap

WriteAuxiliaryFile /Users/hany/Documents/B4iBuildServer53/UploadedProjects/<user id>/build/B4iProject.build/Release-iphoneos/B4iProject.build/mushafalmoalem-all-non-framework-target-headers.hmap (in target: B4iProject)
    cd /Users/hany/Documents/B4iBuildServer53/UploadedProjects/<user id>
    write-file /Users/hany/Documents/B4iBuildServer53/UploadedProjects/<user id>/build/B4iProject.build/Release-iphoneos/B4iProject.build/mushafalmoalem-all-non-framework-target-headers.hmap

WriteAuxiliaryFile /Users/hany/Documents/B4iBuildServer53/UploadedProjects/<user id>/build/B4iProject.build/Release-iphoneos/B4iProject.build/all-product-headers.yaml (in target: B4iProject)
    cd /Users/hany/Documents/B4iBuildServer53/UploadedProjects/<user id>
    write-file /Users/hany/Documents/B4iBuildServer53/UploadedProjects/<user id>/build/B4iProject.build/Release-iphoneos/B4iProject.build/all-product-headers.yaml

WriteAuxiliaryFile /Users/hany/Documents/B4iBuildServer53/UploadedProjects/<user id>/build/B4iProject.build/Release-iphoneos/B4iProject.build/Objects-normal/armv7/mushafalmoalem.LinkFileList (in target: B4iProject)
    cd /Users/hany/Documents/B4iBuildServer53/UploadedProjects/<user id>
    write-file /Users/hany/Documents/B4iBuildServer53/UploadedProjects/<user id>/build/B4iProject.build/Release-iphoneos/B4iProject.build/Objects-normal/armv7/mushafalmoalem.LinkFileList

CompileC /Users/hany/Documents/B4iBuildServer53/UploadedProjects/<user id>/build/B4iProject.build/Release-iphoneos/B4iProject.build/Objects-normal/armv7/main.o /Users/hany/Documents/B4iBuildServer53/UploadedProjects/<user id>/B4iProject/main.m normal armv7 objective-c com.apple.compilers.llvm.clang.1_0.compiler (in target: B4iProject)
    cd /Users/hany/Documents/B4iBuildServer53/UploadedProjects/<user id>
    export LANG=en_US.US-ASCII
    /Applications/Xcode.app/Contents/Developer/Toolchains/XcodeDefault.xctoolchain/usr/bin/clang -x objective-c -arch armv7 -fmessage-length=0 -fdiagnostics-show-note-include-stack -fmacro-backtrace-limit=0 -std=gnu99 -fobjc-arc -fmodules -gmodules -fmodules-prune-interval=86400 -fmodules-prune-after=345600 -fbuild-session-file=/var/folders/pm/xzv63ftd20gbcmmhccjhp6rw0000gn/C/org.llvm.clang/ModuleCache.noindex/Session.modulevalidation -fmodules-validate-once-per-build-session -Wnon-modular-include-in-framework-module -Werror=non-modular-include-in-framework-module -Wno-trigraphs -fpascal-strings -O0 -Wno-missing-field-initializers -Wno-missing-prototypes -Werror=return-type -Wno-implicit-atomic-properties -Werror=deprecated-objc-isa-usage -Wno-objc-interface-ivars -Werror=objc-root-class -Wno-arc-repeated-use-of-weak -Wduplicate-method-match -Wno-missing-braces -Wparentheses -Wswitch -Wunused-function -Wno-unused-label -Wno-unused-parameter -Wunused-variable -Wunused-value -Wempty-body -Wuninitialized -Wconditional-uninitialized -Wno-unknown-pragmas -Wno-shadow -Wno-four-char-constants -Wno-conversion -Wconstant-conversion -Wint-conversion -Wbool-conversion -Wenum-conversion -Wno-float-conversion -Wno-non-literal-null-conversion -Wno-objc-literal-conversion -Wshorten-64-to-32 -Wpointer-sign -Wno-newline-eof -Wno-selector -Wno-strict-selector-match -Wundeclared-selector -Wno-deprecated-implementations -DB4I_VERSION=10 -DNS_BLOCK_ASSERTIONS=1 -DOBJC_OLD_DISPATCH_PROTOTYPES=1 -isysroot /Applications/Xcode.app/Contents/Developer/Platforms/iPhoneOS.platform/Developer/SDKs/iPhoneOS12.1.sdk -fstrict-aliasing -Wprotocol -Wdeprecated-declarations -miphoneos-version-min=7.0 -fvisibility=hidden -Wno-sign-conversion -Wno-infinite-recursion -Wno-comma -Wno-block-capture-autoreleasing -Wno-strict-prototypes -Wno-semicolon-before-method-body -iquote /Users/hany/Documents/B4iBuildServer53/UploadedProjects/<user id>/build/B4iProject.build/Release-iphoneos/B4iProject.build/mushafalmoalem-generated-files.hmap -I/Users/hany/Documents/B4iBuildServer53/UploadedProjects/<user id>/build/B4iProject.build/Release-iphoneos/B4iProject.build/mushafalmoalem-own-target-headers.hmap -I/Users/hany/Documents/B4iBuildServer53/UploadedProjects/<user id>/build/B4iProject.build/Release-iphoneos/B4iProject.build/mushafalmoalem-all-target-headers.hmap -iquote /Users/hany/Documents/B4iBuildServer53/UploadedProjects/<user id>/build/B4iProject.build/Release-iphoneos/B4iProject.build/mushafalmoalem-project-headers.hmap -I/Users/hany/Documents/B4iBuildServer53/UploadedProjects/<user id>/Payload/include -I/Users/hany/Documents/B4iBuildServer53/UploadedProjects/<user id>/build/B4iProject.build/Release-iphoneos/B4iProject.build/DerivedSources/armv7 -I/Users/hany/Documents/B4iBuildServer53/UploadedProjects/<user id>/build/B4iProject.build/Release-iphoneos/B4iProject.build/DerivedSources -F/Users/hany/Documents/B4iBuildServer53/UploadedProjects/<user id>/Payload -F../../Libs -MMD -MT dependencies -MF /Users/hany/Documents/B4iBuildServer53/UploadedProjects/<user id>/build/B4iProject.build/Release-iphoneos/B4iProject.build/Objects-normal/armv7/main.d --serialize-diagnostics /Users/hany/Documents/B4iBuildServer53/UploadedProjects/<user id>/build/B4iProject.build/Release-iphoneos/B4iProject.build/Objects-normal/armv7/main.dia -c /Users/hany/Documents/B4iBuildServer53/UploadedProjects/<user id>/B4iProject/main.m -o /Users/hany/Documents/B4iBuildServer53/UploadedProjects/<user id>/build/B4iProject.build/Release-iphoneos/B4iProject.build/Objects-normal/armv7/main.o

CompileC /Users/hany/Documents/B4iBuildServer53/UploadedProjects/<user id>/build/B4iProject.build/Release-iphoneos/B4iProject.build/Objects-normal/armv7/b4i_statemanager.o /Users/hany/Documents/B4iBuildServer53/UploadedProjects/<user id>/B4iProject/b4i_statemanager.m normal armv7 objective-c com.apple.compilers.llvm.clang.1_0.compiler (in target: B4iProject)
    cd /Users/hany/Documents/B4iBuildServer53/UploadedProjects/<user id>
    export LANG=en_US.US-ASCII
    /Applications/Xcode.app/Contents/Developer/Toolchains/XcodeDefault.xctoolchain/usr/bin/clang -x objective-c -arch armv7 -fmessage-length=0 -fdiagnostics-show-note-include-stack -fmacro-backtrace-limit=0 -std=gnu99 -fobjc-arc -fmodules -gmodules -fmodules-prune-interval=86400 -fmodules-prune-after=345600 -fbuild-session-file=/var/folders/pm/xzv63ftd20gbcmmhccjhp6rw0000gn/C/org.llvm.clang/ModuleCache.noindex/Session.modulevalidation -fmodules-validate-once-per-build-session -Wnon-modular-include-in-framework-module -Werror=non-modular-include-in-framework-module -Wno-trigraphs -fpascal-strings -O0 -Wno-missing-field-initializers -Wno-missing-prototypes -Werror=return-type -Wno-implicit-atomic-properties -Werror=deprecated-objc-isa-usage -Wno-objc-interface-ivars -Werror=objc-root-class -Wno-arc-repeated-use-of-weak -Wduplicate-method-match -Wno-missing-braces -Wparentheses -Wswitch -Wunused-function -Wno-unused-label -Wno-unused-parameter -Wunused-variable -Wunused-value -Wempty-body -Wuninitialized -Wconditional-uninitialized -Wno-unknown-pragmas -Wno-shadow -Wno-four-char-constants -Wno-conversion -Wconstant-conversion -Wint-conversion -Wbool-conversion -Wenum-conversion -Wno-float-conversion -Wno-non-literal-null-conversion -Wno-objc-literal-conversion -Wshorten-64-to-32 -Wpointer-sign -Wno-newline-eof -Wno-selector -Wno-strict-selector-match -Wundeclared-selector -Wno-deprecated-implementations -DB4I_VERSION=10 -DNS_BLOCK_ASSERTIONS=1 -DOBJC_OLD_DISPATCH_PROTOTYPES=1 -isysroot /Applications/Xcode.app/Contents/Developer/Platforms/iPhoneOS.platform/Developer/SDKs/iPhoneOS12.1.sdk -fstrict-aliasing -Wprotocol -Wdeprecated-declarations -miphoneos-version-min=7.0 -fvisibility=hidden -Wno-sign-conversion -Wno-infinite-recursion -Wno-comma -Wno-block-capture-autoreleasing -Wno-strict-prototypes -Wno-semicolon-before-method-body -iquote /Users/hany/Documents/B4iBuildServer53/UploadedProjects/<user id>/build/B4iProject.build/Release-iphoneos/B4iProject.build/mushafalmoalem-generated-files.hmap -I/Users/hany/Documents/B4iBuildServer53/UploadedProjects/<user id>/build/B4iProject.build/Release-iphoneos/B4iProject.build/mushafalmoalem-own-target-headers.hmap -I/Users/hany/Documents/B4iBuildServer53/UploadedProjects/<user id>/build/B4iProject.build/Release-iphoneos/B4iProject.build/mushafalmoalem-all-target-headers.hmap -iquote /Users/hany/Documents/B4iBuildServer53/UploadedProjects/<user id>/build/B4iProject.build/Release-iphoneos/B4iProject.build/mushafalmoalem-project-headers.hmap -I/Users/hany/Documents/B4iBuildServer53/UploadedProjects/<user id>/Payload/include -I/Users/hany/Documents/B4iBuildServer53/UploadedProjects/<user id>/build/B4iProject.build/Release-iphoneos/B4iProject.build/DerivedSources/armv7 -I/Users/hany/Documents/B4iBuildServer53/UploadedProjects/<user id>/build/B4iProject.build/Release-iphoneos/B4iProject.build/DerivedSources -F/Users/hany/Documents/B4iBuildServer53/UploadedProjects/<user id>/Payload -F../../Libs -MMD -MT dependencies -MF /Users/hany/Documents/B4iBuildServer53/UploadedProjects/<user id>/build/B4iProject.build/Release-iphoneos/B4iProject.build/Objects-normal/armv7/b4i_statemanager.d --serialize-diagnostics /Users/hany/Documents/B4iBuildServer53/UploadedProjects/<user id>/build/B4iProject.build/Release-iphoneos/B4iProject.build/Objects-normal/armv7/b4i_statemanager.dia -c /Users/hany/Documents/B4iBuildServer53/UploadedProjects/<user id>/B4iProject/b4i_statemanager.m -o /Users/hany/Documents/B4iBuildServer53/UploadedProjects/<user id>/build/B4iProject.build/Release-iphoneos/B4iProject.build/Objects-normal/armv7/b4i_statemanager.o
In file included from /Users/hany/Documents/B4iBuildServer53/UploadedProjects/<user id>/B4iProject/b4i_statemanager.m:2:
In file included from /Users/hany/Documents/B4iBuildServer53/UploadedProjects/<user id>/B4iProject/b4i_statemanager.h:7:
/Users/hany/Documents/B4iBuildServer53/Libs/iAdMob.h:3:9: fatal error: module 'GoogleMobileAds' not found
@import GoogleMobileAds;
 ~~~~~~~^~~~~~~~~~~~~~~
1
 error generated.

CompileC /Users/hany/Documents/B4iBuildServer53/UploadedProjects/<user id>/build/B4iProject.build/Release-iphoneos/B4iProject.build/Objects-normal/armv7/b4i_sourcedata.o /Users/hany/Documents/B4iBuildServer53/UploadedProjects/<user id>/B4iProject/b4i_sourcedata.m normal armv7 objective-c com.apple.compilers.llvm.clang.1_0.compiler (in target: B4iProject)
    cd /Users/hany/Documents/B4iBuildServer53/UploadedProjects/<user id>
    export LANG=en_US.US-ASCII
    /Applications/Xcode.app/Contents/Developer/Toolchains/XcodeDefault.xctoolchain/usr/bin/clang -x objective-c -arch armv7 -fmessage-length=0 -fdiagnostics-show-note-include-stack -fmacro-backtrace-limit=0 -std=gnu99 -fobjc-arc -fmodules -gmodules -fmodules-prune-interval=86400 -fmodules-prune-after=345600 -fbuild-session-file=/var/folders/pm/xzv63ftd20gbcmmhccjhp6rw0000gn/C/org.llvm.clang/ModuleCache.noindex/Session.modulevalidation -fmodules-validate-once-per-build-session -Wnon-modular-include-in-framework-module -Werror=non-modular-include-in-framework-module -Wno-trigraphs -fpascal-strings -O0 -Wno-missing-field-initializers -Wno-missing-prototypes -Werror=return-type -Wno-implicit-atomic-properties -Werror=deprecated-objc-isa-usage -Wno-objc-interface-ivars -Werror=objc-root-class -Wno-arc-repeated-use-of-weak -Wduplicate-method-match -Wno-missing-braces -Wparentheses -Wswitch -Wunused-function -Wno-unused-label -Wno-unused-parameter -Wunused-variable -Wunused-value -Wempty-body -Wuninitialized -Wconditional-uninitialized -Wno-unknown-pragmas -Wno-shadow -Wno-four-char-constants -Wno-conversion -Wconstant-conversion -Wint-conversion -Wbool-conversion -Wenum-conversion -Wno-float-conversion -Wno-non-literal-null-conversion -Wno-objc-literal-conversion -Wshorten-64-to-32 -Wpointer-sign -Wno-newline-eof -Wno-selector -Wno-strict-selector-match -Wundeclared-selector -Wno-deprecated-implementations -DB4I_VERSION=10 -DNS_BLOCK_ASSERTIONS=1 -DOBJC_OLD_DISPATCH_PROTOTYPES=1 -isysroot /Applications/Xcode.app/Contents/Developer/Platforms/iPhoneOS.platform/Developer/SDKs/iPhoneOS12.1.sdk -fstrict-aliasing -Wprotocol -Wdeprecated-declarations -miphoneos-version-min=7.0 -fvisibility=hidden -Wno-sign-conversion -Wno-infinite-recursion -Wno-comma -Wno-block-capture-autoreleasing -Wno-strict-prototypes -Wno-semicolon-before-method-body -iquote /Users/hany/Documents/B4iBuildServer53/UploadedProjects/<user id>/build/B4iProject.build/Release-iphoneos/B4iProject.build/mushafalmoalem-generated-files.hmap -I/Users/hany/Documents/B4iBuildServer53/UploadedProjects/<user id>/build/B4iProject.build/Release-iphoneos/B4iProject.build/mushafalmoalem-own-target-headers.hmap -I/Users/hany/Documents/B4iBuildServer53/UploadedProjects/<user id>/build/B4iProject.build/Release-iphoneos/B4iProject.build/mushafalmoalem-all-target-headers.hmap -iquote /Users/hany/Documents/B4iBuildServer53/UploadedProjects/<user id>/build/B4iProject.build/Release-iphoneos/B4iProject.build/mushafalmoalem-project-headers.hmap -I/Users/hany/Documents/B4iBuildServer53/UploadedProjects/<user id>/Payload/include -I/Users/hany/Documents/B4iBuildServer53/UploadedProjects/<user id>/build/B4iProject.build/Release-iphoneos/B4iProject.build/DerivedSources/armv7 -I/Users/hany/Documents/B4iBuildServer53/UploadedProjects/<user id>/build/B4iProject.build/Release-iphoneos/B4iProject.build/DerivedSources -F/Users/hany/Documents/B4iBuildServer53/UploadedProjects/<user id>/Payload -F../../Libs -MMD -MT dependencies -MF /Users/hany/Documents/B4iBuildServer53/UploadedProjects/<user id>/build/B4iProject.build/Release-iphoneos/B4iProject.build/Objects-normal/armv7/b4i_sourcedata.d --serialize-diagnostics /Users/hany/Documents/B4iBuildServer53/UploadedProjects/<user id>/build/B4iProject.build/Release-iphoneos/B4iProject.build/Objects-normal/armv7/b4i_sourcedata.dia -c /Users/hany/Documents/B4iBuildServer53/UploadedProjects/<user id>/B4iProject/b4i_sourcedata.m -o /Users/hany/Documents/B4iBuildServer53/UploadedProjects/<user id>/build/B4iProject.build/Release-iphoneos/B4iProject.build/Objects-normal/armv7/b4i_sourcedata.o
In file included from /Users/hany/Documents/B4iBuildServer53/UploadedProjects/<user id>/B4iProject/b4i_sourcedata.m:2:
In file included from /Users/hany/Documents/B4iBuildServer53/UploadedProjects/<user id>/B4iProject/b4i_sourcedata.h:7:
/Users/hany/Documents/B4iBuildServer53/Libs/iAdMob.h:3:9: fatal error: module 'GoogleMobileAds' not found
@import GoogleMobileAds;
 ~~~~~~~^~~~~~~~~~~~~~~
1 error generated.


Error: 2019-05-07 02:33:07.667 xcodebuild[518:9583]  DVTProvisioningProfileManager: Failed to load profile "/Users/hany/Library/MobileDevice/Provisioning Profiles/640bc706-7689-4345-bdfa-a0970be9026e" (Error Domain=DVTProvisioningProfileSourceErrorDomain Code=0 "No provisioning profile provider found for profile "/Users/hany/Library/MobileDevice/Provisioning Profiles/640bc706-7689-4345-bdfa-a0970be9026e"." UserInfo={NSLocalizedDescription=No provisioning profile provider found for profile "/Users/hany/Library/MobileDevice/Provisioning Profiles/640bc706-7689-4345-bdfa-a0970be9026e".})
2019-05-07 02:33:07.668 xcodebuild[518:9583]  DVTProvisioningProfileManager: Failed to load profile "/Users/hany/Library/MobileDevice/Provisioning Profiles/cfb01711-1f4f-40d3-b960-21520bbad2f2" (Error Domain=DVTProvisioningProfileSourceErrorDomain Code=0 "No provisioning profile provider found for profile "/Users/hany/Library/MobileDevice/Provisioning Profiles/cfb01711-1f4f-40d3-b960-21520bbad2f2"." UserInfo={NSLocalizedDescription=No provisioning profile provider found for profile "/Users/hany/Library/MobileDevice/Provisioning Profiles/cfb01711-1f4f-40d3-b960-21520bbad2f2".})
2019-05-07 02:33:07.675 xcodebuild[518:9583]  DVTProvisioningProfileManager: Failed to load profile "/Users/hany/Library/MobileDevice/Provisioning Profiles/395f5297-f77a-4b2f-b4f0-738cd11d9e23" (Error Domain=DVTProvisioningProfileSourceErrorDomain Code=0 "No provisioning profile provider found for profile "/Users/hany/Library/MobileDevice/Provisioning Profiles/395f5297-f77a-4b2f-b4f0-738cd11d9e23"." UserInfo={NSLocalizedDescription=No provisioning profile provider found for profile "/Users/hany/Library/MobileDevice/Provisioning Profiles/395f5297-f77a-4b2f-b4f0-738cd11d9e23".})
2019-05-07 02:33:07.681 xcodebuild[518:9583]  DVTProvisioningProfileManager: Failed to load profile "/Users/hany/Library/MobileDevice/Provisioning Profiles/d93f8968-dc42-4757-ad5c-0e62e1ef6794" (Error Domain=DVTProvisioningProfileSourceErrorDomain Code=0 "No provisioning profile provider found for profile "/Users/hany/Library/MobileDevice/Provisioning Profiles/d93f8968-dc42-4757-ad5c-0e62e1ef6794"." UserInfo={NSLocalizedDescription=No provisioning profile provider found for profile "/Users/hany/Library/MobileDevice/Provisioning Profiles/d93f8968-dc42-4757-ad5c-0e62e1ef6794".})
2019-05-07 02:33:07.681 xcodebuild[518:9583]  DVTProvisioningProfileManager: Failed to load profile "/Users/hany/Library/MobileDevice/Provisioning Profiles/f8e60c51-b635-4c2d-b137-f28ee0d16a62" (Error Domain=DVTProvisioningProfileSourceErrorDomain Code=0 "No provisioning profile provider found for profile "/Users/hany/Library/MobileDevice/Provisioning Profiles/f8e60c51-b635-4c2d-b137-f28ee0d16a62"." UserInfo={NSLocalizedDescription=No provisioning profile provider found for profile "/Users/hany/Library/MobileDevice/Provisioning Profiles/f8e60c51-b635-4c2d-b137-f28ee0d16a62".})
2019-05-07 02:33:07.681 xcodebuild[518:9616]  DVTProvisioningProfileManager: Failed to load profile "/Users/hany/Library/MobileDevice/Provisioning Profiles/5fb54bc4-ff1f-4137-8bb8-4e9d47bb0876" (Error Domain=DVTProvisioningProfileSourceErrorDomain Code=0 "No provisioning profile provider found for profile "/Users/hany/Library/MobileDevice/Provisioning Profiles/5fb54bc4-ff1f-4137-8bb8-4e9d47bb0876"." UserInfo={NSLocalizedDescription=No provisioning profile provider found for profile "/Users/hany/Library/MobileDevice/Provisioning Profiles/5fb54bc4-ff1f-4137-8bb8-4e9d47bb0876".})
2019-05-07 02:33:07.681 xcodebuild[518:9583]  DVTProvisioningProfileManager: Failed to load profile "/Users/hany/Library/MobileDevice/Provisioning Profiles/fb7cbbe6-a392-4c45-bdf3-d1b0952cae8d" (Error Domain=DVTProvisioningProfileSourceErrorDomain Code=0 "No provisioning profile provider found for profile "/Users/hany/Library/MobileDevice/Provisioning Profiles/fb7cbbe6-a392-4c45-bdf3-d1b0952cae8d"." UserInfo={NSLocalizedDescription=No provisioning profile provider found for profile "/Users/hany/Library/MobileDevice/Provisioning Profiles/fb7cbbe6-a392-4c45-bdf3-d1b0952cae8d".})
2019-05-07 02:33:07.681 xcodebuild[518:9616]  DVTProvisioningProfileManager: Failed to load profile "/Users/hany/Library/MobileDevice/Provisioning Profiles/c8aca4be-a0e6-4ab6-a2df-3ad1f8f3a05f" (Error Domain=DVTProvisioningProfileSourceErrorDomain Code=0 "No provisioning profile provider found for profile "/Users/hany/Library/MobileDevice/Provisioning Profiles/c8aca4be-a0e6-4ab6-a2df-3ad1f8f3a05f"." UserInfo={NSLocalizedDescription=No provisioning profile provider found for profile "/Users/hany/Library/MobileDevice/Provisioning Profiles/c8aca4be-a0e6-4ab6-a2df-3ad1f8f3a05f".})
2019-05-07 02:33:07.687 xcodebuild[518:9616]  DVTProvisioningProfileManager: Failed to load profile "/Users/hany/Library/MobileDevice/Provisioning Profiles/5df6e627-76ea-40e3-a978-3c0cef347225" (Error Domain=DVTProvisioningProfileSourceErrorDomain Code=0 "No provisioning profile provider found for profile "/Users/hany/Library/MobileDevice/Provisioning Profiles/5df6e627-76ea-40e3-a978-3c0cef347225"." UserInfo={NSLocalizedDescription=No provisioning profile provider found for profile "/Users/hany/Library/MobileDevice/Provisioning Profiles/5df6e627-76ea-40e3-a978-3c0cef347225".})
2019-05-07 02:33:07.693 xcodebuild[518:9616]  DVTProvisioningProfileManager: Failed to load profile "/Users/hany/Library/MobileDevice/Provisioning Profiles/6aa8f0db-a140-4bda-9801-9821e4935c59" (Error Domain=DVTProvisioningProfileSourceErrorDomain Code=0 "No provisioning profile provider found for profile "/Users/hany/Library/MobileDevice/Provisioning Profiles/6aa8f0db-a140-4bda-9801-9821e4935c59"." UserInfo={NSLocalizedDescription=No provisioning profile provider found for profile "/Users/hany/Library/MobileDevice/Provisioning Profiles/6aa8f0db-a140-4bda-9801-9821e4935c59".})
2019-05-07 02:33:07.694 xcodebuild[518:9616]  DVTProvisioningProfileManager: Failed to load profile "/Users/hany/Library/MobileDevice/Provisioning Profiles/c5926298-1ce7-4fc2-a6e6-2fa11f549a12" (Error Domain=DVTProvisioningProfileSourceErrorDomain Code=0 "No provisioning profile provider found for profile "/Users/hany/Library/MobileDevice/Provisioning Profiles/c5926298-1ce7-4fc2-a6e6-2fa11f549a12"." UserInfo={NSLocalizedDescription=No provisioning profile provider found for profile "/Users/hany/Library/MobileDevice/Provisioning Profiles/c5926298-1ce7-4fc2-a6e6-2fa11f549a12".})
2019-05-07 02:33:07.698 xcodebuild[518:9616]  DVTProvisioningProfileManager: Failed to load profile "/Users/hany/Library/MobileDevice/Provisioning Profiles/ad82c0b9-2e20-4897-accf-d723b6bacac1" (Error Domain=DVTProvisioningProfileSourceErrorDomain Code=0 "No provisioning profile provider found for profile "/Users/hany/Library/MobileDevice/Provisioning Profiles/ad82c0b9-2e20-4897-accf-d723b6bacac1"." UserInfo={NSLocalizedDescription=No provisioning profile provider found for profile "/Users/hany/Library/MobileDevice/Provisioning Profiles/ad82c0b9-2e20-4897-accf-d723b6bacac1".})
2019-05-07 02:33:07.704 xcodebuild[518:9583]  DVTProvisioningProfileManager: Failed to load profile "/Users/hany/Library/MobileDevice/Provisioning Profiles/e8ab1eca-cfc1-4ebe-ba63-5ef9782d36df" (Error Domain=DVTProvisioningProfileSourceErrorDomain Code=0 "No provisioning profile provider found for profile "/Users/hany/Library/MobileDevice/Provisioning Profiles/e8ab1eca-cfc1-4ebe-ba63-5ef9782d36df"." UserInfo={NSLocalizedDescription=No provisioning profile provider found for profile "/Users/hany/Library/MobileDevice/Provisioning Profiles/e8ab1eca-cfc1-4ebe-ba63-5ef9782d36df".})
2019-05-07 02:33:07.705 xcodebuild[518:9583]  DVTProvisioningProfileManager: Failed to load profile "/Users/hany/Library/MobileDevice/Provisioning Profiles/138136c1-2a77-4ee6-ab2d-55e6bb21bc80" (Error Domain=DVTProvisioningProfileSourceErrorDomain Code=0 "No provisioning profile provider found for profile "/Users/hany/Library/MobileDevice/Provisioning Profiles/138136c1-2a77-4ee6-ab2d-55e6bb21bc80"." UserInfo={NSLocalizedDescription=No provisioning profile provider found for profile "/Users/hany/Library/MobileDevice/Provisioning Profiles/138136c1-2a77-4ee6-ab2d-55e6bb21bc80".})
2019-05-07 02:33:07.709 xcodebuild[518:9583]  DVTProvisioningProfileManager: Failed to load profile "/Users/hany/Library/MobileDevice/Provisioning Profiles/3b8afa85-6801-4de0-8068-ef9111ca8054" (Error Domain=DVTProvisioningProfileSourceErrorDomain Code=0 "No provisioning profile provider found for profile "/Users/hany/Library/MobileDevice/Provisioning Profiles/3b8afa85-6801-4de0-8068-ef9111ca8054"." UserInfo={NSLocalizedDescription=No provisioning profile provider found for profile "/Users/hany/Library/MobileDevice/Provisioning Profiles/3b8afa85-6801-4de0-8068-ef9111ca8054".})
** BUILD FAILED **


The following build commands failed:
    CompileC /Users/hany/Documents/B4iBuildServer53/UploadedProjects/<user id>/build/B4iProject.build/Release-iphoneos/B4iProject.build/Objects-normal/armv7/b4i_statemanager.o /Users/hany/Documents/B4iBuildServer53/UploadedProjects/<user id>/B4iProject/b4i_statemanager.m normal armv7 objective-c com.apple.compilers.llvm.clang.1_0.compiler
    CompileC /Users/hany/Documents/B4iBuildServer53/UploadedProjects/<user id>/build/B4iProject.build/Release-iphoneos/B4iProject.build/Objects-normal/armv7/b4i_sourcedata.o /Users/hany/Documents/B4iBuildServer53/UploadedProjects/<user id>/B4iProject/b4i_sourcedata.m normal armv7 objective-c com.apple.compilers.llvm.clang.1_0.compiler
(2 failures)
Update :i think error related to Google Mobile Ads SDK ,it was missing
 
Last edited:
Top