iOS Question B4i v 4.80 problem with local builder

Pendrush

Well-Known Member
Licensed User
- B4iBuildServer.jar is version 4.60. I don't know is error in version number or not.
With OSX El Capitan v10.11.6 and xCode v8.2.1, I'm not able to compile anything.
One of many errors (depend of app):
B4i Version: 4.80
Parsing code. (0.02s)
Compiling code. (0.17s)
Compiling layouts code. (0.01s)
Compiling debugger engine code. (1.37s)
Building Xcode project (0.29s)
Sending data to remote compiler. Error
Out: Build settings from command line:
ARCHS = armv7
CODE_SIGN_IDENTITY = iPhone Developer: xxxxxxxxx
CONFIGURATION_BUILD_DIR = /Users/Mac/B4iBuild/UploadedProjects/<user id>/Payload
OTHER_CODE_SIGN_FLAGS = --keychain <user id>
PRODUCT_NAME = TS Beta
PROVISIONING_PROFILE = d3c43e35-aba4-4f8b-929f-dab78eb9492a

=== BUILD TARGET B4iProject OF PROJECT B4iProject WITH CONFIGURATION Release ===

Check dependencies

Write auxiliary files
write-file /Users/Mac/B4iBuild/UploadedProjects/<user id>/build/B4iProject.build/Release-iphoneos/B4iProject.build/TS\ Beta.hmap
write-file /Users/Mac/B4iBuild/UploadedProjects/<user id>/build/B4iProject.build/Release-iphoneos/B4iProject.build/TS\ Beta-project-headers.hmap
write-file /Users/Mac/B4iBuild/UploadedProjects/<user id>/build/B4iProject.build/Release-iphoneos/B4iProject.build/TS\ Beta-own-target-headers.hmap
/bin/mkdir -p /Users/Mac/B4iBuild/UploadedProjects/<user id>/build/B4iProject.build/Release-iphoneos/B4iProject.build/Objects-normal/armv7
write-file /Users/Mac/B4iBuild/UploadedProjects/<user id>/build/B4iProject.build/Release-iphoneos/B4iProject.build/Objects-normal/armv7/TS\ Beta.LinkFileList
write-file /Users/Mac/B4iBuild/UploadedProjects/<user id>/build/B4iProject.build/Release-iphoneos/B4iProject.build/TS\ Beta-generated-files.hmap
write-file /Users/Mac/B4iBuild/UploadedProjects/<user id>/build/B4iProject.build/Release-iphoneos/B4iProject.build/TS\ Beta-all-target-headers.hmap
write-file /Users/Mac/B4iBuild/UploadedProjects/<user id>/build/B4iProject.build/Release-iphoneos/B4iProject.build/TS\ Beta-all-non-framework-target-headers.hmap

Create product structure
/bin/mkdir -p /Users/Mac/B4iBuild/UploadedProjects/<user id>/Payload/TS\ Beta.app

CompileC build/B4iProject.build/Release-iphoneos/B4iProject.build/Objects-normal/armv7/main.o B4iProject/main.m normal armv7 objective-c com.apple.compilers.llvm.clang.1_0.compiler
cd /Users/Mac/B4iBuild/UploadedProjects/<user id>
export LANG=en_US.US-ASCII
export PATH="/Applications/Xcode.app/Contents/Developer/Platforms/iPhoneOS.platform/Developer/usr/bin:/Applications/Xcode.app/Contents/Developer/usr/bin:/usr/local/bin:/usr/bin:/bin:/usr/sbin:/sbin"
/Applications/Xcode.app/Contents/Developer/Toolchains/XcodeDefault.xctoolchain/usr/bin/clang -x objective-c -arch armv7 -fmessage-length=0 -fdiagnostics-show-note-include-stack -fmacro-backtrace-limit=0 -std=gnu99 -fobjc-arc -fmodules -gmodules -fmodules-prune-interval=86400 -fmodules-prune-after=345600 -fbuild-session-file=/var/folders/bt/ws8wmxhs6t958l92jx4d7xy00000gn/C/org.llvm.clang/ModuleCache/Session.modulevalidation -fmodules-validate-once-per-build-session -Wnon-modular-include-in-framework-module -Werror=non-modular-include-in-framework-module -Wno-trigraphs -fpascal-strings -O0 -Wno-missing-field-initializers -Wno-missing-prototypes -Werror=return-type -Wno-implicit-atomic-properties -Werror=deprecated-objc-isa-usage -Werror=objc-root-class -Wno-arc-repeated-use-of-weak -Wduplicate-method-match -Wno-missing-braces -Wparentheses -Wswitch -Wunused-function -Wno-unused-label -Wno-unused-parameter -Wunused-variable -Wunused-value -Wempty-body -Wconditional-uninitialized -Wno-unknown-pragmas -Wno-shadow -Wno-four-char-constants -Wno-conversion -Wconstant-conversion -Wint-conversion -Wbool-conversion -Wenum-conversion -Wshorten-64-to-32 -Wpointer-sign -Wno-newline-eof -Wno-selector -Wno-strict-selector-match -Wundeclared-selector -Wno-deprecated-implementations -DNS_BLOCK_ASSERTIONS=1 -isysroot /Applications/Xcode.app/Contents/Developer/Platforms/iPhoneOS.platform/Developer/SDKs/iPhoneOS10.2.sdk -fstrict-aliasing -Wprotocol -Wdeprecated-declarations -miphoneos-version-min=7.0 -fvisibility=hidden -Wno-sign-conversion -Wno-infinite-recursion -iquote /Users/Mac/B4iBuild/UploadedProjects/<user id>/build/B4iProject.build/Release-iphoneos/B4iProject.build/TS\ Beta-generated-files.hmap -I/Users/Mac/B4iBuild/UploadedProjects/<user id>/build/B4iProject.build/Release-iphoneos/B4iProject.build/TS\ Beta-own-target-headers.hmap -I/Users/Mac/B4iBuild/UploadedProjects/<user id>/build/B4iProject.build/Release-iphoneos/B4iProject.build/TS\ Beta-all-target-headers.hmap -iquote /Users/Mac/B4iBuild/UploadedProjects/<user id>/build/B4iProject.build/Release-iphoneos/B4iProject.build/TS\ Beta-project-headers.hmap -I/Users/Mac/B4iBuild/UploadedProjects/<user id>/Payload/include -I/Users/Mac/B4iBuild/UploadedProjects/<user id>/build/B4iProject.build/Release-iphoneos/B4iProject.build/DerivedSources/armv7 -I/Users/Mac/B4iBuild/UploadedProjects/<user id>/build/B4iProject.build/Release-iphoneos/B4iProject.build/DerivedSources -F/Users/Mac/B4iBuild/UploadedProjects/<user id>/Payload -F../../Libs -MMD -MT dependencies -MF /Users/Mac/B4iBuild/UploadedProjects/<user id>/build/B4iProject.build/Release-iphoneos/B4iProject.build/Objects-normal/armv7/main.d --serialize-diagnostics /Users/Mac/B4iBuild/UploadedProjects/<user id>/build/B4iProject.build/Release-iphoneos/B4iProject.build/Objects-normal/armv7/main.dia -c /Users/Mac/B4iBuild/UploadedProjects/<user id>/B4iProject/main.m -o /Users/Mac/B4iBuild/UploadedProjects/<user id>/build/B4iProject.build/Release-iphoneos/B4iProject.build/Objects-normal/armv7/main.o

CompileC build/B4iProject.build/Release-iphoneos/B4iProject.build/Objects-normal/armv7/b4i_main.o B4iProject/b4i_main.m normal armv7 objective-c com.apple.compilers.llvm.clang.1_0.compiler
cd /Users/Mac/B4iBuild/UploadedProjects/<user id>
export LANG=en_US.US-ASCII
export PATH="/Applications/Xcode.app/Contents/Developer/Platforms/iPhoneOS.platform/Developer/usr/bin:/Applications/Xcode.app/Contents/Developer/usr/bin:/usr/local/bin:/usr/bin:/bin:/usr/sbin:/sbin"
/Applications/Xcode.app/Contents/Developer/Toolchains/XcodeDefault.xctoolchain/usr/bin/clang -x objective-c -arch armv7 -fmessage-length=0 -fdiagnostics-show-note-include-stack -fmacro-backtrace-limit=0 -std=gnu99 -fobjc-arc -fmodules -gmodules -fmodules-prune-interval=86400 -fmodules-prune-after=345600 -fbuild-session-file=/var/folders/bt/ws8wmxhs6t958l92jx4d7xy00000gn/C/org.llvm.clang/ModuleCache/Session.modulevalidation -fmodules-validate-once-per-build-session -Wnon-modular-include-in-framework-module -Werror=non-modular-include-in-framework-module -Wno-trigraphs -fpascal-strings -O0 -Wno-missing-field-initializers -Wno-missing-prototypes -Werror=return-type -Wno-implicit-atomic-properties -Werror=deprecated-objc-isa-usage -Werror=objc-root-class -Wno-arc-repeated-use-of-weak -Wduplicate-method-match -Wno-missing-braces -Wparentheses -Wswitch -Wunused-function -Wno-unused-label -Wno-unused-parameter -Wunused-variable -Wunused-value -Wempty-body -Wconditional-uninitialized -Wno-unknown-pragmas -Wno-shadow -Wno-four-char-constants -Wno-conversion -Wconstant-conversion -Wint-conversion -Wbool-conversion -Wenum-conversion -Wshorten-64-to-32 -Wpointer-sign -Wno-newline-eof -Wno-selector -Wno-strict-selector-match -Wundeclared-selector -Wno-deprecated-implementations -DNS_BLOCK_ASSERTIONS=1 -isysroot /Applications/Xcode.app/Contents/Developer/Platforms/iPhoneOS.platform/Developer/SDKs/iPhoneOS10.2.sdk -fstrict-aliasing -Wprotocol -Wdeprecated-declarations -miphoneos-version-min=7.0 -fvisibility=hidden -Wno-sign-conversion -Wno-infinite-recursion -iquote /Users/Mac/B4iBuild/UploadedProjects/<user id>/build/B4iProject.build/Release-iphoneos/B4iProject.build/TS\ Beta-generated-files.hmap -I/Users/Mac/B4iBuild/UploadedProjects/<user id>/build/B4iProject.build/Release-iphoneos/B4iProject.build/TS\ Beta-own-target-headers.hmap -I/Users/Mac/B4iBuild/UploadedProjects/<user id>/build/B4iProject.build/Release-iphoneos/B4iProject.build/TS\ Beta-all-target-headers.hmap -iquote /Users/Mac/B4iBuild/UploadedProjects/<user id>/build/B4iProject.build/Release-iphoneos/B4iProject.build/TS\ Beta-project-headers.hmap -I/Users/Mac/B4iBuild/UploadedProjects/<user id>/Payload/include -I/Users/Mac/B4iBuild/UploadedProjects/<user id>/build/B4iProject.build/Release-iphoneos/B4iProject.build/DerivedSources/armv7 -I/Users/Mac/B4iBuild/UploadedProjects/<user id>/build/B4iProject.build/Release-iphoneos/B4iProject.build/DerivedSources -F/Users/Mac/B4iBuild/UploadedProjects/<user id>/Payload -F../../Libs -MMD -MT dependencies -MF /Users/Mac/B4iBuild/UploadedProjects/<user id>/build/B4iProject.build/Release-iphoneos/B4iProject.build/Objects-normal/armv7/b4i_main.d --serialize-diagnostics /Users/Mac/B4iBuild/UploadedProjects/<user id>/build/B4iProject.build/Release-iphoneos/B4iProject.build/Objects-normal/armv7/b4i_main.dia -c /Users/Mac/B4iBuild/UploadedProjects/<user id>/B4iProject/b4i_main.m -o /Users/Mac/B4iBuild/UploadedProjects/<user id>/build/B4iProject.build/Release-iphoneos/B4iProject.build/Objects-normal/armv7/b4i_main.o

CompileC build/B4iProject.build/Release-iphoneos/B4iProject.build/Objects-normal/armv7/b4i_moddrawer.o B4iProject/b4i_moddrawer.m normal armv7 objective-c com.apple.compilers.llvm.clang.1_0.compiler
cd /Users/Mac/B4iBuild/UploadedProjects/<user id>
export LANG=en_US.US-ASCII
export PATH="/Applications/Xcode.app/Contents/Developer/Platforms/iPhoneOS.platform/Developer/usr/bin:/Applications/Xcode.app/Contents/Developer/usr/bin:/usr/local/bin:/usr/bin:/bin:/usr/sbin:/sbin"
/Applications/Xcode.app/Contents/Developer/Toolchains/XcodeDefault.xctoolchain/usr/bin/clang -x objective-c -arch armv7 -fmessage-length=0 -fdiagnostics-show-note-include-stack -fmacro-backtrace-limit=0 -std=gnu99 -fobjc-arc -fmodules -gmodules -fmodules-prune-interval=86400 -fmodules-prune-after=345600 -fbuild-session-file=/var/folders/bt/ws8wmxhs6t958l92jx4d7xy00000gn/C/org.llvm.clang/ModuleCache/Session.modulevalidation -fmodules-validate-once-per-build-session -Wnon-modular-include-in-framework-module -Werror=non-modular-include-in-framework-module -Wno-trigraphs -fpascal-strings -O0 -Wno-missing-field-initializers -Wno-missing-prototypes -Werror=return-type -Wno-implicit-atomic-properties -Werror=deprecated-objc-isa-usage -Werror=objc-root-class -Wno-arc-repeated-use-of-weak -Wduplicate-method-match -Wno-missing-braces -Wparentheses -Wswitch -Wunused-function -Wno-unused-label -Wno-unused-parameter -Wunused-variable -Wunused-value -Wempty-body -Wconditional-uninitialized -Wno-unknown-pragmas -Wno-shadow -Wno-four-char-constants -Wno-conversion -Wconstant-conversion -Wint-conversion -Wbool-conversion -Wenum-conversion -Wshorten-64-to-32 -Wpointer-sign -Wno-newline-eof -Wno-selector -Wno-strict-selector-match -Wundeclared-selector -Wno-deprecated-implementations -DNS_BLOCK_ASSERTIONS=1 -isysroot /Applications/Xcode.app/Contents/Developer/Platforms/iPhoneOS.platform/Developer/SDKs/iPhoneOS10.2.sdk -fstrict-aliasing -Wprotocol -Wdeprecated-declarations -miphoneos-version-min=7.0 -fvisibility=hidden -Wno-sign-conversion -Wno-infinite-recursion -iquote /Users/Mac/B4iBuild/UploadedProjects/<user id>/build/B4iProject.build/Release-iphoneos/B4iProject.build/TS\ Beta-generated-files.hmap -I/Users/Mac/B4iBuild/UploadedProjects/<user id>/build/B4iProject.build/Release-iphoneos/B4iProject.build/TS\ Beta-own-target-headers.hmap -I/Users/Mac/B4iBuild/UploadedProjects/<user id>/build/B4iProject.build/Release-iphoneos/B4iProject.build/TS\ Beta-all-target-headers.hmap -iquote /Users/Mac/B4iBuild/UploadedProjects/<user id>/build/B4iProject.build/Release-iphoneos/B4iProject.build/TS\ Beta-project-headers.hmap -I/Users/Mac/B4iBuild/UploadedProjects/<user id>/Payload/include -I/Users/Mac/B4iBuild/UploadedProjects/<user id>/build/B4iProject.build/Release-iphoneos/B4iProject.build/DerivedSources/armv7 -I/Users/Mac/B4iBuild/UploadedProjects/<user id>/build/B4iProject.build/Release-iphoneos/B4iProject.build/DerivedSources -F/Users/Mac/B4iBuild/UploadedProjects/<user id>/Payload -F../../Libs -MMD -MT dependencies -MF /Users/Mac/B4iBuild/UploadedProjects/<user id>/build/B4iProject.build/Release-iphoneos/B4iProject.build/Objects-normal/armv7/b4i_moddrawer.d --serialize-diagnostics /Users/Mac/B4iBuild/UploadedProjects/<user id>/build/B4iProject.build/Release-iphoneos/B4iProject.build/Objects-normal/armv7/b4i_moddrawer.dia -c /Users/Mac/B4iBuild/UploadedProjects/<user id>/B4iProject/b4i_moddrawer.m -o /Users/Mac/B4iBuild/UploadedProjects/<user id>/build/B4iProject.build/Release-iphoneos/B4iProject.build/Objects-normal/armv7/b4i_moddrawer.o

CompileC build/B4iProject.build/Release-iphoneos/B4iProject.build/Objects-normal/armv7/b4i_modglobal.o B4iProject/b4i_modglobal.m normal armv7 objective-c com.apple.compilers.llvm.clang.1_0.compiler
cd /Users/Mac/B4iBuild/UploadedProjects/<user id>
export LANG=en_US.US-ASCII
export PATH="/Applications/Xcode.app/Contents/Developer/Platforms/iPhoneOS.platform/Developer/usr/bin:/Applications/Xcode.app/Contents/Developer/usr/bin:/usr/local/bin:/usr/bin:/bin:/usr/sbin:/sbin"
/Applications/Xcode.app/Contents/Developer/Toolchains/XcodeDefault.xctoolchain/usr/bin/clang -x objective-c -arch armv7 -fmessage-length=0 -fdiagnostics-show-note-include-stack -fmacro-backtrace-limit=0 -std=gnu99 -fobjc-arc -fmodules -gmodules -fmodules-prune-interval=86400 -fmodules-prune-after=345600 -fbuild-session-file=/var/folders/bt/ws8wmxhs6t958l92jx4d7xy00000gn/C/org.llvm.clang/ModuleCache/Session.modulevalidation -fmodules-validate-once-per-build-session -Wnon-modular-include-in-framework-module -Werror=non-modular-include-in-framework-module -Wno-trigraphs -fpascal-strings -O0 -Wno-missing-field-initializers -Wno-missing-prototypes -Werror=return-type -Wno-implicit-atomic-properties -Werror=deprecated-objc-isa-usage -Werror=objc-root-class -Wno-arc-repeated-use-of-weak -Wduplicate-method-match -Wno-missing-braces -Wparentheses -Wswitch -Wunused-function -Wno-unused-label -Wno-unused-parameter -Wunused-variable -Wunused-value -Wempty-body -Wconditional-uninitialized -Wno-unknown-pragmas -Wno-shadow -Wno-four-char-constants -Wno-conversion -Wconstant-conversion -Wint-conversion -Wbool-conversion -Wenum-conversion -Wshorten-64-to-32 -Wpointer-sign -Wno-newline-eof -Wno-selector -Wno-strict-selector-match -Wundeclared-selector -Wno-deprecated-implementations -DNS_BLOCK_ASSERTIONS=1 -isysroot /Applications/Xcode.app/Contents/Developer/Platforms/iPhoneOS.platform/Developer/SDKs/iPhoneOS10.2.sdk -fstrict-aliasing -Wprotocol -Wdeprecated-declarations -miphoneos-version-min=7.0 -fvisibility=hidden -Wno-sign-conversion -Wno-infinite-recursion -iquote /Users/Mac/B4iBuild/UploadedProjects/<user id>/build/B4iProject.build/Release-iphoneos/B4iProject.build/TS\ Beta-generated-files.hmap -I/Users/Mac/B4iBuild/UploadedProjects/<user id>/build/B4iProject.build/Release-iphoneos/B4iProject.build/TS\ Beta-own-target-headers.hmap -I/Users/Mac/B4iBuild/UploadedProjects/<user id>/build/B4iProject.build/Release-iphoneos/B4iProject.build/TS\ Beta-all-target-headers.hmap -iquote /Users/Mac/B4iBuild/UploadedProjects/<user id>/build/B4iProject.build/Release-iphoneos/B4iProject.build/TS\ Beta-project-headers.hmap -I/Users/Mac/B4iBuild/UploadedProjects/<user id>/Payload/include -I/Users/Mac/B4iBuild/UploadedProjects/<user id>/build/B4iProject.build/Release-iphoneos/B4iProject.build/DerivedSources/armv7 -I/Users/Mac/B4iBuild/UploadedProjects/<user id>/build/B4iProject.build/Release-iphoneos/B4iProject.build/DerivedSources -F/Users/Mac/B4iBuild/UploadedProjects/<user id>/Payload -F../../Libs -MMD -MT dependencies -MF /Users/Mac/B4iBuild/UploadedProjects/<user id>/build/B4iProject.build/Release-iphoneos/B4iProject.build/Objects-normal/armv7/b4i_modglobal.d --serialize-diagnostics /Users/Mac/B4iBuild/UploadedProjects/<user id>/build/B4iProject.build/Release-iphoneos/B4iProject.build/Objects-normal/armv7/b4i_modglobal.dia -c /Users/Mac/B4iBuild/UploadedProjects/<user id>/B4iProject/b4i_modglobal.m -o /Users/Mac/B4iBuild/UploadedProjects/<user id>/build/B4iProject.build/Release-iphoneos/B4iProject.build/Objects-normal/armv7/b4i_modglobal.o

CompileC build/B4iProject.build/Release-iphoneos/B4iProject.build/Objects-normal/armv7/b4i_pglavna.o B4iProject/b4i_pglavna.m normal armv7 objective-c com.apple.compilers.llvm.clang.1_0.compiler
cd /Users/Mac/B4iBuild/UploadedProjects/<user id>
export LANG=en_US.US-ASCII
export PATH="/Applications/Xcode.app/Contents/Developer/Platforms/iPhoneOS.platform/Developer/usr/bin:/Applications/Xcode.app/Contents/Developer/usr/bin:/usr/local/bin:/usr/bin:/bin:/usr/sbin:/sbin"
/Applications/Xcode.app/Contents/Developer/Toolchains/XcodeDefault.xctoolchain/usr/bin/clang -x objective-c -arch armv7 -fmessage-length=0 -fdiagnostics-show-note-include-stack -fmacro-backtrace-limit=0 -std=gnu99 -fobjc-arc -fmodules -gmodules -fmodules-prune-interval=86400 -fmodules-prune-after=345600 -fbuild-session-file=/var/folders/bt/ws8wmxhs6t958l92jx4d7xy00000gn/C/org.llvm.clang/ModuleCache/Session.modulevalidation -fmodules-validate-once-per-build-session -Wnon-modular-include-in-framework-module -Werror=non-modular-include-in-framework-module -Wno-trigraphs -fpascal-strings -O0 -Wno-missing-field-initializers -Wno-missing-prototypes -Werror=return-type -Wno-implicit-atomic-properties -Werror=deprecated-objc-isa-usage -Werror=objc-root-class -Wno-arc-repeated-use-of-weak -Wduplicate-method-match -Wno-missing-braces -Wparentheses -Wswitch -Wunused-function -Wno-unused-label -Wno-unused-parameter -Wunused-variable -Wunused-value -Wempty-body -Wconditional-uninitialized -Wno-unknown-pragmas -Wno-shadow -Wno-four-char-constants -Wno-conversion -Wconstant-conversion -Wint-conversion -Wbool-conversion -Wenum-conversion -Wshorten-64-to-32 -Wpointer-sign -Wno-newline-eof -Wno-selector -Wno-strict-selector-match -Wundeclared-selector -Wno-deprecated-implementations -DNS_BLOCK_ASSERTIONS=1 -isysroot /Applications/Xcode.app/Contents/Developer/Platforms/iPhoneOS.platform/Developer/SDKs/iPhoneOS10.2.sdk -fstrict-aliasing -Wprotocol -Wdeprecated-declarations -miphoneos-version-min=7.0 -fvisibility=hidden -Wno-sign-conversion -Wno-infinite-recursion -iquote /Users/Mac/B4iBuild/UploadedProjects/<user id>/build/B4iProject.build/Release-iphoneos/B4iProject.build/TS\ Beta-generated-files.hmap -I/Users/Mac/B4iBuild/UploadedProjects/<user id>/build/B4iProject.build/Release-iphoneos/B4iProject.build/TS\ Beta-own-target-headers.hmap -I/Users/Mac/B4iBuild/UploadedProjects/<user id>/build/B4iProject.build/Release-iphoneos/B4iProject.build/TS\ Beta-all-target-headers.hmap -iquote /Users/Mac/B4iBuild/UploadedProjects/<user id>/build/B4iProject.build/Release-iphoneos/B4iProject.build/TS\ Beta-project-headers.hmap -I/Users/Mac/B4iBuild/UploadedProjects/<user id>/Payload/include -I/Users/Mac/B4iBuild/UploadedProjects/<user id>/build/B4iProject.build/Release-iphoneos/B4iProject.build/DerivedSources/armv7 -I/Users/Mac/B4iBuild/UploadedProjects/<user id>/build/B4iProject.build/Release-iphoneos/B4iProject.build/DerivedSources -F/Users/Mac/B4iBuild/UploadedProjects/<user id>/Payload -F../../Libs -MMD -MT dependencies -MF /Users/Mac/B4iBuild/UploadedProjects/<user id>/build/B4iProject.build/Release-iphoneos/B4iProject.build/Objects-normal/armv7/b4i_pglavna.d --serialize-diagnostics /Users/Mac/B4iBuild/UploadedProjects/<user id>/build/B4iProject.build/Release-iphoneos/B4iProject.build/Objects-normal/armv7/b4i_pglavna.dia -c /Users/Mac/B4iBuild/UploadedProjects/<user id>/B4iProject/b4i_pglavna.m -o /Users/Mac/B4iBuild/UploadedProjects/<user id>/build/B4iProject.build/Release-iphoneos/B4iProject.build/Objects-normal/armv7/b4i_pglavna.o

CompileC build/B4iProject.build/Release-iphoneos/B4iProject.build/Objects-normal/armv7/LS_layglavna.o B4iProject/LS_layglavna.m normal armv7 objective-c com.apple.compilers.llvm.clang.1_0.compiler
cd /Users/Mac/B4iBuild/UploadedProjects/<user id>
export LANG=en_US.US-ASCII
export PATH="/Applications/Xcode.app/Contents/Developer/Platforms/iPhoneOS.platform/Developer/usr/bin:/Applications/Xcode.app/Contents/Developer/usr/bin:/usr/local/bin:/usr/bin:/bin:/usr/sbin:/sbin"
/Applications/Xcode.app/Contents/Developer/Toolchains/XcodeDefault.xctoolchain/usr/bin/clang -x objective-c -arch armv7 -fmessage-length=0 -fdiagnostics-show-note-include-stack -fmacro-backtrace-limit=0 -std=gnu99 -fobjc-arc -fmodules -gmodules -fmodules-prune-interval=86400 -fmodules-prune-after=345600 -fbuild-session-file=/var/folders/bt/ws8wmxhs6t958l92jx4d7xy00000gn/C/org.llvm.clang/ModuleCache/Session.modulevalidation -fmodules-validate-once-per-build-session -Wnon-modular-include-in-framework-module -Werror=non-modular-include-in-framework-module -Wno-trigraphs -fpascal-strings -O0 -Wno-missing-field-initializers -Wno-missing-prototypes -Werror=return-type -Wno-implicit-atomic-properties -Werror=deprecated-objc-isa-usage -Werror=objc-root-class -Wno-arc-repeated-use-of-weak -Wduplicate-method-match -Wno-missing-braces -Wparentheses -Wswitch -Wunused-function -Wno-unused-label -Wno-unused-parameter -Wunused-variable -Wunused-value -Wempty-body -Wconditional-uninitialized -Wno-unknown-pragmas -Wno-shadow -Wno-four-char-constants -Wno-conversion -Wconstant-conversion -Wint-conversion -Wbool-conversion -Wenum-conversion -Wshorten-64-to-32 -Wpointer-sign -Wno-newline-eof -Wno-selector -Wno-strict-selector-match -Wundeclared-selector -Wno-deprecated-implementations -DNS_BLOCK_ASSERTIONS=1 -isysroot /Applications/Xcode.app/Contents/Developer/Platforms/iPhoneOS.platform/Developer/SDKs/iPhoneOS10.2.sdk -fstrict-aliasing -Wprotocol -Wdeprecated-declarations -miphoneos-version-min=7.0 -fvisibility=hidden -Wno-sign-conversion -Wno-infinite-recursion -iquote /Users/Mac/B4iBuild/UploadedProjects/<user id>/build/B4iProject.build/Release-iphoneos/B4iProject.build/TS\ Beta-generated-files.hmap -I/Users/Mac/B4iBuild/UploadedProjects/<user id>/build/B4iProject.build/Release-iphoneos/B4iProject.build/TS\ Beta-own-target-headers.hmap -I/Users/Mac/B4iBuild/UploadedProjects/<user id>/build/B4iProject.build/Release-iphoneos/B4iProject.build/TS\ Beta-all-target-headers.hmap -iquote /Users/Mac/B4iBuild/UploadedProjects/<user id>/build/B4iProject.build/Release-iphoneos/B4iProject.build/TS\ Beta-project-headers.hmap -I/Users/Mac/B4iBuild/UploadedProjects/<user id>/Payload/include -I/Users/Mac/B4iBuild/UploadedProjects/<user id>/build/B4iProject.build/Release-iphoneos/B4iProject.build/DerivedSources/armv7 -I/Users/Mac/B4iBuild/UploadedProjects/<user id>/build/B4iProject.build/Release-iphoneos/B4iProject.build/DerivedSources -F/Users/Mac/B4iBuild/UploadedProjects/<user id>/Payload -F../../Libs -MMD -MT dependencies -MF /Users/Mac/B4iBuild/UploadedProjects/<user id>/build/B4iProject.build/Release-iphoneos/B4iProject.build/Objects-normal/armv7/LS_layglavna.d --serialize-diagnostics /Users/Mac/B4iBuild/UploadedProjects/<user id>/build/B4iProject.build/Release-iphoneos/B4iProject.build/Objects-normal/armv7/LS_layglavna.dia -c /Users/Mac/B4iBuild/UploadedProjects/<user id>/B4iProject/LS_layglavna.m -o /Users/Mac/B4iBuild/UploadedProjects/<user id>/build/B4iProject.build/Release-iphoneos/B4iProject.build/Objects-normal/armv7/LS_layglavna.o

CompileC build/B4iProject.build/Release-iphoneos/B4iProject.build/Objects-normal/armv7/LS_laylevimenu.o B4iProject/LS_laylevimenu.m normal armv7 objective-c com.apple.compilers.llvm.clang.1_0.compiler
cd /Users/Mac/B4iBuild/UploadedProjects/<user id>
export LANG=en_US.US-ASCII
export PATH="/Applications/Xcode.app/Contents/Developer/Platforms/iPhoneOS.platform/Developer/usr/bin:/Applications/Xcode.app/Contents/Developer/usr/bin:/usr/local/bin:/usr/bin:/bin:/usr/sbin:/sbin"
/Applications/Xcode.app/Contents/Developer/Toolchains/XcodeDefault.xctoolchain/usr/bin/clang -x objective-c -arch armv7 -fmessage-length=0 -fdiagnostics-show-note-include-stack -fmacro-backtrace-limit=0 -std=gnu99 -fobjc-arc -fmodules -gmodules -fmodules-prune-interval=86400 -fmodules-prune-after=345600 -fbuild-session-file=/var/folders/bt/ws8wmxhs6t958l92jx4d7xy00000gn/C/org.llvm.clang/ModuleCache/Session.modulevalidation -fmodules-validate-once-per-build-session -Wnon-modular-include-in-framework-module -Werror=non-modular-include-in-framework-module -Wno-trigraphs -fpascal-strings -O0 -Wno-missing-field-initializers -Wno-missing-prototypes -Werror=return-type -Wno-implicit-atomic-properties -Werror=deprecated-objc-isa-usage -Werror=objc-root-class -Wno-arc-repeated-use-of-weak -Wduplicate-method-match -Wno-missing-braces -Wparentheses -Wswitch -Wunused-function -Wno-unused-label -Wno-unused-parameter -Wunused-variable -Wunused-value -Wempty-body -Wconditional-uninitialized -Wno-unknown-pragmas -Wno-shadow -Wno-four-char-constants -Wno-conversion -Wconstant-conversion -Wint-conversion -Wbool-conversion -Wenum-conversion -Wshorten-64-to-32 -Wpointer-sign -Wno-newline-eof -Wno-selector -Wno-strict-selector-match -Wundeclared-selector -Wno-deprecated-implementations -DNS_BLOCK_ASSERTIONS=1 -isysroot /Applications/Xcode.app/Contents/Developer/Platforms/iPhoneOS.platform/Developer/SDKs/iPhoneOS10.2.sdk -fstrict-aliasing -Wprotocol -Wdeprecated-declarations -miphoneos-version-min=7.0 -fvisibility=hidden -Wno-sign-conversion -Wno-infinite-recursion -iquote /Users/Mac/B4iBuild/UploadedProjects/<user id>/build/B4iProject.build/Release-iphoneos/B4iProject.build/TS\ Beta-generated-files.hmap -I/Users/Mac/B4iBuild/UploadedProjects/<user id>/build/B4iProject.build/Release-iphoneos/B4iProject.build/TS\ Beta-own-target-headers.hmap -I/Users/Mac/B4iBuild/UploadedProjects/<user id>/build/B4iProject.build/Release-iphoneos/B4iProject.build/TS\ Beta-all-target-headers.hmap -iquote /Users/Mac/B4iBuild/UploadedProjects/<user id>/build/B4iProject.build/Release-iphoneos/B4iProject.build/TS\ Beta-project-headers.hmap -I/Users/Mac/B4iBuild/UploadedProjects/<user id>/Payload/include -I/Users/Mac/B4iBuild/UploadedProjects/<user id>/build/B4iProject.build/Release-iphoneos/B4iProject.build/DerivedSources/armv7 -I/Users/Mac/B4iBuild/UploadedProjects/<user id>/build/B4iProject.build/Release-iphoneos/B4iProject.build/DerivedSources -F/Users/Mac/B4iBuild/UploadedProjects/<user id>/Payload -F../../Libs -MMD -MT dependencies -MF /Users/Mac/B4iBuild/UploadedProjects/<user id>/build/B4iProject.build/Release-iphoneos/B4iProject.build/Objects-normal/armv7/LS_laylevimenu.d --serialize-diagnostics /Users/Mac/B4iBuild/UploadedProjects/<user id>/build/B4iProject.build/Release-iphoneos/B4iProject.build/Objects-normal/armv7/LS_laylevimenu.dia -c /Users/Mac/B4iBuild/UploadedProjects/<user id>/B4iProject/LS_laylevimenu.m -o /Users/Mac/B4iBuild/UploadedProjects/<user id>/build/B4iProject.build/Release-iphoneos/B4iProject.build/Objects-normal/armv7/LS_laylevimenu.o

Ld Payload/TS\ Beta.app/TS\ Beta normal armv7
cd /Users/Mac/B4iBuild/UploadedProjects/<user id>
export IPHONEOS_DEPLOYMENT_TARGET=7.0
export PATH="/Applications/Xcode.app/Contents/Developer/Platforms/iPhoneOS.platform/Developer/usr/bin:/Applications/Xcode.app/Contents/Developer/usr/bin:/usr/local/bin:/usr/bin:/bin:/usr/sbin:/sbin"
/Applications/Xcode.app/Contents/Developer/Toolchains/XcodeDefault.xctoolchain/usr/bin/clang -arch armv7 -isysroot /Applications/Xcode.app/Contents/Developer/Platforms/iPhoneOS.platform/Developer/SDKs/iPhoneOS10.2.sdk -L/Users/Mac/B4iBuild/UploadedProjects/<user id>/Payload -L../../Libs -F/Users/Mac/B4iBuild/UploadedProjects/<user id>/Payload -F../../Libs -filelist /Users/Mac/B4iBuild/UploadedProjects/<user id>/build/B4iProject.build/Release-iphoneos/B4iProject.build/Objects-normal/armv7/TS\ Beta.LinkFileList -Xlinker -rpath -Xlinker @executable_path/Frameworks -miphoneos-version-min=7.0 -Xlinker -object_path_lto -Xlinker /Users/Mac/B4iBuild/UploadedProjects/<user id>/build/B4iProject.build/Release-iphoneos/B4iProject.build/Objects-normal/armv7/TS\ Beta_lto.o -Xlinker -no_deduplicate -fobjc-arc -fobjc-link-runtime -ObjC -lCore -framework Foundation -framework CoreGraphics -framework UIKit -liJSON -framework AVFoundation -liDebug2 -Xlinker -dependency_info -Xlinker /Users/Mac/B4iBuild/UploadedProjects/<user id>/build/B4iProject.build/Release-iphoneos/B4iProject.build/Objects-normal/armv7/TS\ Beta_dependency_info.dat -o /Users/Mac/B4iBuild/UploadedProjects/<user id>/Payload/TS\ Beta.app/TS\ Beta
ld: warning: object file (../../Libs/libiJSON.a(iJSON.o)) was built for newer iOS version (7.1) than being linked (7.0)
ld: framework not found FileProvider for architecture armv7
clang: error: linker command failed with exit code 1 (use -v to see invocation)


Error: ** BUILD FAILED **


The following build commands failed:
Ld Payload/TS\ Beta.app/TS\ Beta normal armv7
(1 failure)
The same app with same settings are sucessfuly copiled with Hosted Builder.

As I can see in one of recent post Erel writes about minimum OSX version 10.11.5+.
The question is: Is it posible to compile anything with my Mac specification or not with latest b4i?
 
Last edited:

Pendrush

Well-Known Member
Licensed User
Yes, more or less same error with iCore only.
End of error:
ld: framework not found FileProvider for architecture armv7
clang: error: linker command failed with exit code 1 (use -v to see invocation)
 
Last edited:
Top