iOS Question Error Compiling Program - "fatal error: 'B4XEncryption.h' file not found"

MrKim

Well-Known Member
Licensed User
Edit, please see post below for new error log.
I am using the build server.
Well I'm getting close! I bought an old Iphone. Paid my Tribute to Apple and have everything up and running. Compile some example apps to my iphone successfully.
HOWEVER, the app I have been working on (after many hours of research and "#If B4i..." stuff) fails to compile with the following errors.
I hope someone has a clue because I sure don't (although there is something in there about " 'B4XEncryption.h' file not found"
B4X:
B4i Version: 6.50
Parsing code.    (0.20s)
Building folders structure.    (0.36s)
Running custom action.    (0.08s)
Compiling code.    (1.53s)
Compiling layouts code.    (0.01s)
Compiling debugger engine code.    (3.43s)
Building Xcode project    (0.43s)
Sending data to remote compiler.    Error
Error: security: SecKeychainDelete: The specified keychain could not be found.

Out: Build settings from command line:
    ARCHS = arm64
    CODE_SIGN_IDENTITY = iPhone Distribution: Kimberly Mosher (P327BASCK5)
    CONFIGURATION_BUILD_DIR = /Users/administrator/Documents/UploadedProjects/<user id>/Payload
    OTHER_CODE_SIGN_FLAGS = --keychain <user id>
    PRODUCT_NAME = AlAPlist
    PROVISIONING_PROFILE = 4683d90a-e2c2-4015-99b5-37440c6f777a

note: Using new build system
note: Planning build
note: Constructing build description
CreateBuildDirectory /Users/administrator/Documents/UploadedProjects/<user id>/build (in target 'B4iProject' from project 'B4iProject')
    cd /Users/administrator/Documents/UploadedProjects/<user id>
    builtin-create-build-directory /Users/administrator/Documents/UploadedProjects/<user id>/build

MkDir /Users/administrator/Documents/UploadedProjects/<user id>/Payload/AlAPlist.app (in target 'B4iProject' from project 'B4iProject')
    cd /Users/administrator/Documents/UploadedProjects/<user id>
    /bin/mkdir -p /Users/administrator/Documents/UploadedProjects/<user id>/Payload/AlAPlist.app

ProcessProductPackaging /Users/administrator/Library/MobileDevice/Provisioning\ Profiles/4683d90a-e2c2-4015-99b5-37440c6f777a.mobileprovision /Users/administrator/Documents/UploadedProjects/<user id>/Payload/AlAPlist.app/embedded.mobileprovision (in target 'B4iProject' from project 'B4iProject')
    cd /Users/administrator/Documents/UploadedProjects/<user id>
    builtin-productPackagingUtility /Users/administrator/Library/MobileDevice/Provisioning\ Profiles/4683d90a-e2c2-4015-99b5-37440c6f777a.mobileprovision -o /Users/administrator/Documents/UploadedProjects/<user id>/Payload/AlAPlist.app/embedded.mobileprovision

WriteAuxiliaryFile /Users/administrator/Documents/UploadedProjects/<user id>/build/B4iProject.build/Release-iphoneos/B4iProject.build/DerivedSources/Entitlements.plist (in target 'B4iProject' from project 'B4iProject')
    cd /Users/administrator/Documents/UploadedProjects/<user id>
    write-file /Users/administrator/Documents/UploadedProjects/<user id>/build/B4iProject.build/Release-iphoneos/B4iProject.build/DerivedSources/Entitlements.plist

ProcessProductPackaging "" /Users/administrator/Documents/UploadedProjects/<user id>/build/B4iProject.build/Release-iphoneos/B4iProject.build/AlAPlist.app.xcent (in target 'B4iProject' from project 'B4iProject')
    cd /Users/administrator/Documents/UploadedProjects/<user id>
 

Entitlements:

{
    "application-identifier" = "P327BASCK5.com.superlativesoftware.AlAPlist";
    "com.apple.developer.team-identifier" = P327BASCK5;
    "get-task-allow" = 0;
}


    builtin-productPackagingUtility -entitlements -format xml -o /Users/administrator/Documents/UploadedProjects/<user id>/build/B4iProject.build/Release-iphoneos/B4iProject.build/AlAPlist.app.xcent

WriteAuxiliaryFile /Users/administrator/Documents/UploadedProjects/<user id>/build/B4iProject.build/Release-iphoneos/B4iProject.build/all-product-headers.yaml (in target 'B4iProject' from project 'B4iProject')
    cd /Users/administrator/Documents/UploadedProjects/<user id>
    write-file /Users/administrator/Documents/UploadedProjects/<user id>/build/B4iProject.build/Release-iphoneos/B4iProject.build/all-product-headers.yaml

WriteAuxiliaryFile /Users/administrator/Documents/UploadedProjects/<user id>/build/B4iProject.build/Release-iphoneos/B4iProject.build/AlAPlist.hmap (in target 'B4iProject' from project 'B4iProject')
    cd /Users/administrator/Documents/UploadedProjects/<user id>
    write-file /Users/administrator/Documents/UploadedProjects/<user id>/build/B4iProject.build/Release-iphoneos/B4iProject.build/AlAPlist.hmap

WriteAuxiliaryFile /Users/administrator/Documents/UploadedProjects/<user id>/build/B4iProject.build/Release-iphoneos/B4iProject.build/AlAPlist-project-headers.hmap (in target 'B4iProject' from project 'B4iProject')
    cd /Users/administrator/Documents/UploadedProjects/<user id>
    write-file /Users/administrator/Documents/UploadedProjects/<user id>/build/B4iProject.build/Release-iphoneos/B4iProject.build/AlAPlist-project-headers.hmap

WriteAuxiliaryFile /Users/administrator/Documents/UploadedProjects/<user id>/build/B4iProject.build/Release-iphoneos/B4iProject.build/AlAPlist-own-target-headers.hmap (in target 'B4iProject' from project 'B4iProject')
    cd /Users/administrator/Documents/UploadedProjects/<user id>
    write-file /Users/administrator/Documents/UploadedProjects/<user id>/build/B4iProject.build/Release-iphoneos/B4iProject.build/AlAPlist-own-target-headers.hmap

WriteAuxiliaryFile /Users/administrator/Documents/UploadedProjects/<user id>/build/B4iProject.build/Release-iphoneos/B4iProject.build/AlAPlist-generated-files.hmap (in target 'B4iProject' from project 'B4iProject')
    cd /Users/administrator/Documents/UploadedProjects/<user id>
    write-file /Users/administrator/Documents/UploadedProjects/<user id>/build/B4iProject.build/Release-iphoneos/B4iProject.build/AlAPlist-generated-files.hmap

WriteAuxiliaryFile /Users/administrator/Documents/UploadedProjects/<user id>/build/B4iProject.build/Release-iphoneos/B4iProject.build/AlAPlist-all-target-headers.hmap (in target 'B4iProject' from project 'B4iProject')
    cd /Users/administrator/Documents/UploadedProjects/<user id>
    write-file /Users/administrator/Documents/UploadedProjects/<user id>/build/B4iProject.build/Release-iphoneos/B4iProject.build/AlAPlist-all-target-headers.hmap

WriteAuxiliaryFile /Users/administrator/Documents/UploadedProjects/<user id>/build/B4iProject.build/Release-iphoneos/B4iProject.build/AlAPlist-all-non-framework-target-headers.hmap (in target 'B4iProject' from project 'B4iProject')
    cd /Users/administrator/Documents/UploadedProjects/<user id>
    write-file /Users/administrator/Documents/UploadedProjects/<user id>/build/B4iProject.build/Release-iphoneos/B4iProject.build/AlAPlist-all-non-framework-target-headers.hmap

CompileC /Users/administrator/Documents/UploadedProjects/<user id>/build/B4iProject.build/Release-iphoneos/B4iProject.build/Objects-normal/arm64/main.o /Users/administrator/Documents/UploadedProjects/<user id>/B4iProject/main.m normal arm64 objective-c com.apple.compilers.llvm.clang.1_0.compiler (in target 'B4iProject' from project 'B4iProject')
    cd /Users/administrator/Documents/UploadedProjects/<user id>
    export LANG=en_US.US-ASCII
    /Applications/Xcode.app/Contents/Developer/Toolchains/XcodeDefault.xctoolchain/usr/bin/clang -x objective-c -target arm64-apple-ios8.0 -fmessage-length=0 -fdiagnostics-show-note-include-stack -fmacro-backtrace-limit=0 -std=gnu99 -fobjc-arc -fmodules -gmodules -fmodules-prune-interval=86400 -fmodules-prune-after=345600 -fbuild-session-file=/var/folders/35/nx43fs8567l9z_wvvpc35snh0000gn/C/org.llvm.clang/ModuleCache.noindex/Session.modulevalidation -fmodules-validate-once-per-build-session -Wnon-modular-include-in-framework-module -Werror=non-modular-include-in-framework-module -Wno-trigraphs -fpascal-strings -O0 -Wno-missing-field-initializers -Wno-missing-prototypes -Werror=return-type -Wno-implicit-atomic-properties -Werror=deprecated-objc-isa-usage -Wno-objc-interface-ivars -Werror=objc-root-class -Wno-arc-repeated-use-of-weak -Wduplicate-method-match -Wno-missing-braces -Wparentheses -Wswitch -Wunused-function -Wno-unused-label -Wno-unused-parameter -Wunused-variable -Wunused-value -Wempty-body -Wuninitialized -Wconditional-uninitialized -Wno-unknown-pragmas -Wno-shadow -Wno-four-char-constants -Wno-conversion -Wconstant-conversion -Wint-conversion -Wbool-conversion -Wenum-conversion -Wno-float-conversion -Wno-non-literal-null-conversion -Wno-objc-literal-conversion -Wshorten-64-to-32 -Wpointer-sign -Wno-newline-eof -Wno-selector -Wno-strict-selector-match -Wundeclared-selector -Wno-deprecated-implementations -DB4I_VERSION=12 -DNS_BLOCK_ASSERTIONS=1 -DOBJC_OLD_DISPATCH_PROTOTYPES=1 -isysroot /Applications/Xcode.app/Contents/Developer/Platforms/iPhoneOS.platform/Developer/SDKs/iPhoneOS13.2.sdk -fstrict-aliasing -Wprotocol -Wdeprecated-declarations -fvisibility=hidden -Wno-sign-conversion -Wno-infinite-recursion -Wno-comma -Wno-block-capture-autoreleasing -Wno-strict-prototypes -Wno-semicolon-before-method-body -iquote /Users/administrator/Documents/UploadedProjects/<user id>/build/B4iProject.build/Release-iphoneos/B4iProject.build/AlAPlist-generated-files.hmap -I/Users/administrator/Documents/UploadedProjects/<user id>/build/B4iProject.build/Release-iphoneos/B4iProject.build/AlAPlist-own-target-headers.hmap -I/Users/administrator/Documents/UploadedProjects/<user id>/build/B4iProject.build/Release-iphoneos/B4iProject.build/AlAPlist-all-target-headers.hmap -iquote /Users/administrator/Documents/UploadedProjects/<user id>/build/B4iProject.build/Release-iphoneos/B4iProject.build/AlAPlist-project-headers.hmap -I/Users/administrator/Documents/UploadedProjects/<user id>/Payload/include -I/Users/administrator/Documents/UploadedProjects/<user id>/build/B4iProject.build/Release-iphoneos/B4iProject.build/DerivedSources-normal/arm64 -I/Users/administrator/Documents/UploadedProjects/<user id>/build/B4iProject.build/Release-iphoneos/B4iProject.build/DerivedSources/arm64 -I/Users/administrator/Documents/UploadedProjects/<user id>/build/B4iProject.build/Release-iphoneos/B4iProject.build/DerivedSources -F/Users/administrator/Documents/UploadedProjects/<user id>/Payload -F../../Libs -MMD -MT dependencies -MF /Users/administrator/Documents/UploadedProjects/<user id>/build/B4iProject.build/Release-iphoneos/B4iProject.build/Objects-normal/arm64/main.d --serialize-diagnostics /Users/administrator/Documents/UploadedProjects/<user id>/build/B4iProject.build/Release-iphoneos/B4iProject.build/Objects-normal/arm64/main.dia -c /Users/administrator/Documents/UploadedProjects/<user id>/B4iProject/main.m -o /Users/administrator/Documents/UploadedProjects/<user id>/build/B4iProject.build/Release-iphoneos/B4iProject.build/Objects-normal/arm64/main.o

CompileC /Users/administrator/Documents/UploadedProjects/<user id>/build/B4iProject.build/Release-iphoneos/B4iProject.build/Objects-normal/arm64/b4i_testmysql.o /Users/administrator/Documents/UploadedProjects/<user id>/B4iProject/b4i_testmysql.m normal arm64 objective-c com.apple.compilers.llvm.clang.1_0.compiler (in target 'B4iProject' from project 'B4iProject')
    cd /Users/administrator/Documents/UploadedProjects/<user id>
    export LANG=en_US.US-ASCII
    /Applications/Xcode.app/Contents/Developer/Toolchains/XcodeDefault.xctoolchain/usr/bin/clang -x objective-c -target arm64-apple-ios8.0 -fmessage-length=0 -fdiagnostics-show-note-include-stack -fmacro-backtrace-limit=0 -std=gnu99 -fobjc-arc -fmodules -gmodules -fmodules-prune-interval=86400 -fmodules-prune-after=345600 -fbuild-session-file=/var/folders/35/nx43fs8567l9z_wvvpc35snh0000gn/C/org.llvm.clang/ModuleCache.noindex/Session.modulevalidation -fmodules-validate-once-per-build-session -Wnon-modular-include-in-framework-module -Werror=non-modular-include-in-framework-module -Wno-trigraphs -fpascal-strings -O0 -Wno-missing-field-initializers -Wno-missing-prototypes -Werror=return-type -Wno-implicit-atomic-properties -Werror=deprecated-objc-isa-usage -Wno-objc-interface-ivars -Werror=objc-root-class -Wno-arc-repeated-use-of-weak -Wduplicate-method-match -Wno-missing-braces -Wparentheses -Wswitch -Wunused-function -Wno-unused-label -Wno-unused-parameter -Wunused-variable -Wunused-value -Wempty-body -Wuninitialized -Wconditional-uninitialized -Wno-unknown-pragmas -Wno-shadow -Wno-four-char-constants -Wno-conversion -Wconstant-conversion -Wint-conversion -Wbool-conversion -Wenum-conversion -Wno-float-conversion -Wno-non-literal-null-conversion -Wno-objc-literal-conversion -Wshorten-64-to-32 -Wpointer-sign -Wno-newline-eof -Wno-selector -Wno-strict-selector-match -Wundeclared-selector -Wno-deprecated-implementations -DB4I_VERSION=12 -DNS_BLOCK_ASSERTIONS=1 -DOBJC_OLD_DISPATCH_PROTOTYPES=1 -isysroot /Applications/Xcode.app/Contents/Developer/Platforms/iPhoneOS.platform/Developer/SDKs/iPhoneOS13.2.sdk -fstrict-aliasing -Wprotocol -Wdeprecated-declarations -fvisibility=hidden -Wno-sign-conversion -Wno-infinite-recursion -Wno-comma -Wno-block-capture-autoreleasing -Wno-strict-prototypes -Wno-semicolon-before-method-body -iquote /Users/administrator/Documents/UploadedProjects/<user id>/build/B4iProject.build/Release-iphoneos/B4iProject.build/AlAPlist-generated-files.hmap -I/Users/administrator/Documents/UploadedProjects/<user id>/build/B4iProject.build/Release-iphoneos/B4iProject.build/AlAPlist-own-target-headers.hmap -I/Users/administrator/Documents/UploadedProjects/<user id>/build/B4iProject.build/Release-iphoneos/B4iProject.build/AlAPlist-all-target-headers.hmap -iquote /Users/administrator/Documents/UploadedProjects/<user id>/build/B4iProject.build/Release-iphoneos/B4iProject.build/AlAPlist-project-headers.hmap -I/Users/administrator/Documents/UploadedProjects/<user id>/Payload/include -I/Users/administrator/Documents/UploadedProjects/<user id>/build/B4iProject.build/Release-iphoneos/B4iProject.build/DerivedSources-normal/arm64 -I/Users/administrator/Documents/UploadedProjects/<user id>/build/B4iProject.build/Release-iphoneos/B4iProject.build/DerivedSources/arm64 -I/Users/administrator/Documents/UploadedProjects/<user id>/build/B4iProject.build/Release-iphoneos/B4iProject.build/DerivedSources -F/Users/administrator/Documents/UploadedProjects/<user id>/Payload -F../../Libs -MMD -MT dependencies -MF /Users/administrator/Documents/UploadedProjects/<user id>/build/B4iProject.build/Release-iphoneos/B4iProject.build/Objects-normal/arm64/b4i_testmysql.d --serialize-diagnostics /Users/administrator/Documents/UploadedProjects/<user id>/build/B4iProject.build/Release-iphoneos/B4iProject.build/Objects-normal/arm64/b4i_testmysql.dia -c /Users/administrator/Documents/UploadedProjects/<user id>/B4iProject/b4i_testmysql.m -o /Users/administrator/Documents/UploadedProjects/<user id>/build/B4iProject.build/Release-iphoneos/B4iProject.build/Objects-normal/arm64/b4i_testmysql.o
In file included from /Users/administrator/Documents/UploadedProjects/<user id>/B4iProject/b4i_testmysql.m:2:
/Users/administrator/Documents/UploadedProjects/<user id>/B4iProject/b4i_testmysql.h:9:9: fatal error: 'B4XEncryption.h' file not found
#import "B4XEncryption.h"
        ^~~~~~~~~~~~~~~~~

CompileC /Users/administrator/Documents/UploadedProjects/<user id>/build/B4iProject.build/Release-iphoneos/B4iProject.build/Objects-normal/arm64/b4i_swiftbutton.o /Users/administrator/Documents/UploadedProjects/<user id>/B4iProject/b4i_swiftbutton.m normal arm64 objective-c com.apple.compilers.llvm.clang.1_0.compiler (in target 'B4iProject' from project 'B4iProject')
    cd /Users/administrator/Documents/UploadedProjects/<user id>
    export LANG=en_US.US-ASCII
    /Applications/Xcode.app/Contents/Developer/Toolchains/XcodeDefault.xctoolchain/usr/bin/clang -x objective-c -target arm64-apple-ios8.0 -fmessage-length=0 -fdiagnostics-show-note-include-stack -fmacro-backtrace-limit=0 -std=gnu99 -fobjc-arc -fmodules -gmodules -fmodules-prune-interval=86400 -fmodules-prune-after=345600 -fbuild-session-file=/var/folders/35/nx43fs8567l9z_wvvpc35snh0000gn/C/org.llvm.clang/ModuleCache.noindex/Session.modulevalidation -fmodules-validate-once-per-build-session -Wnon-modular-include-in-framework-module -Werror=non-modular-include-in-framework-module -Wno-trigraphs -fpascal-strings -O0 -Wno-missing-field-initializers -Wno-missing-prototypes -Werror=return-type -Wno-implicit-atomic-properties -Werror=deprecated-objc-isa-usage -Wno-objc-interface-ivars -Werror=objc-root-class -Wno-arc-repeated-use-of-weak -Wduplicate-method-match -Wno-missing-braces -Wparentheses -Wswitch -Wunused-function -Wno-unused-label -Wno-unused-parameter -Wunused-variable -Wunused-value -Wempty-body -Wuninitialized -Wconditional-uninitialized -Wno-unknown-pragmas -Wno-shadow -Wno-four-char-constants -Wno-conversion -Wconstant-conversion -Wint-conversion -Wbool-conversion -Wenum-conversion -Wno-float-conversion -Wno-non-literal-null-conversion -Wno-objc-literal-conversion -Wshorten-64-to-32 -Wpointer-sign -Wno-newline-eof -Wno-selector -Wno-strict-selector-match -Wundeclared-selector -Wno-deprecated-implementations -DB4I_VERSION=12 -DNS_BLOCK_ASSERTIONS=1 -DOBJC_OLD_DISPATCH_PROTOTYPES=1 -isysroot /Applications/Xcode.app/Contents/Developer/Platforms/iPhoneOS.platform/Developer/SDKs/iPhoneOS13.2.sdk -fstrict-aliasing -Wprotocol -Wdeprecated-declarations -fvisibility=hidden -Wno-sign-conversion -Wno-infinite-recursion -Wno-comma -Wno-block-capture-autoreleasing -Wno-strict-prototypes -Wno-semicolon-before-method-body -iquote /Users/administrator/Documents/UploadedProjects/<user id>/build/B4iProject.build/Release-iphoneos/B4iProject.build/AlAPlist-generated-files.hmap -I/Users/administrator/Documents/UploadedProjects/<user id>/build/B4iProject.build/Release-iphoneos/B4iProject.build/AlAPlist-own-target-headers.hmap -I/Users/administrator/Documents/UploadedProjects/<user id>/build/B4iProject.build/Release-iphoneos/B4iProject.build/AlAPlist-all-target-headers.hmap -iquote /Users/administrator/Documents/UploadedProjects/<user id>/build/B4iProject.build/Release-iphoneos/B4iProject.build/AlAPlist-project-headers.hmap -I/Users/administrator/Documents/UploadedProjects/<user id>/Payload/include -I/Users/administrator/Documents/UploadedProjects/<user id>/build/B4iProject.build/Release-iphoneos/B4iProject.build/DerivedSources-normal/arm64 -I/Users/administrator/Documents/UploadedProjects/<user id>/build/B4iProject.build/Release-iphoneos/B4iProject.build/DerivedSources/arm64 -I/Users/administrator/Documents/UploadedProjects/<user id>/build/B4iProject.build/Release-iphoneos/B4iProject.build/DerivedSources -F/Users/administrator/Documents/UploadedProjects/<user id>/Payload -F../../Libs -MMD -MT dependencies -MF /Users/administrator/Documents/UploadedProjects/<user id>/build/B4iProject.build/Release-iphoneos/B4iProject.build/Objects-normal/arm64/b4i_swiftbutton.d --serialize-diagnostics /Users/administrator/Documents/UploadedProjects/<user id>/build/B4iProject.build/Release-iphoneos/B4iProject.build/Objects-normal/arm64/b4i_swiftbutton.dia -c /Users/administrator/Documents/UploadedProjects/<user id>/B4iProject/b4i_swiftbutton.m -o /Users/administrator/Documents/UploadedProjects/<user id>/build/B4iProject.build/Release-iphoneos/B4iProject.build/Objects-normal/arm64/b4i_swiftbutton.o
In file included from /Users/administrator/Documents/UploadedProjects/<user id>/B4iProject/b4i_swiftbutton.m:2:
/Users/administrator/Documents/UploadedProjects/<user id>/B4iProject/b4i_swiftbutton.h:9:9: fatal error: 'B4XEncryption.h' file not found
#import "B4XEncryption.h"
        ^~~~~~~~~~~~~~~~~
1 error generated.

CompileC /Users/administrator/Documents/UploadedProjects/<user id>/build/B4iProject.build/Release-iphoneos/B4iProject.build/Objects-normal/arm64/b4i_scrollinglabel.o /Users/administrator/Documents/UploadedProjects/<user id>/B4iProject/b4i_scrollinglabel.m normal arm64 objective-c com.apple.compilers.llvm.clang.1_0.compiler (in target 'B4iProject' from project 'B4iProject')
    cd /Users/administrator/Documents/UploadedProjects/<user id>
    export LANG=en_US.US-ASCII
    /Applications/Xcode.app/Contents/Developer/Toolchains/XcodeDefault.xctoolchain/usr/bin/clang -x objective-c -target arm64-apple-ios8.0 -fmessage-length=0 -fdiagnostics-show-note-include-stack -fmacro-backtrace-limit=0 -std=gnu99 -fobjc-arc -fmodules -gmodules -fmodules-prune-interval=86400 -fmodules-prune-after=345600 -fbuild-session-file=/var/folders/35/nx43fs8567l9z_wvvpc35snh0000gn/C/org.llvm.clang/ModuleCache.noindex/Session.modulevalidation -fmodules-validate-once-per-build-session -Wnon-modular-include-in-framework-module -Werror=non-modular-include-in-framework-module -Wno-trigraphs -fpascal-strings -O0 -Wno-missing-field-initializers -Wno-missing-prototypes -Werror=return-type -Wno-implicit-atomic-properties -Werror=deprecated-objc-isa-usage -Wno-objc-interface-ivars -Werror=objc-root-class -Wno-arc-repeated-use-of-weak -Wduplicate-method-match -Wno-missing-braces -Wparentheses -Wswitch -Wunused-function -Wno-unused-label -Wno-unused-parameter -Wunused-variable -Wunused-value -Wempty-body -Wuninitialized -Wconditional-uninitialized -Wno-unknown-pragmas -Wno-shadow -Wno-four-char-constants -Wno-conversion -Wconstant-conversion -Wint-conversion -Wbool-conversion -Wenum-conversion -Wno-float-conversion -Wno-non-literal-null-conversion -Wno-objc-literal-conversion -Wshorten-64-to-32 -Wpointer-sign -Wno-newline-eof -Wno-selector -Wno-strict-selector-match -Wundeclared-selector -Wno-deprecated-implementations -DB4I_VERSION=12 -DNS_BLOCK_ASSERTIONS=1 -DOBJC_OLD_DISPATCH_PROTOTYPES=1 -isysroot /Applications/Xcode.app/Contents/Developer/Platforms/iPhoneOS.platform/Developer/SDKs/iPhoneOS13.2.sdk -fstrict-aliasing -Wprotocol -Wdeprecated-declarations -fvisibility=hidden -Wno-sign-conversion -Wno-infinite-recursion -Wno-comma -Wno-block-capture-autoreleasing -Wno-strict-prototypes -Wno-semicolon-before-method-body -iquote /Users/administrator/Documents/UploadedProjects/<user id>/build/B4iProject.build/Release-iphoneos/B4iProject.build/AlAPlist-generated-files.hmap -I/Users/administrator/Documents/UploadedProjects/<user id>/build/B4iProject.build/Release-iphoneos/B4iProject.build/AlAPlist-own-target-headers.hmap -I/Users/administrator/Documents/UploadedProjects/<user id>/build/B4iProject.build/Release-iphoneos/B4iProject.build/AlAPlist-all-target-headers.hmap -iquote /Users/administrator/Documents/UploadedProjects/<user id>/build/B4iProject.build/Release-iphoneos/B4iProject.build/AlAPlist-project-headers.hmap -I/Users/administrator/Documents/UploadedProjects/<user id>/Payload/include -I/Users/administrator/Documents/UploadedProjects/<user id>/build/B4iProject.build/Release-iphoneos/B4iProject.build/DerivedSources-normal/arm64 -I/Users/administrator/Documents/UploadedProjects/<user id>/build/B4iProject.build/Release-iphoneos/B4iProject.build/DerivedSources/arm64 -I/Users/administrator/Documents/UploadedProjects/<user id>/build/B4iProject.build/Release-iphoneos/B4iProject.build/DerivedSources -F/Users/administrator/Documents/UploadedProjects/<user id>/Payload -F../../Libs -MMD -MT dependencies -MF /Users/administrator/Documents/UploadedProjects/<user id>/build/B4iProject.build/Release-iphoneos/B4iProject.build/Objects-normal/arm64/b4i_scrollinglabel.d --serialize-diagnostics /Users/administrator/Documents/UploadedProjects/<user id>/build/B4iProject.build/Release-iphoneos/B4iProject.build/Objects-normal/arm64/b4i_scrollinglabel.dia -c /Users/administrator/Documents/UploadedProjects/<user id>/B4iProject/b4i_scrollinglabel.m -o /Users/administrator/Documents/UploadedProjects/<user id>/build/B4iProject.build/Release-iphoneos/B4iProject.build/Objects-normal/arm64/b4i_scrollinglabel.o
In file included from /Users/administrator/Documents/UploadedProjects/<user id>/B4iProject/b4i_scrollinglabel.m:2:
/Users/administrator/Documents/UploadedProjects/<user id>/B4iProject/b4i_scrollinglabel.h:9:9: fatal error: 'B4XEncryption.h' file not found
#import "B4XEncryption.h"
        ^~~~~~~~~~~~~~~~~
1 error generated.

WriteAuxiliaryFile /Users/administrator/Documents/UploadedProjects/<user id>/build/B4iProject.build/Release-iphoneos/B4iProject.build/Objects-normal/arm64/AlAPlist.LinkFileList (in target 'B4iProject' from project 'B4iProject')
    cd /Users/administrator/Documents/UploadedProjects/<user id>
    write-file /Users/administrator/Documents/UploadedProjects/<user id>/build/B4iProject.build/Release-iphoneos/B4iProject.build/Objects-normal/arm64/AlAPlist.LinkFileList

CompileC /Users/administrator/Documents/UploadedProjects/<user id>/build/B4iProject.build/Release-iphoneos/B4iProject.build/Objects-normal/arm64/b4i_roundslider.o /Users/administrator/Documents/UploadedProjects/<user id>/B4iProject/b4i_roundslider.m normal arm64 objective-c com.apple.compilers.llvm.clang.1_0.compiler (in target 'B4iProject' from project 'B4iProject')
    cd /Users/administrator/Documents/UploadedProjects/<user id>
    export LANG=en_US.US-ASCII
    /Applications/Xcode.app/Contents/Developer/Toolchains/XcodeDefault.xctoolchain/usr/bin/clang -x objective-c -target arm64-apple-ios8.0 -fmessage-length=0 -fdiagnostics-show-note-include-stack -fmacro-backtrace-limit=0 -std=gnu99 -fobjc-arc -fmodules -gmodules -fmodules-prune-interval=86400 -fmodules-prune-after=345600 -fbuild-session-file=/var/folders/35/nx43fs8567l9z_wvvpc35snh0000gn/C/org.llvm.clang/ModuleCache.noindex/Session.modulevalidation -fmodules-validate-once-per-build-session -Wnon-modular-include-in-framework-module -Werror=non-modular-include-in-framework-module -Wno-trigraphs -fpascal-strings -O0 -Wno-missing-field-initializers -Wno-missing-prototypes -Werror=return-type -Wno-implicit-atomic-properties -Werror=deprecated-objc-isa-usage -Wno-objc-interface-ivars -Werror=objc-root-class -Wno-arc-repeated-use-of-weak -Wduplicate-method-match -Wno-missing-braces -Wparentheses -Wswitch -Wunused-function -Wno-unused-label -Wno-unused-parameter -Wunused-variable -Wunused-value -Wempty-body -Wuninitialized -Wconditional-uninitialized -Wno-unknown-pragmas -Wno-shadow -Wno-four-char-constants -Wno-conversion -Wconstant-conversion -Wint-conversion -Wbool-conversion -Wenum-conversion -Wno-float-conversion -Wno-non-literal-null-conversion -Wno-objc-literal-conversion -Wshorten-64-to-32 -Wpointer-sign -Wno-newline-eof -Wno-selector -Wno-strict-selector-match -Wundeclared-selector -Wno-deprecated-implementations -DB4I_VERSION=12 -DNS_BLOCK_ASSERTIONS=1 -DOBJC_OLD_DISPATCH_PROTOTYPES=1 -isysroot /Applications/Xcode.app/Contents/Developer/Platforms/iPhoneOS.platform/Developer/SDKs/iPhoneOS13.2.sdk -fstrict-aliasing -Wprotocol -Wdeprecated-declarations -fvisibility=hidden -Wno-sign-conversion -Wno-infinite-recursion -Wno-comma -Wno-block-capture-autoreleasing -Wno-strict-prototypes -Wno-semicolon-before-method-body -iquote /Users/administrator/Documents/UploadedProjects/<user id>/build/B4iProject.build/Release-iphoneos/B4iProject.build/AlAPlist-generated-files.hmap -I/Users/administrator/Documents/UploadedProjects/<user id>/build/B4iProject.build/Release-iphoneos/B4iProject.build/AlAPlist-own-target-headers.hmap -I/Users/administrator/Documents/UploadedProjects/<user id>/build/B4iProject.build/Release-iphoneos/B4iProject.build/AlAPlist-all-target-headers.hmap -iquote /Users/administrator/Documents/UploadedProjects/<user id>/build/B4iProject.build/Release-iphoneos/B4iProject.build/AlAPlist-project-headers.hmap -I/Users/administrator/Documents/UploadedProjects/<user id>/Payload/include -I/Users/administrator/Documents/UploadedProjects/<user id>/build/B4iProject.build/Release-iphoneos/B4iProject.build/DerivedSources-normal/arm64 -I/Users/administrator/Documents/UploadedProjects/<user id>/build/B4iProject.build/Release-iphoneos/B4iProject.build/DerivedSources/arm64 -I/Users/administrator/Documents/UploadedProjects/<user id>/build/B4iProject.build/Release-iphoneos/B4iProject.build/DerivedSources -F/Users/administrator/Documents/UploadedProjects/<user id>/Payload -F../../Libs -MMD -MT dependencies -MF /Users/administrator/Documents/UploadedProjects/<user id>/build/B4iProject.build/Release-iphoneos/B4iProject.build/Objects-normal/arm64/b4i_roundslider.d --serialize-diagnostics /Users/administrator/Documents/UploadedProjects/<user id>/build/B4iProject.build/Release-iphoneos/B4iProject.build/Objects-normal/arm64/b4i_roundslider.dia -c /Users/administrator/Documents/UploadedProjects/<user id>/B4iProject/b4i_roundslider.m -o /Users/administrator/Documents/UploadedProjects/<user id>/build/B4iProject.build/Release-iphoneos/B4iProject.build/Objects-normal/arm64/b4i_roundslider.o
In file included from /Users/administrator/Documents/UploadedProjects/<user id>/B4iProject/b4i_roundslider.m:2:
/Users/administrator/Documents/UploadedProjects/<user id>/B4iProject/b4i_roundslider.h:9:9: fatal error: 'B4XEncryption.h' file not found
#import "B4XEncryption.h"
        ^~~~~~~~~~~~~~~~~


Error: ** BUILD FAILED **


The following build commands failed:
    CompileC /Users/administrator/Documents/UploadedProjects/<user id>/build/B4iProject.build/Release-iphoneos/B4iProject.build/Objects-normal/arm64/b4i_swiftbutton.o /Users/administrator/Documents/UploadedProjects/<user id>/B4iProject/b4i_swiftbutton.m normal arm64 objective-c com.apple.compilers.llvm.clang.1_0.compiler
    CompileC /Users/administrator/Documents/UploadedProjects/<user id>/build/B4iProject.build/Release-iphoneos/B4iProject.build/Objects-normal/arm64/b4i_scrollinglabel.o /Users/administrator/Documents/UploadedProjects/<user id>/B4iProject/b4i_scrollinglabel.m normal arm64 objective-c com.apple.compilers.llvm.clang.1_0.compiler
(2 failures)
Thanks in advance for any help.
I am really excited about getting my first app running in both A, J, and i
 
Last edited:

Semen Matusovskiy

Well-Known Member
Licensed User
#import "B4XEncryption.h" ? I don't see similar headers in my Libs.
Guess, you want to use Cipher (include iEncryption library).
 

MrKim

Well-Known Member
Licensed User
Yes,I am using iEncryption. Encryption is a critical part of my app.
Edit, actually, I guess I am not? But I was loading it as I thought I needed it. I am using B4XCipher. Which is the B4X Encryption Library.
I have it down to one failure, not two. I am not sure exactly what I did to get rid of the one.
Here is the current build log (there was one with a keychain failure but I fixed that).
The only error seems to be fatal error: 'B4XEncryption.h' file not found
B4X:
B4i Version: 6.50
Parsing code.    (0.16s)
Building folders structure.    (0.06s)
Running custom action.    (0.16s)
Compiling code.    (1.26s)
Compiling layouts code.    (0.02s)
Compiling debugger engine code.    (3.28s)
Building Xcode project    (0.19s)
Sending data to remote compiler.    Error
Out: Build settings from command line:
    ARCHS = arm64
    CODE_SIGN_IDENTITY = iPhone Distribution: Kimberly Mosher (P327BASCK5)
    CONFIGURATION_BUILD_DIR = /Users/administrator/Documents/UploadedProjects/<user id>/Payload
    OTHER_CODE_SIGN_FLAGS = --keychain <user id>
    PRODUCT_NAME = AlAPlist
    PROVISIONING_PROFILE = 4683d90a-e2c2-4015-99b5-37440c6f777a

note: Using new build system
note: Planning build
note: Constructing build description
CreateBuildDirectory /Users/administrator/Documents/UploadedProjects/<user id>/build (in target 'B4iProject' from project 'B4iProject')
    cd /Users/administrator/Documents/UploadedProjects/<user id>
    builtin-create-build-directory /Users/administrator/Documents/UploadedProjects/<user id>/build

MkDir /Users/administrator/Documents/UploadedProjects/<user id>/Payload/AlAPlist.app (in target 'B4iProject' from project 'B4iProject')
    cd /Users/administrator/Documents/UploadedProjects/<user id>
    /bin/mkdir -p /Users/administrator/Documents/UploadedProjects/<user id>/Payload/AlAPlist.app

ProcessProductPackaging /Users/administrator/Library/MobileDevice/Provisioning\ Profiles/4683d90a-e2c2-4015-99b5-37440c6f777a.mobileprovision /Users/administrator/Documents/UploadedProjects/<user id>/Payload/AlAPlist.app/embedded.mobileprovision (in target 'B4iProject' from project 'B4iProject')
    cd /Users/administrator/Documents/UploadedProjects/<user id>
    builtin-productPackagingUtility /Users/administrator/Library/MobileDevice/Provisioning\ Profiles/4683d90a-e2c2-4015-99b5-37440c6f777a.mobileprovision -o /Users/administrator/Documents/UploadedProjects/<user id>/Payload/AlAPlist.app/embedded.mobileprovision

WriteAuxiliaryFile /Users/administrator/Documents/UploadedProjects/<user id>/build/B4iProject.build/Release-iphoneos/B4iProject.build/DerivedSources/Entitlements.plist (in target 'B4iProject' from project 'B4iProject')
    cd /Users/administrator/Documents/UploadedProjects/<user id>
    write-file /Users/administrator/Documents/UploadedProjects/<user id>/build/B4iProject.build/Release-iphoneos/B4iProject.build/DerivedSources/Entitlements.plist

ProcessProductPackaging "" /Users/administrator/Documents/UploadedProjects/<user id>/build/B4iProject.build/Release-iphoneos/B4iProject.build/AlAPlist.app.xcent (in target 'B4iProject' from project 'B4iProject')
    cd /Users/administrator/Documents/UploadedProjects/<user id>
   

Entitlements:

{
    "application-identifier" = "P327BASCK5.com.superlativesoftware.AlAPlist";
    "com.apple.developer.team-identifier" = P327BASCK5;
    "get-task-allow" = 0;
}


    builtin-productPackagingUtility -entitlements -format xml -o /Users/administrator/Documents/UploadedProjects/<user id>/build/B4iProject.build/Release-iphoneos/B4iProject.build/AlAPlist.app.xcent

WriteAuxiliaryFile /Users/administrator/Documents/UploadedProjects/<user id>/build/B4iProject.build/Release-iphoneos/B4iProject.build/all-product-headers.yaml (in target 'B4iProject' from project 'B4iProject')
    cd /Users/administrator/Documents/UploadedProjects/<user id>
    write-file /Users/administrator/Documents/UploadedProjects/<user id>/build/B4iProject.build/Release-iphoneos/B4iProject.build/all-product-headers.yaml

WriteAuxiliaryFile /Users/administrator/Documents/UploadedProjects/<user id>/build/B4iProject.build/Release-iphoneos/B4iProject.build/AlAPlist.hmap (in target 'B4iProject' from project 'B4iProject')
    cd /Users/administrator/Documents/UploadedProjects/<user id>
    write-file /Users/administrator/Documents/UploadedProjects/<user id>/build/B4iProject.build/Release-iphoneos/B4iProject.build/AlAPlist.hmap

WriteAuxiliaryFile /Users/administrator/Documents/UploadedProjects/<user id>/build/B4iProject.build/Release-iphoneos/B4iProject.build/AlAPlist-project-headers.hmap (in target 'B4iProject' from project 'B4iProject')
    cd /Users/administrator/Documents/UploadedProjects/<user id>
    write-file /Users/administrator/Documents/UploadedProjects/<user id>/build/B4iProject.build/Release-iphoneos/B4iProject.build/AlAPlist-project-headers.hmap

WriteAuxiliaryFile /Users/administrator/Documents/UploadedProjects/<user id>/build/B4iProject.build/Release-iphoneos/B4iProject.build/AlAPlist-own-target-headers.hmap (in target 'B4iProject' from project 'B4iProject')
    cd /Users/administrator/Documents/UploadedProjects/<user id>
    write-file /Users/administrator/Documents/UploadedProjects/<user id>/build/B4iProject.build/Release-iphoneos/B4iProject.build/AlAPlist-own-target-headers.hmap

WriteAuxiliaryFile /Users/administrator/Documents/UploadedProjects/<user id>/build/B4iProject.build/Release-iphoneos/B4iProject.build/AlAPlist-generated-files.hmap (in target 'B4iProject' from project 'B4iProject')
    cd /Users/administrator/Documents/UploadedProjects/<user id>
    write-file /Users/administrator/Documents/UploadedProjects/<user id>/build/B4iProject.build/Release-iphoneos/B4iProject.build/AlAPlist-generated-files.hmap

WriteAuxiliaryFile /Users/administrator/Documents/UploadedProjects/<user id>/build/B4iProject.build/Release-iphoneos/B4iProject.build/AlAPlist-all-target-headers.hmap (in target 'B4iProject' from project 'B4iProject')
    cd /Users/administrator/Documents/UploadedProjects/<user id>
    write-file /Users/administrator/Documents/UploadedProjects/<user id>/build/B4iProject.build/Release-iphoneos/B4iProject.build/AlAPlist-all-target-headers.hmap

WriteAuxiliaryFile /Users/administrator/Documents/UploadedProjects/<user id>/build/B4iProject.build/Release-iphoneos/B4iProject.build/AlAPlist-all-non-framework-target-headers.hmap (in target 'B4iProject' from project 'B4iProject')
    cd /Users/administrator/Documents/UploadedProjects/<user id>
    write-file /Users/administrator/Documents/UploadedProjects/<user id>/build/B4iProject.build/Release-iphoneos/B4iProject.build/AlAPlist-all-non-framework-target-headers.hmap

CompileC /Users/administrator/Documents/UploadedProjects/<user id>/build/B4iProject.build/Release-iphoneos/B4iProject.build/Objects-normal/arm64/main.o /Users/administrator/Documents/UploadedProjects/<user id>/B4iProject/main.m normal arm64 objective-c com.apple.compilers.llvm.clang.1_0.compiler (in target 'B4iProject' from project 'B4iProject')
    cd /Users/administrator/Documents/UploadedProjects/<user id>
    export LANG=en_US.US-ASCII
    /Applications/Xcode.app/Contents/Developer/Toolchains/XcodeDefault.xctoolchain/usr/bin/clang -x objective-c -target arm64-apple-ios8.0 -fmessage-length=0 -fdiagnostics-show-note-include-stack -fmacro-backtrace-limit=0 -std=gnu99 -fobjc-arc -fmodules -gmodules -fmodules-prune-interval=86400 -fmodules-prune-after=345600 -fbuild-session-file=/var/folders/35/nx43fs8567l9z_wvvpc35snh0000gn/C/org.llvm.clang/ModuleCache.noindex/Session.modulevalidation -fmodules-validate-once-per-build-session -Wnon-modular-include-in-framework-module -Werror=non-modular-include-in-framework-module -Wno-trigraphs -fpascal-strings -O0 -Wno-missing-field-initializers -Wno-missing-prototypes -Werror=return-type -Wno-implicit-atomic-properties -Werror=deprecated-objc-isa-usage -Wno-objc-interface-ivars -Werror=objc-root-class -Wno-arc-repeated-use-of-weak -Wduplicate-method-match -Wno-missing-braces -Wparentheses -Wswitch -Wunused-function -Wno-unused-label -Wno-unused-parameter -Wunused-variable -Wunused-value -Wempty-body -Wuninitialized -Wconditional-uninitialized -Wno-unknown-pragmas -Wno-shadow -Wno-four-char-constants -Wno-conversion -Wconstant-conversion -Wint-conversion -Wbool-conversion -Wenum-conversion -Wno-float-conversion -Wno-non-literal-null-conversion -Wno-objc-literal-conversion -Wshorten-64-to-32 -Wpointer-sign -Wno-newline-eof -Wno-selector -Wno-strict-selector-match -Wundeclared-selector -Wno-deprecated-implementations -DB4I_VERSION=12 -DNS_BLOCK_ASSERTIONS=1 -DOBJC_OLD_DISPATCH_PROTOTYPES=1 -isysroot /Applications/Xcode.app/Contents/Developer/Platforms/iPhoneOS.platform/Developer/SDKs/iPhoneOS13.2.sdk -fstrict-aliasing -Wprotocol -Wdeprecated-declarations -fvisibility=hidden -Wno-sign-conversion -Wno-infinite-recursion -Wno-comma -Wno-block-capture-autoreleasing -Wno-strict-prototypes -Wno-semicolon-before-method-body -iquote /Users/administrator/Documents/UploadedProjects/<user id>/build/B4iProject.build/Release-iphoneos/B4iProject.build/AlAPlist-generated-files.hmap -I/Users/administrator/Documents/UploadedProjects/<user id>/build/B4iProject.build/Release-iphoneos/B4iProject.build/AlAPlist-own-target-headers.hmap -I/Users/administrator/Documents/UploadedProjects/<user id>/build/B4iProject.build/Release-iphoneos/B4iProject.build/AlAPlist-all-target-headers.hmap -iquote /Users/administrator/Documents/UploadedProjects/<user id>/build/B4iProject.build/Release-iphoneos/B4iProject.build/AlAPlist-project-headers.hmap -I/Users/administrator/Documents/UploadedProjects/<user id>/Payload/include -I/Users/administrator/Documents/UploadedProjects/<user id>/build/B4iProject.build/Release-iphoneos/B4iProject.build/DerivedSources-normal/arm64 -I/Users/administrator/Documents/UploadedProjects/<user id>/build/B4iProject.build/Release-iphoneos/B4iProject.build/DerivedSources/arm64 -I/Users/administrator/Documents/UploadedProjects/<user id>/build/B4iProject.build/Release-iphoneos/B4iProject.build/DerivedSources -F/Users/administrator/Documents/UploadedProjects/<user id>/Payload -F../../Libs -MMD -MT dependencies -MF /Users/administrator/Documents/UploadedProjects/<user id>/build/B4iProject.build/Release-iphoneos/B4iProject.build/Objects-normal/arm64/main.d --serialize-diagnostics /Users/administrator/Documents/UploadedProjects/<user id>/build/B4iProject.build/Release-iphoneos/B4iProject.build/Objects-normal/arm64/main.dia -c /Users/administrator/Documents/UploadedProjects/<user id>/B4iProject/main.m -o /Users/administrator/Documents/UploadedProjects/<user id>/build/B4iProject.build/Release-iphoneos/B4iProject.build/Objects-normal/arm64/main.o

CompileC /Users/administrator/Documents/UploadedProjects/<user id>/build/B4iProject.build/Release-iphoneos/B4iProject.build/Objects-normal/arm64/b4i_testmysql.o /Users/administrator/Documents/UploadedProjects/<user id>/B4iProject/b4i_testmysql.m normal arm64 objective-c com.apple.compilers.llvm.clang.1_0.compiler (in target 'B4iProject' from project 'B4iProject')
    cd /Users/administrator/Documents/UploadedProjects/<user id>
    export LANG=en_US.US-ASCII
    /Applications/Xcode.app/Contents/Developer/Toolchains/XcodeDefault.xctoolchain/usr/bin/clang -x objective-c -target arm64-apple-ios8.0 -fmessage-length=0 -fdiagnostics-show-note-include-stack -fmacro-backtrace-limit=0 -std=gnu99 -fobjc-arc -fmodules -gmodules -fmodules-prune-interval=86400 -fmodules-prune-after=345600 -fbuild-session-file=/var/folders/35/nx43fs8567l9z_wvvpc35snh0000gn/C/org.llvm.clang/ModuleCache.noindex/Session.modulevalidation -fmodules-validate-once-per-build-session -Wnon-modular-include-in-framework-module -Werror=non-modular-include-in-framework-module -Wno-trigraphs -fpascal-strings -O0 -Wno-missing-field-initializers -Wno-missing-prototypes -Werror=return-type -Wno-implicit-atomic-properties -Werror=deprecated-objc-isa-usage -Wno-objc-interface-ivars -Werror=objc-root-class -Wno-arc-repeated-use-of-weak -Wduplicate-method-match -Wno-missing-braces -Wparentheses -Wswitch -Wunused-function -Wno-unused-label -Wno-unused-parameter -Wunused-variable -Wunused-value -Wempty-body -Wuninitialized -Wconditional-uninitialized -Wno-unknown-pragmas -Wno-shadow -Wno-four-char-constants -Wno-conversion -Wconstant-conversion -Wint-conversion -Wbool-conversion -Wenum-conversion -Wno-float-conversion -Wno-non-literal-null-conversion -Wno-objc-literal-conversion -Wshorten-64-to-32 -Wpointer-sign -Wno-newline-eof -Wno-selector -Wno-strict-selector-match -Wundeclared-selector -Wno-deprecated-implementations -DB4I_VERSION=12 -DNS_BLOCK_ASSERTIONS=1 -DOBJC_OLD_DISPATCH_PROTOTYPES=1 -isysroot /Applications/Xcode.app/Contents/Developer/Platforms/iPhoneOS.platform/Developer/SDKs/iPhoneOS13.2.sdk -fstrict-aliasing -Wprotocol -Wdeprecated-declarations -fvisibility=hidden -Wno-sign-conversion -Wno-infinite-recursion -Wno-comma -Wno-block-capture-autoreleasing -Wno-strict-prototypes -Wno-semicolon-before-method-body -iquote /Users/administrator/Documents/UploadedProjects/<user id>/build/B4iProject.build/Release-iphoneos/B4iProject.build/AlAPlist-generated-files.hmap -I/Users/administrator/Documents/UploadedProjects/<user id>/build/B4iProject.build/Release-iphoneos/B4iProject.build/AlAPlist-own-target-headers.hmap -I/Users/administrator/Documents/UploadedProjects/<user id>/build/B4iProject.build/Release-iphoneos/B4iProject.build/AlAPlist-all-target-headers.hmap -iquote /Users/administrator/Documents/UploadedProjects/<user id>/build/B4iProject.build/Release-iphoneos/B4iProject.build/AlAPlist-project-headers.hmap -I/Users/administrator/Documents/UploadedProjects/<user id>/Payload/include -I/Users/administrator/Documents/UploadedProjects/<user id>/build/B4iProject.build/Release-iphoneos/B4iProject.build/DerivedSources-normal/arm64 -I/Users/administrator/Documents/UploadedProjects/<user id>/build/B4iProject.build/Release-iphoneos/B4iProject.build/DerivedSources/arm64 -I/Users/administrator/Documents/UploadedProjects/<user id>/build/B4iProject.build/Release-iphoneos/B4iProject.build/DerivedSources -F/Users/administrator/Documents/UploadedProjects/<user id>/Payload -F../../Libs -MMD -MT dependencies -MF /Users/administrator/Documents/UploadedProjects/<user id>/build/B4iProject.build/Release-iphoneos/B4iProject.build/Objects-normal/arm64/b4i_testmysql.d --serialize-diagnostics /Users/administrator/Documents/UploadedProjects/<user id>/build/B4iProject.build/Release-iphoneos/B4iProject.build/Objects-normal/arm64/b4i_testmysql.dia -c /Users/administrator/Documents/UploadedProjects/<user id>/B4iProject/b4i_testmysql.m -o /Users/administrator/Documents/UploadedProjects/<user id>/build/B4iProject.build/Release-iphoneos/B4iProject.build/Objects-normal/arm64/b4i_testmysql.o
In file included from /Users/administrator/Documents/UploadedProjects/<user id>/B4iProject/b4i_testmysql.m:2:
/Users/administrator/Documents/UploadedProjects/<user id>/B4iProject/b4i_testmysql.h:6:9: fatal error: 'B4XEncryption.h' file not found
#import "B4XEncryption.h"
        ^~~~~~~~~~~~~~~~~

CompileC /Users/administrator/Documents/UploadedProjects/<user id>/build/B4iProject.build/Release-iphoneos/B4iProject.build/Objects-normal/arm64/b4i_scrollinglabel.o /Users/administrator/Documents/UploadedProjects/<user id>/B4iProject/b4i_scrollinglabel.m normal arm64 objective-c com.apple.compilers.llvm.clang.1_0.compiler (in target 'B4iProject' from project 'B4iProject')
    cd /Users/administrator/Documents/UploadedProjects/<user id>
    export LANG=en_US.US-ASCII
    /Applications/Xcode.app/Contents/Developer/Toolchains/XcodeDefault.xctoolchain/usr/bin/clang -x objective-c -target arm64-apple-ios8.0 -fmessage-length=0 -fdiagnostics-show-note-include-stack -fmacro-backtrace-limit=0 -std=gnu99 -fobjc-arc -fmodules -gmodules -fmodules-prune-interval=86400 -fmodules-prune-after=345600 -fbuild-session-file=/var/folders/35/nx43fs8567l9z_wvvpc35snh0000gn/C/org.llvm.clang/ModuleCache.noindex/Session.modulevalidation -fmodules-validate-once-per-build-session -Wnon-modular-include-in-framework-module -Werror=non-modular-include-in-framework-module -Wno-trigraphs -fpascal-strings -O0 -Wno-missing-field-initializers -Wno-missing-prototypes -Werror=return-type -Wno-implicit-atomic-properties -Werror=deprecated-objc-isa-usage -Wno-objc-interface-ivars -Werror=objc-root-class -Wno-arc-repeated-use-of-weak -Wduplicate-method-match -Wno-missing-braces -Wparentheses -Wswitch -Wunused-function -Wno-unused-label -Wno-unused-parameter -Wunused-variable -Wunused-value -Wempty-body -Wuninitialized -Wconditional-uninitialized -Wno-unknown-pragmas -Wno-shadow -Wno-four-char-constants -Wno-conversion -Wconstant-conversion -Wint-conversion -Wbool-conversion -Wenum-conversion -Wno-float-conversion -Wno-non-literal-null-conversion -Wno-objc-literal-conversion -Wshorten-64-to-32 -Wpointer-sign -Wno-newline-eof -Wno-selector -Wno-strict-selector-match -Wundeclared-selector -Wno-deprecated-implementations -DB4I_VERSION=12 -DNS_BLOCK_ASSERTIONS=1 -DOBJC_OLD_DISPATCH_PROTOTYPES=1 -isysroot /Applications/Xcode.app/Contents/Developer/Platforms/iPhoneOS.platform/Developer/SDKs/iPhoneOS13.2.sdk -fstrict-aliasing -Wprotocol -Wdeprecated-declarations -fvisibility=hidden -Wno-sign-conversion -Wno-infinite-recursion -Wno-comma -Wno-block-capture-autoreleasing -Wno-strict-prototypes -Wno-semicolon-before-method-body -iquote /Users/administrator/Documents/UploadedProjects/<user id>/build/B4iProject.build/Release-iphoneos/B4iProject.build/AlAPlist-generated-files.hmap -I/Users/administrator/Documents/UploadedProjects/<user id>/build/B4iProject.build/Release-iphoneos/B4iProject.build/AlAPlist-own-target-headers.hmap -I/Users/administrator/Documents/UploadedProjects/<user id>/build/B4iProject.build/Release-iphoneos/B4iProject.build/AlAPlist-all-target-headers.hmap -iquote /Users/administrator/Documents/UploadedProjects/<user id>/build/B4iProject.build/Release-iphoneos/B4iProject.build/AlAPlist-project-headers.hmap -I/Users/administrator/Documents/UploadedProjects/<user id>/Payload/include -I/Users/administrator/Documents/UploadedProjects/<user id>/build/B4iProject.build/Release-iphoneos/B4iProject.build/DerivedSources-normal/arm64 -I/Users/administrator/Documents/UploadedProjects/<user id>/build/B4iProject.build/Release-iphoneos/B4iProject.build/DerivedSources/arm64 -I/Users/administrator/Documents/UploadedProjects/<user id>/build/B4iProject.build/Release-iphoneos/B4iProject.build/DerivedSources -F/Users/administrator/Documents/UploadedProjects/<user id>/Payload -F../../Libs -MMD -MT dependencies -MF /Users/administrator/Documents/UploadedProjects/<user id>/build/B4iProject.build/Release-iphoneos/B4iProject.build/Objects-normal/arm64/b4i_scrollinglabel.d --serialize-diagnostics /Users/administrator/Documents/UploadedProjects/<user id>/build/B4iProject.build/Release-iphoneos/B4iProject.build/Objects-normal/arm64/b4i_scrollinglabel.dia -c /Users/administrator/Documents/UploadedProjects/<user id>/B4iProject/b4i_scrollinglabel.m -o /Users/administrator/Documents/UploadedProjects/<user id>/build/B4iProject.build/Release-iphoneos/B4iProject.build/Objects-normal/arm64/b4i_scrollinglabel.o
In file included from /Users/administrator/Documents/UploadedProjects/<user id>/B4iProject/b4i_scrollinglabel.m:2:
/Users/administrator/Documents/UploadedProjects/<user id>/B4iProject/b4i_scrollinglabel.h:6:9: fatal error: 'B4XEncryption.h' file not found
#import "B4XEncryption.h"
        ^~~~~~~~~~~~~~~~~

CompileC /Users/administrator/Documents/UploadedProjects/<user id>/build/B4iProject.build/Release-iphoneos/B4iProject.build/Objects-normal/arm64/b4i_swiftbutton.o /Users/administrator/Documents/UploadedProjects/<user id>/B4iProject/b4i_swiftbutton.m normal arm64 objective-c com.apple.compilers.llvm.clang.1_0.compiler (in target 'B4iProject' from project 'B4iProject')
    cd /Users/administrator/Documents/UploadedProjects/<user id>
    export LANG=en_US.US-ASCII
    /Applications/Xcode.app/Contents/Developer/Toolchains/XcodeDefault.xctoolchain/usr/bin/clang -x objective-c -target arm64-apple-ios8.0 -fmessage-length=0 -fdiagnostics-show-note-include-stack -fmacro-backtrace-limit=0 -std=gnu99 -fobjc-arc -fmodules -gmodules -fmodules-prune-interval=86400 -fmodules-prune-after=345600 -fbuild-session-file=/var/folders/35/nx43fs8567l9z_wvvpc35snh0000gn/C/org.llvm.clang/ModuleCache.noindex/Session.modulevalidation -fmodules-validate-once-per-build-session -Wnon-modular-include-in-framework-module -Werror=non-modular-include-in-framework-module -Wno-trigraphs -fpascal-strings -O0 -Wno-missing-field-initializers -Wno-missing-prototypes -Werror=return-type -Wno-implicit-atomic-properties -Werror=deprecated-objc-isa-usage -Wno-objc-interface-ivars -Werror=objc-root-class -Wno-arc-repeated-use-of-weak -Wduplicate-method-match -Wno-missing-braces -Wparentheses -Wswitch -Wunused-function -Wno-unused-label -Wno-unused-parameter -Wunused-variable -Wunused-value -Wempty-body -Wuninitialized -Wconditional-uninitialized -Wno-unknown-pragmas -Wno-shadow -Wno-four-char-constants -Wno-conversion -Wconstant-conversion -Wint-conversion -Wbool-conversion -Wenum-conversion -Wno-float-conversion -Wno-non-literal-null-conversion -Wno-objc-literal-conversion -Wshorten-64-to-32 -Wpointer-sign -Wno-newline-eof -Wno-selector -Wno-strict-selector-match -Wundeclared-selector -Wno-deprecated-implementations -DB4I_VERSION=12 -DNS_BLOCK_ASSERTIONS=1 -DOBJC_OLD_DISPATCH_PROTOTYPES=1 -isysroot /Applications/Xcode.app/Contents/Developer/Platforms/iPhoneOS.platform/Developer/SDKs/iPhoneOS13.2.sdk -fstrict-aliasing -Wprotocol -Wdeprecated-declarations -fvisibility=hidden -Wno-sign-conversion -Wno-infinite-recursion -Wno-comma -Wno-block-capture-autoreleasing -Wno-strict-prototypes -Wno-semicolon-before-method-body -iquote /Users/administrator/Documents/UploadedProjects/<user id>/build/B4iProject.build/Release-iphoneos/B4iProject.build/AlAPlist-generated-files.hmap -I/Users/administrator/Documents/UploadedProjects/<user id>/build/B4iProject.build/Release-iphoneos/B4iProject.build/AlAPlist-own-target-headers.hmap -I/Users/administrator/Documents/UploadedProjects/<user id>/build/B4iProject.build/Release-iphoneos/B4iProject.build/AlAPlist-all-target-headers.hmap -iquote /Users/administrator/Documents/UploadedProjects/<user id>/build/B4iProject.build/Release-iphoneos/B4iProject.build/AlAPlist-project-headers.hmap -I/Users/administrator/Documents/UploadedProjects/<user id>/Payload/include -I/Users/administrator/Documents/UploadedProjects/<user id>/build/B4iProject.build/Release-iphoneos/B4iProject.build/DerivedSources-normal/arm64 -I/Users/administrator/Documents/UploadedProjects/<user id>/build/B4iProject.build/Release-iphoneos/B4iProject.build/DerivedSources/arm64 -I/Users/administrator/Documents/UploadedProjects/<user id>/build/B4iProject.build/Release-iphoneos/B4iProject.build/DerivedSources -F/Users/administrator/Documents/UploadedProjects/<user id>/Payload -F../../Libs -MMD -MT dependencies -MF /Users/administrator/Documents/UploadedProjects/<user id>/build/B4iProject.build/Release-iphoneos/B4iProject.build/Objects-normal/arm64/b4i_swiftbutton.d --serialize-diagnostics /Users/administrator/Documents/UploadedProjects/<user id>/build/B4iProject.build/Release-iphoneos/B4iProject.build/Objects-normal/arm64/b4i_swiftbutton.dia -c /Users/administrator/Documents/UploadedProjects/<user id>/B4iProject/b4i_swiftbutton.m -o /Users/administrator/Documents/UploadedProjects/<user id>/build/B4iProject.build/Release-iphoneos/B4iProject.build/Objects-normal/arm64/b4i_swiftbutton.o
In file included from /Users/administrator/Documents/UploadedProjects/<user id>/B4iProject/b4i_swiftbutton.m:2:
/Users/administrator/Documents/UploadedProjects/<user id>/B4iProject/b4i_swiftbutton.h:6:9: fatal error: 'B4XEncryption.h' file not found
#import "B4XEncryption.h"
        ^~~~~~~~~~~~~~~~~
1 error generated.

WriteAuxiliaryFile /Users/administrator/Documents/UploadedProjects/<user id>/build/B4iProject.build/Release-iphoneos/B4iProject.build/Objects-normal/arm64/AlAPlist.LinkFileList (in target 'B4iProject' from project 'B4iProject')
    cd /Users/administrator/Documents/UploadedProjects/<user id>
    write-file /Users/administrator/Documents/UploadedProjects/<user id>/build/B4iProject.build/Release-iphoneos/B4iProject.build/Objects-normal/arm64/AlAPlist.LinkFileList

CompileC /Users/administrator/Documents/UploadedProjects/<user id>/build/B4iProject.build/Release-iphoneos/B4iProject.build/Objects-normal/arm64/b4i_roundslider.o /Users/administrator/Documents/UploadedProjects/<user id>/B4iProject/b4i_roundslider.m normal arm64 objective-c com.apple.compilers.llvm.clang.1_0.compiler (in target 'B4iProject' from project 'B4iProject')
    cd /Users/administrator/Documents/UploadedProjects/<user id>
    export LANG=en_US.US-ASCII
    /Applications/Xcode.app/Contents/Developer/Toolchains/XcodeDefault.xctoolchain/usr/bin/clang -x objective-c -target arm64-apple-ios8.0 -fmessage-length=0 -fdiagnostics-show-note-include-stack -fmacro-backtrace-limit=0 -std=gnu99 -fobjc-arc -fmodules -gmodules -fmodules-prune-interval=86400 -fmodules-prune-after=345600 -fbuild-session-file=/var/folders/35/nx43fs8567l9z_wvvpc35snh0000gn/C/org.llvm.clang/ModuleCache.noindex/Session.modulevalidation -fmodules-validate-once-per-build-session -Wnon-modular-include-in-framework-module -Werror=non-modular-include-in-framework-module -Wno-trigraphs -fpascal-strings -O0 -Wno-missing-field-initializers -Wno-missing-prototypes -Werror=return-type -Wno-implicit-atomic-properties -Werror=deprecated-objc-isa-usage -Wno-objc-interface-ivars -Werror=objc-root-class -Wno-arc-repeated-use-of-weak -Wduplicate-method-match -Wno-missing-braces -Wparentheses -Wswitch -Wunused-function -Wno-unused-label -Wno-unused-parameter -Wunused-variable -Wunused-value -Wempty-body -Wuninitialized -Wconditional-uninitialized -Wno-unknown-pragmas -Wno-shadow -Wno-four-char-constants -Wno-conversion -Wconstant-conversion -Wint-conversion -Wbool-conversion -Wenum-conversion -Wno-float-conversion -Wno-non-literal-null-conversion -Wno-objc-literal-conversion -Wshorten-64-to-32 -Wpointer-sign -Wno-newline-eof -Wno-selector -Wno-strict-selector-match -Wundeclared-selector -Wno-deprecated-implementations -DB4I_VERSION=12 -DNS_BLOCK_ASSERTIONS=1 -DOBJC_OLD_DISPATCH_PROTOTYPES=1 -isysroot /Applications/Xcode.app/Contents/Developer/Platforms/iPhoneOS.platform/Developer/SDKs/iPhoneOS13.2.sdk -fstrict-aliasing -Wprotocol -Wdeprecated-declarations -fvisibility=hidden -Wno-sign-conversion -Wno-infinite-recursion -Wno-comma -Wno-block-capture-autoreleasing -Wno-strict-prototypes -Wno-semicolon-before-method-body -iquote /Users/administrator/Documents/UploadedProjects/<user id>/build/B4iProject.build/Release-iphoneos/B4iProject.build/AlAPlist-generated-files.hmap -I/Users/administrator/Documents/UploadedProjects/<user id>/build/B4iProject.build/Release-iphoneos/B4iProject.build/AlAPlist-own-target-headers.hmap -I/Users/administrator/Documents/UploadedProjects/<user id>/build/B4iProject.build/Release-iphoneos/B4iProject.build/AlAPlist-all-target-headers.hmap -iquote /Users/administrator/Documents/UploadedProjects/<user id>/build/B4iProject.build/Release-iphoneos/B4iProject.build/AlAPlist-project-headers.hmap -I/Users/administrator/Documents/UploadedProjects/<user id>/Payload/include -I/Users/administrator/Documents/UploadedProjects/<user id>/build/B4iProject.build/Release-iphoneos/B4iProject.build/DerivedSources-normal/arm64 -I/Users/administrator/Documents/UploadedProjects/<user id>/build/B4iProject.build/Release-iphoneos/B4iProject.build/DerivedSources/arm64 -I/Users/administrator/Documents/UploadedProjects/<user id>/build/B4iProject.build/Release-iphoneos/B4iProject.build/DerivedSources -F/Users/administrator/Documents/UploadedProjects/<user id>/Payload -F../../Libs -MMD -MT dependencies -MF /Users/administrator/Documents/UploadedProjects/<user id>/build/B4iProject.build/Release-iphoneos/B4iProject.build/Objects-normal/arm64/b4i_roundslider.d --serialize-diagnostics /Users/administrator/Documents/UploadedProjects/<user id>/build/B4iProject.build/Release-iphoneos/B4iProject.build/Objects-normal/arm64/b4i_roundslider.dia -c /Users/administrator/Documents/UploadedProjects/<user id>/B4iProject/b4i_roundslider.m -o /Users/administrator/Documents/UploadedProjects/<user id>/build/B4iProject.build/Release-iphoneos/B4iProject.build/Objects-normal/arm64/b4i_roundslider.o


Error: ** BUILD FAILED **


The following build commands failed:
    CompileC /Users/administrator/Documents/UploadedProjects/<user id>/build/B4iProject.build/Release-iphoneos/B4iProject.build/Objects-normal/arm64/b4i_swiftbutton.o /Users/administrator/Documents/UploadedProjects/<user id>/B4iProject/b4i_swiftbutton.m normal arm64 objective-c com.apple.compilers.llvm.clang.1_0.compiler
(1 failure)
:
 
Last edited:

MrKim

Well-Known Member
Licensed User
OK, I confirmed the problem. I took an app that compiles just fine (Camera example) added the B4XEncryption Lib - no code changes, just added the lib. It fails with the same error.
The B4A and B4J versions both compile just fine.
I am using the build server.
 

MrKim

Well-Known Member
Licensed User
B4A - B4XEncryption
B4J - jB4XEncryption
B4i - iEncryption
Finally got all three working!!!👍 Thank you for all your help (and Patience) Erel.
This last one is a little confusing. B4XEncryption had no prefix so I assumed it worked with all three, and in fact it seems to work with B4J just fine - and without the additional jar.. Because it said B4X I put the file in my shared libs, it popped up in b4J and worked without a hitch! And worked fine in B4A as well.
Also, in B4i it doesn't throw any errors until it gets sent to the compiler. This all made it a little confusing to debug.
I have since downloaded and installed 'bcprov-jdk15on-154 for B4J but it left me wondering why we can't just use B4XEncryption with B4J? It seems to work.
Please keep in mind not all of have your - what seems to be - incredible memory for details. 😓 . The fact that there is another lib called 'encryption' didn't help either.
 

MrKim

Well-Known Member
Licensed User
The situation will be improved when the libraries tab will show you more information about the libraries (b4xlibs, internal, additional, ...)
Oh goodness, that will be wonderful! The other thing that would me nice would be like a monthly zip file with ALL the updated libs? For some of us keeping track of all these details is extremely difficult and time consuming.
 
Top