iOS Question Local Mac Builder error while compiling

Discussion in 'iOS Questions' started by Nestor Castro Jr, Feb 19, 2019.

  1. Nestor Castro Jr

    Nestor Castro Jr New Member Licensed User

    Hello Erel,

    I Started use B4i with Hosted mac Builder and my project compiles fine, like this:

    B4i Versão: 5.51
    Analisando o código. (0.09s)
    Building folders structure. (0.55s)
    Compilando o código (0.14s)
    Compilando código dos layouts. (0.01s)
    Montando o projeto Xcode (0.75s)
    Enviando dados para compilador remoto. (17.41s)
    Aplicativo compilado com perfil de provisão não comercial.
    Concluído com sucesso
    Certifique-se de que o B4i-Bridge foi iniciado (192.168.15.233).
    Inicie o aplicativo manualmente após a instalação.

    So, I installed Xcode 10 and B4i Build Server on Macbook with macOS Mojave

    B4i Build Server
    Build server is running.
    Version: 5.5
    Server time: 19:47:31
    Mac SSL Key
    Invalid key!!!
    SSL port: 51042
    h files
    • iFirebaseNotifications: 1.00
    • iCustomDialog: 1.00
    • iAdMob: 1.60
    • iXmlBuilder: 1.00
    • iEventKit: 1.00
    • iReleaseLogger: 1.00
    • iSideMenu: 1.01
    • iSVG: 1.20
    • iTableView: 1.21
    • iUI8: 1.51
    • iStringUtils: 1.02
    • iSQL: 1.50
    • iArchiver: 1.20
    • iXUI: 1.90
    • xCustomListView
    • iGameView: 1.05
    • iSpeechRecognition: 1.00
    • iHUD: 1.00
    • iNFC
    • iLeadbolt: 2.00
    • iRandomAccessFile: 1.72
    • iGameCenter: 1.01
    • iHttp: 1.01
    • iStore: 1.21
    • iNet: 1.80
    • iGoogleMaps: 1.41
    • iXUI2D: 0.99
    • iCore: 5.50
    • iFacebook: 1.00
    • iBLE: 2.00
    • iBarcode: 1.20
    • iWebSocket: 1.10
    • iCallSubUtils
    • iXmlSax: 1.10
    • iDebug2: 1.60
    • iFirebaseAuth: 1.02
    • iMedia: 1.22
    • iFirebaseAnalytics: 1.00
    • iDesigner: 1.20
    • iDateUtils
    • iFirebaseStorage: 1.10
    • iTabStrip: 1.00
    • iCustomListView
    • iRSA: 1.0
    • iAd: 1.00
    • iEncryption: 1.02
    • iContacts: 1.00
    • iDebug: 1.60
    • iNetwork: 1.32
    • iPhone: 2.00
    • iLocation: 1.20
    • iBitmapCreator
    • iMQTT: 1.10
    • iAnalytics: 1.0
    • iUI9: 1.0
    • iJSON: 1.0
    • iDropboxSync: 1.00
    • iHttpUtils2
    a files
    • libiBLE, size=228216, modified=08/17/2017 17:02:22
    • libiDropboxSync, size=80960, modified=05/04/2017 14:19:36
    • libiHttpUtils2, size=342992, modified=09/12/2018 15:21:28
    • libiHttp, size=122656, modified=08/17/2017 17:03:04
    • libiWebSocket, size=401984, modified=01/15/2018 17:53:58
    • libiXUI2D, size=8542896, modified=09/04/2018 14:11:22
    • libiCustomDialog, size=2720512, modified=08/17/2017 17:02:32
    • libiNetwork, size=267336, modified=11/19/2017 15:13:02
    • libxCustomListView, size=450680, modified=12/27/2018 13:55:10
    • libiLocation, size=125184, modified=08/17/2017 17:03:14
    • libiStore, size=75856, modified=05/15/2018 15:23:18
    • libiNFC, size=40424, modified=10/08/2017 19:48:28
    • libiHUD, size=291472, modified=08/17/2017 17:03:06
    • libiRandomAccessFile, size=399912, modified=08/17/2017 17:03:38
    • libiNet, size=559040, modified=12/14/2018 12:35:12
    • libiBitmapCreator, size=1394216, modified=11/01/2018 18:29:12
    • libiSpeechRecognition, size=168816, modified=08/17/2017 17:03:50
    • libiDebug2, size=1124736, modified=12/13/2018 16:18:10
    • libiXmlSax, size=62976, modified=08/17/2017 17:04:12
    • libiSQL, size=408088, modified=08/17/2017 17:03:54
    • libiEncryption, size=66512, modified=08/17/2017 17:02:34
    • libiUI8, size=572936, modified=08/22/2018 21:06:08
    • libiXUI, size=739576, modified=12/18/2018 12:03:30
    • libiContacts, size=142816, modified=08/17/2017 17:02:24
    • libiTableView, size=194152, modified=05/04/2017 14:19:36
    • libiDesigner, size=939304, modified=08/17/2017 17:57:22
    • libiCallSubUtils, size=126952, modified=08/17/2017 17:33:06
    • libCore, size=3772400, modified=01/07/2019 19:30:50
    • libiSVG, size=83312, modified=08/17/2017 17:56:48
    • libiTabStrip, size=1335904, modified=08/17/2017 17:56:58
    • libiAdMob, size=492088, modified=05/24/2018 14:55:56
    • libiCustomListView, size=316424, modified=08/27/2017 20:51:10
    • libiMQTT, size=1694912, modified=01/01/2019 14:56:10
    • libiFacebook, size=93392, modified=08/17/2017 17:02:40
    • libiUI9, size=107056, modified=08/17/2017 17:04:04
    • libiAd, size=39072, modified=08/17/2017 17:02:12
    • libiFirebaseAuth, size=161512, modified=08/17/2017 17:02:44
    • libiGoogleMaps, size=171080, modified=08/15/2018 12:30:24
    • libAdapterInMobi, size=1125360, modified=05/04/2017 14:19:34
    • libiAnalytics, size=39392, modified=08/17/2017 17:02:16
    • libiLeadbolt, size=21440, modified=05/04/2017 14:19:36
    • libiGameCenter, size=158080, modified=11/06/2017 10:50:46
    • libiFirebaseStorage, size=140832, modified=12/06/2017 13:57:10
    • libiJSON, size=52960, modified=08/17/2017 17:03:10
    • libiStringUtils, size=55272, modified=12/20/2018 11:06:48
    • libiBarcode, size=249056, modified=08/17/2017 17:02:20
    • libiPhone, size=326664, modified=08/17/2017 17:03:34
    • libiRSA, size=145648, modified=09/03/2017 14:01:38
    • libiGameView, size=4018288, modified=06/07/2018 14:02:00
    • libiFirebaseNotifications, size=66600, modified=08/17/2017 17:02:46
    • libiArchiver, size=463088, modified=08/17/2017 17:02:18
    • libiDateUtils, size=257440, modified=10/18/2017 15:21:58
    • libiXmlBuilder, size=151384, modified=08/17/2017 17:04:08
    • libiSideMenu, size=505920, modified=08/17/2017 17:03:44
    • libiMedia, size=259208, modified=10/25/2017 10:40:54
    • libiReleaseLogger, size=50136, modified=08/17/2017 16:03:40
    • libiEventKit, size=330256, modified=08/17/2017 17:56:26
    • libiFirebaseAnalytics, size=33880, modified=08/17/2017 17:02:42

    When I try to compile, I receive this errors:

    B4i Versão: 5.51
    Analisando o código. (0.11s)
    Building folders structure. (0.67s)
    Compilando o código (0.15s)
    Compilando código dos layouts. (0.02s)
    Montando o projeto Xcode (0.89s)
    Enviando dados para compilador remoto. Error
    Out: Build settings from command line:
    ARCHS = x86_64
    CODE_SIGNING_REQUIRED = NO
    CONFIGURATION_BUILD_DIR = /Users/<user id>/Downloads/B4iBuildServer/UploadedProjects/<user id>/Payload
    PRODUCT_NAME = Nexus Mobile 1.2
    SDKROOT = iphonesimulator12.1

    note: Using new build system
    note: Planning build
    note: Constructing build description
    Build system information
    warning: The iOS Simulator deployment target is set to 7.0, but the range of supported deployment target versions for this platform is 8.0 to 12.1. (in target 'B4iProject')

    CreateBuildDirectory /Users/<user id>/Downloads/B4iBuildServer/UploadedProjects/<user id>/build (in target: B4iProject)
    cd /Users/<user id>/Downloads/B4iBuildServer/UploadedProjects/<user id>
    builtin-create-build-directory /Users/<user id>/Downloads/B4iBuildServer/UploadedProjects/<user id>/build

    MkDir /Users/<user id>/Downloads/B4iBuildServer/UploadedProjects/<user id>/Payload/Nexus\ Mobile\ 1.2.app (in target: B4iProject)
    cd /Users/<user id>/Downloads/B4iBuildServer/UploadedProjects/<user id>
    /bin/mkdir -p /Users/<user id>/Downloads/B4iBuildServer/UploadedProjects/<user id>/Payload/Nexus\ Mobile\ 1.2.app

    WriteAuxiliaryFile /Users/<user id>/Downloads/B4iBuildServer/UploadedProjects/<user id>/build/B4iProject.build/Release-iphonesimulator/B4iProject.build/DerivedSources/Entitlements-Simulated.plist (in target: B4iProject)
    cd /Users/<user id>/Downloads/B4iBuildServer/UploadedProjects/<user id>
    write-file /Users/<user id>/Downloads/B4iBuildServer/UploadedProjects/<user id>/build/B4iProject.build/Release-iphonesimulator/B4iProject.build/DerivedSources/Entitlements-Simulated.plist

    WriteAuxiliaryFile /Users/<user id>/Downloads/B4iBuildServer/UploadedProjects/<user id>/build/B4iProject.build/Release-iphonesimulator/B4iProject.build/DerivedSources/Entitlements.plist (in target: B4iProject)
    cd /Users/<user id>/Downloads/B4iBuildServer/UploadedProjects/<user id>
    write-file /Users/<user id>/Downloads/B4iBuildServer/UploadedProjects/<user id>/build/B4iProject.build/Release-iphonesimulator/B4iProject.build/DerivedSources/Entitlements.plist

    ProcessProductPackaging "" /Users/<user id>/Downloads/B4iBuildServer/UploadedProjects/<user id>/build/B4iProject.build/Release-iphonesimulator/B4iProject.build/Nexus\ Mobile\ 1.2.app.xcent (in target: B4iProject)
    cd /Users/<user id>/Downloads/B4iBuildServer/UploadedProjects/<user id>


    Entitlements:

    {
    "com.apple.security.get-task-allow" = 1;
    }


    builtin-productPackagingUtility -entitlements -format xml -o /Users/<user id>/Downloads/B4iBuildServer/UploadedProjects/<user id>/build/B4iProject.build/Release-iphonesimulator/B4iProject.build/Nexus\ Mobile\ 1.2.app.xcent

    ProcessProductPackaging "" /Users/<user id>/Downloads/B4iBuildServer/UploadedProjects/<user id>/build/B4iProject.build/Release-iphonesimulator/B4iProject.build/Nexus\ Mobile\ 1.2.app-Simulated.xcent (in target: B4iProject)
    cd /Users/<user id>/Downloads/B4iBuildServer/UploadedProjects/<user id>


    Entitlements:

    {
    "application-identifier" = "B77ZJAG59K.phobos.Nexus";
    }


    builtin-productPackagingUtility -entitlements -format xml -o /Users/<user id>/Downloads/B4iBuildServer/UploadedProjects/<user id>/build/B4iProject.build/Release-iphonesimulator/B4iProject.build/Nexus\ Mobile\ 1.2.app-Simulated.xcent

    WriteAuxiliaryFile /Users/<user id>/Downloads/B4iBuildServer/UploadedProjects/<user id>/build/B4iProject.build/Release-iphonesimulator/B4iProject.build/Nexus\ Mobile\ 1.2.hmap (in target: B4iProject)
    cd /Users/<user id>/Downloads/B4iBuildServer/UploadedProjects/<user id>
    write-file /Users/<user id>/Downloads/B4iBuildServer/UploadedProjects/<user id>/build/B4iProject.build/Release-iphonesimulator/B4iProject.build/Nexus\ Mobile\ 1.2.hmap

    WriteAuxiliaryFile /Users/<user id>/Downloads/B4iBuildServer/UploadedProjects/<user id>/build/B4iProject.build/Release-iphonesimulator/B4iProject.build/all-product-headers.yaml (in target: B4iProject)
    cd /Users/<user id>/Downloads/B4iBuildServer/UploadedProjects/<user id>
    write-file /Users/<user id>/Downloads/B4iBuildServer/UploadedProjects/<user id>/build/B4iProject.build/Release-iphonesimulator/B4iProject.build/all-product-headers.yaml

    WriteAuxiliaryFile /Users/<user id>/Downloads/B4iBuildServer/UploadedProjects/<user id>/build/B4iProject.build/Release-iphonesimulator/B4iProject.build/Nexus\ Mobile\ 1.2-project-headers.hmap (in target: B4iProject)
    cd /Users/<user id>/Downloads/B4iBuildServer/UploadedProjects/<user id>
    write-file /Users/<user id>/Downloads/B4iBuildServer/UploadedProjects/<user id>/build/B4iProject.build/Release-iphonesimulator/B4iProject.build/Nexus\ Mobile\ 1.2-project-headers.hmap

    WriteAuxiliaryFile /Users/<user id>/Downloads/B4iBuildServer/UploadedProjects/<user id>/build/B4iProject.build/Release-iphonesimulator/B4iProject.build/Nexus\ Mobile\ 1.2-own-target-headers.hmap (in target: B4iProject)
    cd /Users/<user id>/Downloads/B4iBuildServer/UploadedProjects/<user id>
    write-file /Users/<user id>/Downloads/B4iBuildServer/UploadedProjects/<user id>/build/B4iProject.build/Release-iphonesimulator/B4iProject.build/Nexus\ Mobile\ 1.2-own-target-headers.hmap

    WriteAuxiliaryFile /Users/<user id>/Downloads/B4iBuildServer/UploadedProjects/<user id>/build/B4iProject.build/Release-iphonesimulator/B4iProject.build/Nexus\ Mobile\ 1.2-all-target-headers.hmap (in target: B4iProject)
    cd /Users/<user id>/Downloads/B4iBuildServer/UploadedProjects/<user id>
    write-file /Users/<user id>/Downloads/B4iBuildServer/UploadedProjects/<user id>/build/B4iProject.build/Release-iphonesimulator/B4iProject.build/Nexus\ Mobile\ 1.2-all-target-headers.hmap

    WriteAuxiliaryFile /Users/<user id>/Downloads/B4iBuildServer/UploadedProjects/<user id>/build/B4iProject.build/Release-iphonesimulator/B4iProject.build/Nexus\ Mobile\ 1.2-generated-files.hmap (in target: B4iProject)
    cd /Users/<user id>/Downloads/B4iBuildServer/UploadedProjects/<user id>
    write-file /Users/<user id>/Downloads/B4iBuildServer/UploadedProjects/<user id>/build/B4iProject.build/Release-iphonesimulator/B4iProject.build/Nexus\ Mobile\ 1.2-generated-files.hmap

    WriteAuxiliaryFile /Users/<user id>/Downloads/B4iBuildServer/UploadedProjects/<user id>/build/B4iProject.build/Release-iphonesimulator/B4iProject.build/Nexus\ Mobile\ 1.2-all-non-framework-target-headers.hmap (in target: B4iProject)
    cd /Users/<user id>/Downloads/B4iBuildServer/UploadedProjects/<user id>
    write-file /Users/<user id>/Downloads/B4iBuildServer/UploadedProjects/<user id>/build/B4iProject.build/Release-iphonesimulator/B4iProject.build/Nexus\ Mobile\ 1.2-all-non-framework-target-headers.hmap

    CompileC /Users/<user id>/Downloads/B4iBuildServer/UploadedProjects/<user id>/build/B4iProject.build/Release-iphonesimulator/B4iProject.build/Objects-normal/x86_64/b4i_websockethandler.o /Users/<user id>/Downloads/B4iBuildServer/UploadedProjects/<user id>/B4iProject/b4i_websockethandler.m normal x86_64 objective-c com.apple.compilers.llvm.clang.1_0.compiler (in target: B4iProject)
    cd /Users/<user id>/Downloads/B4iBuildServer/UploadedProjects/<user id>
    export LANG=en_US.US-ASCII
    /Applications/Xcode.app/Contents/Developer/Toolchains/XcodeDefault.xctoolchain/usr/bin/clang -x objective-c -arch x86_64 -fmessage-length=0 -fdiagnostics-show-note-include-stack -fmacro-backtrace-limit=0 -std=gnu99 -fobjc-arc -fmodules -gmodules -fmodules-prune-interval=86400 -fmodules-prune-after=345600 -fbuild-session-file=/var/folders/17/0nzz_wqs4rz_ld9g9b366pcr0000gn/C/org.llvm.clang/ModuleCache.noindex/Session.modulevalidation -fmodules-validate-once-per-build-session -Wnon-modular-include-in-framework-module -Werror=non-modular-include-in-framework-module -Wno-trigraphs -fpascal-strings -O0 -Wno-missing-field-initializers -Wno-missing-prototypes -Werror=return-type -Wno-implicit-atomic-properties -Werror=deprecated-objc-isa-usage -Wno-objc-interface-ivars -Werror=objc-root-class -Wno-arc-repeated-use-of-weak -Wduplicate-method-match -Wno-missing-braces -Wparentheses -Wswitch -Wunused-function -Wno-unused-label -Wno-unused-parameter -Wunused-variable -Wunused-value -Wempty-body -Wuninitialized -Wconditional-uninitialized -Wno-unknown-pragmas -Wno-shadow -Wno-four-char-constants -Wno-conversion -Wconstant-conversion -Wint-conversion -Wbool-conversion -Wenum-conversion -Wno-float-conversion -Wno-non-literal-null-conversion -Wno-objc-literal-conversion -Wshorten-64-to-32 -Wpointer-sign -Wno-newline-eof -Wno-selector -Wno-strict-selector-match -Wundeclared-selector -Wno-deprecated-implementations -DB4I_VERSION=11 -DNS_BLOCK_ASSERTIONS=1 -DOBJC_OLD_DISPATCH_PROTOTYPES=1 -isysroot /Applications/Xcode.app/Contents/Developer/Platforms/iPhoneSimulator.platform/Developer/SDKs/iPhoneSimulator12.1.sdk -fasm-blocks -fstrict-aliasing -Wprotocol -Wdeprecated-declarations -mios-simulator-version-min=7.0 -g -fvisibility=hidden -Wno-sign-conversion -Wno-infinite-recursion -Wno-comma -Wno-block-capture-autoreleasing -Wno-strict-prototypes -Wno-semicolon-before-method-body -fobjc-abi-version=2 -fobjc-legacy-dispatch -iquote /Users/<user id>/Downloads/B4iBuildServer/UploadedProjects/<user id>/build/B4iProject.build/Release-iphonesimulator/B4iProject.build/Nexus\ Mobile\ 1.2-generated-files.hmap -I/Users/<user id>/Downloads/B4iBuildServer/UploadedProjects/<user id>/build/B4iProject.build/Release-iphonesimulator/B4iProject.build/Nexus\ Mobile\ 1.2-own-target-headers.hmap -I/Users/<user id>/Downloads/B4iBuildServer/UploadedProjects/<user id>/build/B4iProject.build/Release-iphonesimulator/B4iProject.build/Nexus\ Mobile\ 1.2-all-target-headers.hmap -iquote /Users/<user id>/Downloads/B4iBuildServer/UploadedProjects/<user id>/build/B4iProject.build/Release-iphonesimulator/B4iProject.build/Nexus\ Mobile\ 1.2-project-headers.hmap -I/Users/<user id>/Downloads/B4iBuildServer/UploadedProjects/<user id>/Payload/include -I/Users/<user id>/Downloads/B4iBuildServer/UploadedProjects/<user id>/build/B4iProject.build/Release-iphonesimulator/B4iProject.build/DerivedSources/x86_64 -I/Users/<user id>/Downloads/B4iBuildServer/UploadedProjects/<user id>/build/B4iProject.build/Release-iphonesimulator/B4iProject.build/DerivedSources -F/Users/<user id>/Downloads/B4iBuildServer/UploadedProjects/<user id>/Payload -F../../Libs -MMD -MT dependencies -MF /Users/<user id>/Downloads/B4iBuildServer/UploadedProjects/<user id>/build/B4iProject.build/Release-iphonesimulator/B4iProject.build/Objects-normal/x86_64/b4i_websockethandler.d --serialize-diagnostics /Users/<user id>/Downloads/B4iBuildServer/UploadedProjects/<user id>/build/B4iProject.build/Release-iphonesimulator/B4iProject.build/Objects-normal/x86_64/b4i_websockethandler.dia -c /Users/<user id>/Downloads/B4iBuildServer/UploadedProjects/<user id>/B4iProject/b4i_websockethandler.m -o /Users/<user id>/Downloads/B4iBuildServer/UploadedProjects/<user id>/build/B4iProject.build/Release-iphonesimulator/B4iProject.build/Objects-normal/x86_64/b4i_websockethandler.o
    In file included from /Users/<user id>/Downloads/B4iBuildServer/UploadedProjects/<user id>/B4iProject/b4i_websockethandler.m:2
    :
    In file included from /Users/<user id>/Downloads/B4iBuildServer/UploadedProjects/<user id>/B4iProject/b4i_websockethandler.h:2:
    /Users/<user id>/Downloads/B4iBuildServer/Libs/iGoogleMaps.h:3:9: fatal error: 'GoogleMaps/GoogleMaps.h' file not found
    #import <GoogleMaps/GoogleMaps.h>
    ^~~~~~~~~~~~~~~~~~~~~~~~~
    1 error generated.

    CompileC /Users/<user id>/Downloads/B4iBuildServer/UploadedProjects/<user id>/build/B4iProject.build/Release-iphonesimulator/B4iProject.build/Objects-normal/x86_64/main.o /Users/<user id>/Downloads/B4iBuildServer/UploadedProjects/<user id>/B4iProject/main.m normal x86_64 objective-c com.apple.compilers.llvm.clang.1_0.compiler (in target: B4iProject)
    cd /Users/<user id>/Downloads/B4iBuildServer/UploadedProjects/<user id>
    export LANG=en_US.US-ASCII
    /Applications/Xcode.app/Contents/Developer/Toolchains/XcodeDefault.xctoolchain/usr/bin/clang -x objective-c -arch x86_64 -fmessage-length=0 -fdiagnostics-show-note-include-stack -fmacro-backtrace-limit=0 -std=gnu99 -fobjc-arc -fmodules -gmodules -fmodules-prune-interval=86400 -fmodules-prune-after=345600 -fbuild-session-file=/var/folders/17/0nzz_wqs4rz_ld9g9b366pcr0000gn/C/org.llvm.clang/ModuleCache.noindex/Session.modulevalidation -fmodules-validate-once-per-build-session -Wnon-modular-include-in-framework-module -Werror=non-modular-include-in-framework-module -Wno-trigraphs -fpascal-strings -O0 -Wno-missing-field-initializers -Wno-missing-prototypes -Werror=return-type -Wno-implicit-atomic-properties -Werror=deprecated-objc-isa-usage -Wno-objc-interface-ivars -Werror=objc-root-class -Wno-arc-repeated-use-of-weak -Wduplicate-method-match -Wno-missing-braces -Wparentheses -Wswitch -Wunused-function -Wno-unused-label -Wno-unused-parameter -Wunused-variable -Wunused-value -Wempty-body -Wuninitialized -Wconditional-uninitialized -Wno-unknown-pragmas -Wno-shadow -Wno-four-char-constants -Wno-conversion -Wconstant-conversion -Wint-conversion -Wbool-conversion -Wenum-conversion -Wno-float-conversion -Wno-non-literal-null-conversion -Wno-objc-literal-conversion -Wshorten-64-to-32 -Wpointer-sign -Wno-newline-eof -Wno-selector -Wno-strict-selector-match -Wundeclared-selector -Wno-deprecated-implementations -DB4I_VERSION=11 -DNS_BLOCK_ASSERTIONS=1 -DOBJC_OLD_DISPATCH_PROTOTYPES=1 -isysroot /Applications/Xcode.app/Contents/Developer/Platforms/iPhoneSimulator.platform/Developer/SDKs/iPhoneSimulator12.1.sdk -fasm-blocks -fstrict-aliasing -Wprotocol -Wdeprecated-declarations -mios-simulator-version-min=7.0 -g -fvisibility=hidden -Wno-sign-conversion -Wno-infinite-recursion -Wno-comma -Wno-block-capture-autoreleasing -Wno-strict-prototypes -Wno-semicolon-before-method-body -fobjc-abi-version=2 -fobjc-legacy-dispatch -iquote /Users/<user id>/Downloads/B4iBuildServer/UploadedProjects/<user id>/build/B4iProject.build/Release-iphonesimulator/B4iProject.build/Nexus\ Mobile\ 1.2-generated-files.hmap -I/Users/<user id>/Downloads/B4iBuildServer/UploadedProjects/<user id>/build/B4iProject.build/Release-iphonesimulator/B4iProject.build/Nexus\ Mobile\ 1.2-own-target-headers.hmap -I/Users/<user id>/Downloads/B4iBuildServer/UploadedProjects/<user id>/build/B4iProject.build/Release-iphonesimulator/B4iProject.build/Nexus\ Mobile\ 1.2-all-target-headers.hmap -iquote /Users/<user id>/Downloads/B4iBuildServer/UploadedProjects/<user id>/build/B4iProject.build/Release-iphonesimulator/B4iProject.build/Nexus\ Mobile\ 1.2-project-headers.hmap -I/Users/<user id>/Downloads/B4iBuildServer/UploadedProjects/<user id>/Payload/include -I/Users/<user id>/Downloads/B4iBuildServer/UploadedProjects/<user id>/build/B4iProject.build/Release-iphonesimulator/B4iProject.build/DerivedSources/x86_64 -I/Users/<user id>/Downloads/B4iBuildServer/UploadedProjects/<user id>/build/B4iProject.build/Release-iphonesimulator/B4iProject.build/DerivedSources -F/Users/<user id>/Downloads/B4iBuildServer/UploadedProjects/<user id>/Payload -F../../Libs -MMD -MT dependencies -MF /Users/<user id>/Downloads/B4iBuildServer/UploadedProjects/<user id>/build/B4iProject.build/Release-iphonesimulator/B4iProject.build/Objects-normal/x86_64/main.d --serialize-diagnostics /Users/<user id>/Downloads/B4iBuildServer/UploadedProjects/<user id>/build/B4iProject.build/Release-iphonesimulator/B4iProject.build/Objects-normal/x86_64/main.dia -c /Users/<user id>/Downloads/B4iBuildServer/UploadedProjects/<user id>/B4iProject/main.m -o /Users/<user id>/Downloads/B4iBuildServer/UploadedProjects/<user id>/build/B4iProject.build/Release-iphonesimulator/B4iProject.build/Objects-normal/x86_64/main.o

    CompileC /Users/<user id>/Downloads/B4iBuildServer/UploadedProjects/<user id>/build/B4iProject.build/Release-iphonesimulator/B4iProject.build/Objects-normal/x86_64/b4i_mapscale.o /Users/<user id>/Downloads/B4iBuildServer/UploadedProjects/<user id>/B4iProject/b4i_mapscale.m normal x86_64 objective-c com.apple.compilers.llvm.clang.1_0.compiler (in target: B4iProject)
    cd /Users/<user id>/Downloads/B4iBuildServer/UploadedProjects/<user id>
    export LANG=en_US.US-ASCII
    /Applications/Xcode.app/Contents/Developer/Toolchains/XcodeDefault.xctoolchain/usr/bin/clang -x objective-c -arch x86_64 -fmessage-length=0 -fdiagnostics-show-note-include-stack -fmacro-backtrace-limit=0 -std=gnu99 -fobjc-arc -fmodules -gmodules -fmodules-prune-interval=86400 -fmodules-prune-after=345600 -fbuild-session-file=/var/folders/17/0nzz_wqs4rz_ld9g9b366pcr0000gn/C/org.llvm.clang/ModuleCache.noindex/Session.modulevalidation -fmodules-validate-once-per-build-session -Wnon-modular-include-in-framework-module -Werror=non-modular-include-in-framework-module -Wno-trigraphs -fpascal-strings -O0 -Wno-missing-field-initializers -Wno-missing-prototypes -Werror=return-type -Wno-implicit-atomic-properties -Werror=deprecated-objc-isa-usage -Wno-objc-interface-ivars -Werror=objc-root-class -Wno-arc-repeated-use-of-weak -Wduplicate-method-match -Wno-missing-braces -Wparentheses -Wswitch -Wunused-function -Wno-unused-label -Wno-unused-parameter -Wunused-variable -Wunused-value -Wempty-body -Wuninitialized -Wconditional-uninitialized -Wno-unknown-pragmas -Wno-shadow -Wno-four-char-constants -Wno-conversion -Wconstant-conversion -Wint-conversion -Wbool-conversion -Wenum-conversion -Wno-float-conversion -Wno-non-literal-null-conversion -Wno-objc-literal-conversion -Wshorten-64-to-32 -Wpointer-sign -Wno-newline-eof -Wno-selector -Wno-strict-selector-match -Wundeclared-selector -Wno-deprecated-implementations -DB4I_VERSION=11 -DNS_BLOCK_ASSERTIONS=1 -DOBJC_OLD_DISPATCH_PROTOTYPES=1 -isysroot /Applications/Xcode.app/Contents/Developer/Platforms/iPhoneSimulator.platform/Developer/SDKs/iPhoneSimulator12.1.sdk -fasm-blocks -fstrict-aliasing -Wprotocol -Wdeprecated-declarations -mios-simulator-version-min=7.0 -g -fvisibility=hidden -Wno-sign-conversion -Wno-infinite-recursion -Wno-comma -Wno-block-capture-autoreleasing -Wno-strict-prototypes -Wno-semicolon-before-method-body -fobjc-abi-version=2 -fobjc-legacy-dispatch -iquote /Users/<user id>/Downloads/B4iBuildServer/UploadedProjects/<user id>/build/B4iProject.build/Release-iphonesimulator/B4iProject.build/Nexus\ Mobile\ 1.2-generated-files.hmap -I/Users/<user id>/Downloads/B4iBuildServer/UploadedProjects/<user id>/build/B4iProject.build/Release-iphonesimulator/B4iProject.build/Nexus\ Mobile\ 1.2-own-target-headers.hmap -I/Users/<user id>/Downloads/B4iBuildServer/UploadedProjects/<user id>/build/B4iProject.build/Release-iphonesimulator/B4iProject.build/Nexus\ Mobile\ 1.2-all-target-headers.hmap -iquote /Users/<user id>/Downloads/B4iBuildServer/UploadedProjects/<user id>/build/B4iProject.build/Release-iphonesimulator/B4iProject.build/Nexus\ Mobile\ 1.2-project-headers.hmap -I/Users/<user id>/Downloads/B4iBuildServer/UploadedProjects/<user id>/Payload/include -I/Users/<user id>/Downloads/B4iBuildServer/UploadedProjects/<user id>/build/B4iProject.build/Release-iphonesimulator/B4iProject.build/DerivedSources/x86_64 -I/Users/<user id>/Downloads/B4iBuildServer/UploadedProjects/<user id>/build/B4iProject.build/Release-iphonesimulator/B4iProject.build/DerivedSources -F/Users/<user id>/Downloads/B4iBuildServer/UploadedProjects/<user id>/Payload -F../../Libs -MMD -MT dependencies -MF /Users/<user id>/Downloads/B4iBuildServer/UploadedProjects/<user id>/build/B4iProject.build/Release-iphonesimulator/B4iProject.build/Objects-normal/x86_64/b4i_mapscale.d --serialize-diagnostics /Users/<user id>/Downloads/B4iBuildServer/UploadedProjects/<user id>/build/B4iProject.build/Release-iphonesimulator/B4iProject.build/Objects-normal/x86_64/b4i_mapscale.dia -c /Users/<user id>/Downloads/B4iBuildServer/UploadedProjects/<user id>/B4iProject/b4i_mapscale.m -o /Users/<user id>/Downloads/B4iBuildServer/UploadedProjects/<user id>/build/B4iProject.build/Release-iphonesimulator/B4iProject.build/Objects-normal/x86_64/b4i_mapscale.o
    In file included from /Users/<user id>/Downloads/B4iBuildServer/UploadedProjects/<user id>/B4iProject/b4i_mapscale.m:2:
    In file included from /Users/<user id>/Downloads/B4iBuildServer/UploadedProjects/<user id>/B4iProject/b4i_mapscale.h:2:
    /Users/<user id>/Downloads/B4iBuildServer/Libs/iGoogleMaps.h:3:9: fatal error: 'GoogleMaps/GoogleMaps.h' file not found
    #import <GoogleMaps/GoogleMaps.h>
    ^~~~~~~~~~~~~~~~~~~~~~~~~
    1 error generated.

    WriteAuxiliaryFile /Users/<user id>/Downloads/B4iBuildServer/UploadedProjects/<user id>/build/B4iProject.build/Release-iphonesimulator/B4iProject.build/Objects-normal/x86_64/Nexus\ Mobile\ 1.2.LinkFileList (in target: B4iProject)
    cd /Users/<user id>/Downloads/B4iBuildServer/UploadedProjects/<user id>
    write-file /Users/<user id>/Downloads/B4iBuildServer/UploadedProjects/<user id>/build/B4iProject.build/Release-iphonesimulator/B4iProject.build/Objects-normal/x86_64/Nexus\ Mobile\ 1.2.LinkFileList

    CompileC /Users/<user id>/Downloads/B4iBuildServer/UploadedProjects/<user id>/build/B4iProject.build/Release-iphonesimulator/B4iProject.build/Objects-normal/x86_64/b4i_main.o /Users/<user id>/Downloads/B4iBuildServer/UploadedProjects/<user id>/B4iProject/b4i_main.m normal x86_64 objective-c com.apple.compilers.llvm.clang.1_0.compiler (in target: B4iProject)
    cd /Users/<user id>/Downloads/B4iBuildServer/UploadedProjects/<user id>
    export LANG=en_US.US-ASCII
    /Applications/Xcode.app/Contents/Developer/Toolchains/XcodeDefault.xctoolchain/usr/bin/clang -x objective-c -arch x86_64 -fmessage-length=0 -fdiagnostics-show-note-include-stack -fmacro-backtrace-limit=0 -std=gnu99 -fobjc-arc -fmodules -gmodules -fmodules-prune-interval=86400 -fmodules-prune-after=345600 -fbuild-session-file=/var/folders/17/0nzz_wqs4rz_ld9g9b366pcr0000gn/C/org.llvm.clang/ModuleCache.noindex/Session.modulevalidation -fmodules-validate-once-per-build-session -Wnon-modular-include-in-framework-module -Werror=non-modular-include-in-framework-module -Wno-trigraphs -fpascal-strings -O0 -Wno-missing-field-initializers -Wno-missing-prototypes -Werror=return-type -Wno-implicit-atomic-properties -Werror=deprecated-objc-isa-usage -Wno-objc-interface-ivars -Werror=objc-root-class -Wno-arc-repeated-use-of-weak -Wduplicate-method-match -Wno-missing-braces -Wparentheses -Wswitch -Wunused-function -Wno-unused-label -Wno-unused-parameter -Wunused-variable -Wunused-value -Wempty-body -Wuninitialized -Wconditional-uninitialized -Wno-unknown-pragmas -Wno-shadow -Wno-four-char-constants -Wno-conversion -Wconstant-conversion -Wint-conversion -Wbool-conversion -Wenum-conversion -Wno-float-conversion -Wno-non-literal-null-conversion -Wno-objc-literal-conversion -Wshorten-64-to-32 -Wpointer-sign -Wno-newline-eof -Wno-selector -Wno-strict-selector-match -Wundeclared-selector -Wno-deprecated-implementations -DB4I_VERSION=11 -DNS_BLOCK_ASSERTIONS=1 -DOBJC_OLD_DISPATCH_PROTOTYPES=1 -isysroot /Applications/Xcode.app/Contents/Developer/Platforms/iPhoneSimulator.platform/Developer/SDKs/iPhoneSimulator12.1.sdk -fasm-blocks -fstrict-aliasing -Wprotocol -Wdeprecated-declarations -mios-simulator-version-min=7.0 -g -fvisibility=hidden -Wno-sign-conversion -Wno-infinite-recursion -Wno-comma -Wno-block-capture-autoreleasing -Wno-strict-prototypes -Wno-semicolon-before-method-body -fobjc-abi-version=2 -fobjc-legacy-dispatch -iquote /Users/<user id>/Downloads/B4iBuildServer/UploadedProjects/<user id>/build/B4iProject.build/Release-iphonesimulator/B4iProject.build/Nexus\ Mobile\ 1.2-generated-files.hmap -I/Users/<user id>/Downloads/B4iBuildServer/UploadedProjects/<user id>/build/B4iProject.build/Release-iphonesimulator/B4iProject.build/Nexus\ Mobile\ 1.2-own-target-headers.hmap -I/Users/<user id>/Downloads/B4iBuildServer/UploadedProjects/<user id>/build/B4iProject.build/Release-iphonesimulator/B4iProject.build/Nexus\ Mobile\ 1.2-all-target-headers.hmap -iquote /Users/<user id>/Downloads/B4iBuildServer/UploadedProjects/<user id>/build/B4iProject.build/Release-iphonesimulator/B4iProject.build/Nexus\ Mobile\ 1.2-project-headers.hmap -I/Users/<user id>/Downloads/B4iBuildServer/UploadedProjects/<user id>/Payload/include -I/Users/<user id>/Downloads/B4iBuildServer/UploadedProjects/<user id>/build/B4iProject.build/Release-iphonesimulator/B4iProject.build/DerivedSources/x86_64 -I/Users/<user id>/Downloads/B4iBuildServer/UploadedProjects/<user id>/build/B4iProject.build/Release-iphonesimulator/B4iProject.build/DerivedSources -F/Users/<user id>/Downloads/B4iBuildServer/UploadedProjects/<user id>/Payload -F../../Libs -MMD -MT dependencies -MF /Users/<user id>/Downloads/B4iBuildServer/UploadedProjects/<user id>/build/B4iProject.build/Release-iphonesimulator/B4iProject.build/Objects-normal/x86_64/b4i_main.d --serialize-diagnostics /Users/<user id>/Downloads/B4iBuildServer/UploadedProjects/<user id>/build/B4iProject.build/Release-iphonesimulator/B4iProject.build/Objects-normal/x86_64/b4i_main.dia -c /Users/<user id>/Downloads/B4iBuildServer/UploadedProjects/<user id>/B4iProject/b4i_main.m -o /Users/<user id>/Downloads/B4iBuildServer/UploadedProjects/<user id>/build/B4iProject.build/Release-iphonesimulator/B4iProject.build/Objects-normal/x86_64/b4i_main.o
    In file included from /Users/<user id>/Downloads/B4iBuildServer/UploadedProjects/<user id>/B4iProject/b4i_main.m:2:
    In file included from /Users/<user id>/Downloads/B4iBuildServer/UploadedProjects/<user id>/B4iProject/b4i_main.h:2:
    /Users/<user id>/Downloads/B4iBuildServer/Libs/iGoogleMaps.h:3:9: fatal error: 'GoogleMaps/GoogleMaps.h' file not found
    #import <GoogleMaps/GoogleMaps.h>
    ^~~~~~~~~~~~~~~~~~~~~~~~~

    CompileC /Users/<user id>/Downloads/B4iBuildServer/UploadedProjects/<user id>/build/B4iProject.build/Release-iphonesimulator/B4iProject.build/Objects-normal/x86_64/b4i_httputils2service.o /Users/<user id>/Downloads/B4iBuildServer/UploadedProjects/<user id>/B4iProject/b4i_httputils2service.m normal x86_64 objective-c com.apple.compilers.llvm.clang.1_0.compiler (in target: B4iProject)
    cd /Users/<user id>/Downloads/B4iBuildServer/UploadedProjects/<user id>
    export LANG=en_US.US-ASCII
    /Applications/Xcode.app/Contents/Developer/Toolchains/XcodeDefault.xctoolchain/usr/bin/clang -x objective-c -arch x86_64 -fmessage-length=0 -fdiagnostics-show-note-include-stack -fmacro-backtrace-limit=0 -std=gnu99 -fobjc-arc -fmodules -gmodules -fmodules-prune-interval=86400 -fmodules-prune-after=345600 -fbuild-session-file=/var/folders/17/0nzz_wqs4rz_ld9g9b366pcr0000gn/C/org.llvm.clang/ModuleCache.noindex/Session.modulevalidation -fmodules-validate-once-per-build-session -Wnon-modular-include-in-framework-module -Werror=non-modular-include-in-framework-module -Wno-trigraphs -fpascal-strings -O0 -Wno-missing-field-initializers -Wno-missing-prototypes -Werror=return-type -Wno-implicit-atomic-properties -Werror=deprecated-objc-isa-usage -Wno-objc-interface-ivars -Werror=objc-root-class -Wno-arc-repeated-use-of-weak -Wduplicate-method-match -Wno-missing-braces -Wparentheses -Wswitch -Wunused-function -Wno-unused-label -Wno-unused-parameter -Wunused-variable -Wunused-value -Wempty-body -Wuninitialized -Wconditional-uninitialized -Wno-unknown-pragmas -Wno-shadow -Wno-four-char-constants -Wno-conversion -Wconstant-conversion -Wint-conversion -Wbool-conversion -Wenum-conversion -Wno-float-conversion -Wno-non-literal-null-conversion -Wno-objc-literal-conversion -Wshorten-64-to-32 -Wpointer-sign -Wno-newline-eof -Wno-selector -Wno-strict-selector-match -Wundeclared-selector -Wno-deprecated-implementations -DB4I_VERSION=11 -DNS_BLOCK_ASSERTIONS=1 -DOBJC_OLD_DISPATCH_PROTOTYPES=1 -isysroot /Applications/Xcode.app/Contents/Developer/Platforms/iPhoneSimulator.platform/Developer/SDKs/iPhoneSimulator12.1.sdk -fasm-blocks -fstrict-aliasing -Wprotocol -Wdeprecated-declarations -mios-simulator-version-min=7.0 -g -fvisibility=hidden -Wno-sign-conversion -Wno-infinite-recursion -Wno-comma -Wno-block-capture-autoreleasing -Wno-strict-prototypes -Wno-semicolon-before-method-body -fobjc-abi-version=2 -fobjc-legacy-dispatch -iquote /Users/<user id>/Downloads/B4iBuildServer/UploadedProjects/<user id>/build/B4iProject.build/Release-iphonesimulator/B4iProject.build/Nexus\ Mobile\ 1.2-generated-files.hmap -I/Users/<user id>/Downloads/B4iBuildServer/UploadedProjects/<user id>/build/B4iProject.build/Release-iphonesimulator/B4iProject.build/Nexus\ Mobile\ 1.2-own-target-headers.hmap -I/Users/<user id>/Downloads/B4iBuildServer/UploadedProjects/<user id>/build/B4iProject.build/Release-iphonesimulator/B4iProject.build/Nexus\ Mobile\ 1.2-all-target-headers.hmap -iquote /Users/<user id>/Downloads/B4iBuildServer/UploadedProjects/<user id>/build/B4iProject.build/Release-iphonesimulator/B4iProject.build/Nexus\ Mobile\ 1.2-project-headers.hmap -I/Users/<user id>/Downloads/B4iBuildServer/UploadedProjects/<user id>/Payload/include -I/Users/<user id>/Downloads/B4iBuildServer/UploadedProjects/<user id>/build/B4iProject.build/Release-iphonesimulator/B4iProject.build/DerivedSources/x86_64 -I/Users/<user id>/Downloads/B4iBuildServer/UploadedProjects/<user id>/build/B4iProject.build/Release-iphonesimulator/B4iProject.build/DerivedSources -F/Users/<user id>/Downloads/B4iBuildServer/UploadedProjects/<user id>/Payload -F../../Libs -MMD -MT dependencies -MF /Users/<user id>/Downloads/B4iBuildServer/UploadedProjects/<user id>/build/B4iProject.build/Release-iphonesimulator/B4iProject.build/Objects-normal/x86_64/b4i_httputils2service.d --serialize-diagnostics /Users/<user id>/Downloads/B4iBuildServer/UploadedProjects/<user id>/build/B4iProject.build/Release-iphonesimulator/B4iProject.build/Objects-normal/x86_64/b4i_httputils2service.dia -c /Users/<user id>/Downloads/B4iBuildServer/UploadedProjects/<user id>/B4iProject/b4i_httputils2service.m -o /Users/<user id>/Downloads/B4iBuildServer/UploadedProjects/<user id>/build/B4iProject.build/Release-iphonesimulator/B4iProject.build/Objects-normal/x86_64/b4i_httputils2service.o


    Error: ** BUILD FAILED **


    The following build commands failed:
    CompileC /Users/<user id>/Downloads/B4iBuildServer/UploadedProjects/<user id>/build/B4iProject.build/Release-iphonesimulator/B4iProject.build/Objects-normal/x86_64/b4i_websockethandler.o /Users/<user id>/Downloads/B4iBuildServer/UploadedProjects/<user id>/B4iProject/b4i_websockethandler.m normal x86_64 objective-c com.apple.compilers.llvm.clang.1_0.compiler
    CompileC /Users/<user id>/Downloads/B4iBuildServer/UploadedProjects/<user id>/build/B4iProject.build/Release-iphonesimulator/B4iProject.build/Objects-normal/x86_64/b4i_mapscale.o /Users/<user id>/Downloads/B4iBuildServer/UploadedProjects/<user id>/B4iProject/b4i_mapscale.m normal x86_64 objective-c com.apple.compilers.llvm.clang.1_0.compiler
    (2 failures)


    Can you help me?
     
  2. Erel

    Erel Administrator Staff Member Licensed User

  3. Nestor Castro Jr

    Nestor Castro Jr New Member Licensed User

    Now it's working fine! Thank you!
     
Loading...
  1. This site uses cookies to help personalise content, tailor your experience and to keep you logged in if you register.
    By continuing to use this site, you are consenting to our use of cookies.
    Dismiss Notice