iOS Question Remote Comilation failed

joergb

Member
Licensed User
Hi

I tried to write my first app in b4i
After a few days I get now the following Msg from the Remote Compiler:
----------------------------------------------------------------------------------------
Error: ** BUILD FAILED **


The following build commands failed:
CompileC build/B4iProject.build/Release-iphoneos/B4iProject.build/Objects-normal/arm64/b4i_login.o B4iProject/b4i_login.m normal arm64 objective-c com.apple.compilers.llvm.clang.1_0.compiler
(1 failure)

the local b4I does not report an error
can anybody tell me, what goes wrong
 

joergb

Member
Licensed User
Hi Erel

thanky for your reply

a few little sample apps works without any problems.

and no, thats not the full message

I tried it again an get these long message in the Messagebox:
--------------------------------------------------------------------------------------------------------------------------------------------------------------

B4i Version: 5.30
Parse den Code. (0.03s)
Building folders structure. (0.34s)
Kompiliere den Code. (0.06s)
Kompiliere Layoutcode. (0.01s)
Kompiliere Debugger-Code (1.47s)
Erstelle Xcode-Projekt (0.20s)
Sende Daten an entfernten Compiler. Error
Out: Build settings from command line:
ARCHS = arm64
CODE_SIGN_IDENTITY = iPhone Distribution: Joerg Buhren (TZBTTFMSD3)
CONFIGURATION_BUILD_DIR = /Users/administrator/Documents/UploadedProjects/<user id>/Payload
OTHER_CODE_SIGN_FLAGS = --keychain <user id>
PRODUCT_NAME = B4i Example
PROVISIONING_PROFILE = 142d80f6-2727-4e45-98c7-0190c9c1aef6

=== BUILD TARGET B4iProject OF PROJECT B4iProject WITH CONFIGURATION Release ===

Check dependencies

Write auxiliary files
write-file /Users/administrator/Documents/UploadedProjects/<user id>/build/B4iProject.build/Release-iphoneos/B4iProject.build/B4i\ Example-project-headers.hmap
write-file /Users/administrator/Documents/UploadedProjects/<user id>/build/B4iProject.build/Release-iphoneos/B4iProject.build/B4i\ Example-all-non-framework-target-headers.hmap
write-file /Users/administrator/Documents/UploadedProjects/<user id>/build/B4iProject.build/Release-iphoneos/B4iProject.build/B4i\ Example-own-target-headers.hmap
write-file /Users/administrator/Documents/UploadedProjects/<user id>/build/B4iProject.build/Release-iphoneos/B4iProject.build/B4i\ Example-all-target-headers.hmap
/bin/mkdir -p /Users/administrator/Documents/UploadedProjects/<user id>/build/B4iProject.build/Release-iphoneos/B4iProject.build/Objects-normal/arm64
write-file /Users/administrator/Documents/UploadedProjects/<user id>/build/B4iProject.build/Release-iphoneos/B4iProject.build/Objects-normal/arm64/B4i\ Example.LinkFileList
write-file /Users/administrator/Documents/UploadedProjects/<user id>/build/B4iProject.build/Release-iphoneos/B4iProject.build/B4i\ Example-generated-files.hmap
write-file /Users/administrator/Documents/UploadedProjects/<user id>/build/B4iProject.build/Release-iphoneos/B4iProject.build/B4i\ Example.hmap

Create product structure
/bin/mkdir -p /Users/administrator/Documents/UploadedProjects/<user id>/Payload/B4i\ Example.app

CompileC build/B4iProject.build/Release-iphoneos/B4iProject.build/Objects-normal/arm64/main.o B4iProject/main.m normal arm64 objective-c com.apple.compilers.llvm.clang.1_0.compiler
cd /Users/administrator/Documents/UploadedProjects/<user id>
export LANG=en_US.US-ASCII
export PATH="/Applications/Xcode.app/Contents/Developer/Platforms/iPhoneOS.platform/Developer/usr/bin:/Applications/Xcode.app/Contents/Developer/usr/bin:/usr/local/bin:/usr/bin:/bin:/usr/sbin:/sbin"
/Applications/Xcode.app/Contents/Developer/Toolchains/XcodeDefault.xctoolchain/usr/bin/clang -x objective-c -arch arm64 -fmessage-length=0 -fdiagnostics-show-note-include-stack -fmacro-backtrace-limit=0 -std=gnu99 -fobjc-arc -fmodules -gmodules -fmodules-prune-interval=86400 -fmodules-prune-after=345600 -fbuild-session-file=/var/folders/35/nx43fs8567l9z_wvvpc35snh0000gn/C/org.llvm.clang/ModuleCache/Session.modulevalidation -fmodules-validate-once-per-build-session -Wnon-modular-include-in-framework-module -Werror=non-modular-include-in-framework-module -Wno-trigraphs -fpascal-strings -O0 -Wno-missing-field-initializers -Wno-missing-prototypes -Werror=return-type -Wno-implicit-atomic-properties -Werror=deprecated-objc-isa-usage -Werror=objc-root-class -Wno-arc-repeated-use-of-weak -Wduplicate-method-match -Wno-missing-braces -Wparentheses -Wswitch -Wunused-function -Wno-unused-label -Wno-unused-parameter -Wunused-variable -Wunused-value -Wempty-body -Wuninitialized -Wconditional-uninitialized -Wno-unknown-pragmas -Wno-shadow -Wno-four-char-constants -Wno-conversion -Wconstant-conversion -Wint-conversion -Wbool-conversion -Wenum-conversion -Wno-float-conversion -Wno-non-literal-null-conversion -Wno-objc-literal-conversion -Wshorten-64-to-32 -Wpointer-sign -Wno-newline-eof -Wno-selector -Wno-strict-selector-match -Wundeclared-selector -Wno-deprecated-implementations -DB4I_VERSION=10 -DNS_BLOCK_ASSERTIONS=1 -isysroot /Applications/Xcode.app/Contents/Developer/Platforms/iPhoneOS.platform/Developer/SDKs/iPhoneOS11.2.sdk -fstrict-aliasing -Wprotocol -Wdeprecated-declarations -miphoneos-version-min=7.0 -fvisibility=hidden -Wno-sign-conversion -Wno-infinite-recursion -Wno-comma -Wno-block-capture-autoreleasing -Wno-strict-prototypes -iquote /Users/administrator/Documents/UploadedProjects/<user id>/build/B4iProject.build/Release-iphoneos/B4iProject.build/B4i\ Example-generated-files.hmap -I/Users/administrator/Documents/UploadedProjects/<user id>/build/B4iProject.build/Release-iphoneos/B4iProject.build/B4i\ Example-own-target-headers.hmap -I/Users/administrator/Documents/UploadedProjects/<user id>/build/B4iProject.build/Release-iphoneos/B4iProject.build/B4i\ Example-all-target-headers.hmap -iquote /Users/administrator/Documents/UploadedProjects/<user id>/build/B4iProject.build/Release-iphoneos/B4iProject.build/B4i\ Example-project-headers.hmap -I/Users/administrator/Documents/UploadedProjects/<user id>/Payload/include -I/Users/administrator/Documents/UploadedProjects/<user id>/build/B4iProject.build/Release-iphoneos/B4iProject.build/DerivedSources/arm64 -I/Users/administrator/Documents/UploadedProjects/<user id>/build/B4iProject.build/Release-iphoneos/B4iProject.build/DerivedSources -F/Users/administrator/Documents/UploadedProjects/<user id>/Payload -F../../Libs -MMD -MT dependencies -MF /Users/administrator/Documents/UploadedProjects/<user id>/build/B4iProject.build/Release-iphoneos/B4iProject.build/Objects-normal/arm64/main.d --serialize-diagnostics /Users/administrator/Documents/UploadedProjects/<user id>/build/B4iProject.build/Release-iphoneos/B4iProject.build/Objects-normal/arm64/main.dia -c /Users/administrator/Documents/UploadedProjects/<user id>/B4iProject/main.m -o /Users/administrator/Documents/UploadedProjects/<user id>/build/B4iProject.build/Release-iphoneos/B4iProject.build/Objects-normal/arm64/main.o

CompileC build/B4iProject.build/Release-iphoneos/B4iProject.build/Objects-normal/arm64/b4i_asyncstreamstext.o B4iProject/b4i_asyncstreamstext.m normal arm64 objective-c com.apple.compilers.llvm.clang.1_0.compiler
cd /Users/administrator/Documents/UploadedProjects/<user id>
export LANG=en_US.US-ASCII
export PATH="/Applications/Xcode.app/Contents/Developer/Platforms/iPhoneOS.platform/Developer/usr/bin:/Applications/Xcode.app/Contents/Developer/usr/bin:/usr/local/bin:/usr/bin:/bin:/usr/sbin:/sbin"
/Applications/Xcode.app/Contents/Developer/Toolchains/XcodeDefault.xctoolchain/usr/bin/clang -x objective-c -arch arm64 -fmessage-length=0 -fdiagnostics-show-note-include-stack -fmacro-backtrace-limit=0 -std=gnu99 -fobjc-arc -fmodules -gmodules -fmodules-prune-interval=86400 -fmodules-prune-after=345600 -fbuild-session-file=/var/folders/35/nx43fs8567l9z_wvvpc35snh0000gn/C/org.llvm.clang/ModuleCache/Session.modulevalidation -fmodules-validate-once-per-build-session -Wnon-modular-include-in-framework-module -Werror=non-modular-include-in-framework-module -Wno-trigraphs -fpascal-strings -O0 -Wno-missing-field-initializers -Wno-missing-prototypes -Werror=return-type -Wno-implicit-atomic-properties -Werror=deprecated-objc-isa-usage -Werror=objc-root-class -Wno-arc-repeated-use-of-weak -Wduplicate-method-match -Wno-missing-braces -Wparentheses -Wswitch -Wunused-function -Wno-unused-label -Wno-unused-parameter -Wunused-variable -Wunused-value -Wempty-body -Wuninitialized -Wconditional-uninitialized -Wno-unknown-pragmas -Wno-shadow -Wno-four-char-constants -Wno-conversion -Wconstant-conversion -Wint-conversion -Wbool-conversion -Wenum-conversion -Wno-float-conversion -Wno-non-literal-null-conversion -Wno-objc-literal-conversion -Wshorten-64-to-32 -Wpointer-sign -Wno-newline-eof -Wno-selector -Wno-strict-selector-match -Wundeclared-selector -Wno-deprecated-implementations -DB4I_VERSION=10 -DNS_BLOCK_ASSERTIONS=1 -isysroot /Applications/Xcode.app/Contents/Developer/Platforms/iPhoneOS.platform/Developer/SDKs/iPhoneOS11.2.sdk -fstrict-aliasing -Wprotocol -Wdeprecated-declarations -miphoneos-version-min=7.0 -fvisibility=hidden -Wno-sign-conversion -Wno-infinite-recursion -Wno-comma -Wno-block-capture-autoreleasing -Wno-strict-prototypes -iquote /Users/administrator/Documents/UploadedProjects/<user id>/build/B4iProject.build/Release-iphoneos/B4iProject.build/B4i\ Example-generated-files.hmap -I/Users/administrator/Documents/UploadedProjects/<user id>/build/B4iProject.build/Release-iphoneos/B4iProject.build/B4i\ Example-own-target-headers.hmap -I/Users/administrator/Documents/UploadedProjects/<user id>/build/B4iProject.build/Release-iphoneos/B4iProject.build/B4i\ Example-all-target-headers.hmap -iquote /Users/administrator/Documents/UploadedProjects/<user id>/build/B4iProject.build/Release-iphoneos/B4iProject.build/B4i\ Example-project-headers.hmap -I/Users/administrator/Documents/UploadedProjects/<user id>/Payload/include -I/Users/administrator/Documents/UploadedProjects/<user id>/build/B4iProject.build/Release-iphoneos/B4iProject.build/DerivedSources/arm64 -I/Users/administrator/Documents/UploadedProjects/<user id>/build/B4iProject.build/Release-iphoneos/B4iProject.build/DerivedSources -F/Users/administrator/Documents/UploadedProjects/<user id>/Payload -F../../Libs -MMD -MT dependencies -MF /Users/administrator/Documents/UploadedProjects/<user id>/build/B4iProject.build/Release-iphoneos/B4iProject.build/Objects-normal/arm64/b4i_asyncstreamstext.d --serialize-diagnostics /Users/administrator/Documents/UploadedProjects/<user id>/build/B4iProject.build/Release-iphoneos/B4iProject.build/Objects-normal/arm64/b4i_asyncstreamstext.dia -c /Users/administrator/Documents/UploadedProjects/<user id>/B4iProject/b4i_asyncstreamstext.m -o /Users/administrator/Documents/UploadedProjects/<user id>/build/B4iProject.build/Release-iphoneos/B4iProject.build/Objects-normal/arm64/b4i_asyncstreamstext.o
In file included from /Users/administrator/Documents/UploadedProjects/<user id>/B4iProject/b4i_asyncstreamstext.m:2:
In file included from /Users/administrator/Documents/UploadedProjects/<user id>/B4iProject/b4i_asyncstreamstext.h:9:
/Users/administrator/Documents/Libs/iCustomListView.h:2:1: error: duplicate interface definition for class 'b4i_customlistview'
@interface b4i_customlistview : B4IClass
^
In file included from /Users/administrator/Documents/UploadedProjects/<user id>/B4iProject/b4i_asyncstreamstext.m:2:
In file included from /Users/administrator/Documents/UploadedProjects/<user id>/B4iProject/b4i_asyncstreamstext.h:4:
/Users/administrator/Documents/Libs/xCustomListView.h:4:12: note: previous definition is here
@interface b4i_customlistview : B4IClass
^
In file included from /Users/administrator/Documents/UploadedProjects/<user id>/B4iProject/b4i_asyncstreamstext.m:2:
In file included from /Users/administrator/Documents/UploadedProjects/<user id>/B4iProject/b4i_asyncstreamstext.h:9:
/Users/administrator/Documents/Libs/iCustomListView.h:7:32: error: property has a previous declaration
@property (nonatomic)NSString* _eventname;
^
In file included from /Users/administrator/Documents/UploadedProjects/<user id>/B4iProject/b4i_asyncstreamstext.m:2:
In file included from /Users/administrator/Documents/UploadedProjects/<user id>/B4iProject/b4i_asyncstreamstext.h:4:
/Users/administrator/Documents/Libs/xCustomListView.h:35:32: note: property declared here
@property (nonatomic)NSString* _eventname;
^
In file included from /Users/administrator/Documents/UploadedProjects/<user id>/B4iProject/b4i_asyncstreamstext.m:2:
In file included from /Users/administrator/Documents/UploadedProjects/<user id>/B4iProject/b4i_asyncstreamstext.h:9:
/Users/administrator/Documents/Libs/iCustomListView.h:8:32: error: property has a previous declaration
@property (nonatomic)NSObject* _callback;
^
In file included from /Users/administrator/Documents/UploadedProjects/<user id>/B4iProject/b4i_asyncstreamstext.m:2:
In file included from /Users/administrator/Documents/UploadedProjects/<user id>/B4iProject/b4i_asyncstreamstext.h:4:
/Users/administrator/Documents/Libs/xCustomListView.h:36:32: note: property declared here
@property (nonatomic)NSObject* _callback;
^
In file included from /Users/administrator/Documents/UploadedProjects/<user id>/B4iProject/b4i_asyncstreamstext.m:2:
In file included from /Users/administrator/Documents/UploadedProjects/<user id>/B4iProject/b4i_asyncstreamstext.h:9:
/Users/administrator/Documents/Libs/iCustomListView.h:9:34: error: property has a previous declaration
@property (nonatomic)B4IWeakRef* _mbase;
^
In file included from /Users/administrator/Documents/UploadedProjects/<user id>/B4iProject/b4i_asyncstreamstext.m:2:
In file included from /Users/administrator/Documents/UploadedProjects/<user id>/B4iProject/b4i_asyncstreamstext.h:4:
/Users/administrator/Documents/Libs/xCustomListView.h:31:38: note: property declared here
@property (nonatomic)B4XViewWrapper* _mbase;
^
In file included from /Users/administrator/Documents/UploadedProjects/<user id>/B4iProject/b4i_asyncstreamstext.m:2:
In file included from /Users/administrator/Documents/UploadedProjects/<user id>/B4iProject/b4i_asyncstreamstext.h:9:
/Users/administrator/Documents/Libs/iCustomListView.h:10:37: error: property has a previous declaration
@property (nonatomic)B4IScrollView* _sv;
^
In file included from /Users/administrator/Documents/UploadedProjects/<user id>/B4iProject/b4i_asyncstreamstext.m:2:
In file included from /Users/administrator/Documents/UploadedProjects/<user id>/B4iProject/b4i_asyncstreamstext.h:4:
/Users/administrator/Documents/Libs/xCustomListView.h:32:38: note: property declared here
@property (nonatomic)B4XViewWrapper* _sv;
^
In file included from /Users/administrator/Documents/UploadedProjects/<user id>/B4iProject/b4i_asyncstreamstext.m:2:
In file included from /Users/administrator/Documents/UploadedProjects/<user id>/B4iProject/b4i_asyncstreamstext.h:9:
/Users/administrator/Documents/Libs/iCustomListView.h:11:31: error: property has a previous declaration
@property (nonatomic)B4IList* _items;
^
In file included from /Users/administrator/Documents/UploadedProjects/<user id>/B4iProject/b4i_asyncstreamstext.m:2:
In file included from /Users/administrator/Documents/UploadedProjects/<user id>/B4iProject/b4i_asyncstreamstext.h:4:
/Users/administrator/Documents/Libs/xCustomListView.h:33:31: note: property declared here
@property (nonatomic)B4IList* _items;
^
In file included from /Users/administrator/Documents/UploadedProjects/<user id>/B4iProject/b4i_asyncstreamstext.m:2:
In file included from /Users/administrator/Documents/UploadedProjects/<user id>/B4iProject/b4i_asyncstreamstext.h:9:
/Users/administrator/Documents/Libs/iCustomListView.h:15:26: error: property has a previous declaration
@property (nonatomic)int _defaulttextcolor;
^
In file included from /Users/administrator/Documents/UploadedProjects/<user id>/B4iProject/b4i_asyncstreamstext.m:2:
In file included from /Users/administrator/Documents/UploadedProjects/<user id>/B4iProject/b4i_asyncstreamstext.h:4:
/Users/administrator/Documents/Libs/xCustomListView.h:37:26: note: property declared here
@property (nonatomic)int _defaulttextcolor;
^
In file included from /Users/administrator/Documents/UploadedProjects/<user id>/B4iProject/b4i_asyncstreamstext.m:2:
In file included from /Users/administrator/Documents/UploadedProjects/<user id>/B4iProject/b4i_asyncstreamstext.h:9:
/Users/administrator/Documents/Libs/iCustomListView.h:16:26: error: property has a previous declaration
@property (nonatomic)int _defaulttextbackgroundcolor;
^
In file included from /Users/administrator/Documents/UploadedProjects/<user id>/B4iProject/b4i_asyncstreamstext.m:2:
In file included from /Users/administrator/Documents/UploadedProjects/<user id>/B4iProject/b4i_asyncstreamstext.h:4:
/Users/administrator/Documents/Libs/xCustomListView.h:38:26: note: property declared here
@property (nonatomic)int _defaulttextbackgroundcolor;
^

CompileC build/B4iProject.build/Release-iphoneos/B4iProject.build/Objects-normal/arm64/b4i_auswahl.o B4iProject/b4i_auswahl.m normal arm64 objective-c com.apple.compilers.llvm.clang.1_0.compiler
cd /Users/administrator/Documents/UploadedProjects/<user id>
export LANG=en_US.US-ASCII
export PATH="/Applications/Xcode.app/Contents/Developer/Platforms/iPhoneOS.platform/Developer/usr/bin:/Applications/Xcode.app/Contents/Developer/usr/bin:/usr/local/bin:/usr/bin:/bin:/usr/sbin:/sbin"
/Applications/Xcode.app/Contents/Developer/Toolchains/XcodeDefault.xctoolchain/usr/bin/clang -x objective-c -arch arm64 -fmessage-length=0 -fdiagnostics-show-note-include-stack -fmacro-backtrace-limit=0 -std=gnu99 -fobjc-arc -fmodules -gmodules -fmodules-prune-interval=86400 -fmodules-prune-after=345600 -fbuild-session-file=/var/folders/35/nx43fs8567l9z_wvvpc35snh0000gn/C/org.llvm.clang/ModuleCache/Session.modulevalidation -fmodules-validate-once-per-build-session -Wnon-modular-include-in-framework-module -Werror=non-modular-include-in-framework-module -Wno-trigraphs -fpascal-strings -O0 -Wno-missing-field-initializers -Wno-missing-prototypes -Werror=return-type -Wno-implicit-atomic-properties -Werror=deprecated-objc-isa-usage -Werror=objc-root-class -Wno-arc-repeated-use-of-weak -Wduplicate-method-match -Wno-missing-braces -Wparentheses -Wswitch -Wunused-function -Wno-unused-label -Wno-unused-parameter -Wunused-variable -Wunused-value -Wempty-body -Wuninitialized -Wconditional-uninitialized -Wno-unknown-pragmas -Wno-shadow -Wno-four-char-constants -Wno-conversion -Wconstant-conversion -Wint-conversion -Wbool-conversion -Wenum-conversion -Wno-float-conversion -Wno-non-literal-null-conversion -Wno-objc-literal-conversion -Wshorten-64-to-32 -Wpointer-sign -Wno-newline-eof -Wno-selector -Wno-strict-selector-match -Wundeclared-selector -Wno-deprecated-implementations -DB4I_VERSION=10 -DNS_BLOCK_ASSERTIONS=1 -isysroot /Applications/Xcode.app/Contents/Developer/Platforms/iPhoneOS.platform/Developer/SDKs/iPhoneOS11.2.sdk -fstrict-aliasing -Wprotocol -Wdeprecated-declarations -miphoneos-version-min=7.0 -fvisibility=hidden -Wno-sign-conversion -Wno-infinite-recursion -Wno-comma -Wno-block-capture-autoreleasing -Wno-strict-prototypes -iquote /Users/administrator/Documents/UploadedProjects/<user id>/build/B4iProject.build/Release-iphoneos/B4iProject.build/B4i\ Example-generated-files.hmap -I/Users/administrator/Documents/UploadedProjects/<user id>/build/B4iProject.build/Release-iphoneos/B4iProject.build/B4i\ Example-own-target-headers.hmap -I/Users/administrator/Documents/UploadedProjects/<user id>/build/B4iProject.build/Release-iphoneos/B4iProject.build/B4i\ Example-all-target-headers.hmap -iquote /Users/administrator/Documents/UploadedProjects/<user id>/build/B4iProject.build/Release-iphoneos/B4iProject.build/B4i\ Example-project-headers.hmap -I/Users/administrator/Documents/UploadedProjects/<user id>/Payload/include -I/Users/administrator/Documents/UploadedProjects/<user id>/build/B4iProject.build/Release-iphoneos/B4iProject.build/DerivedSources/arm64 -I/Users/administrator/Documents/UploadedProjects/<user id>/build/B4iProject.build/Release-iphoneos/B4iProject.build/DerivedSources -F/Users/administrator/Documents/UploadedProjects/<user id>/Payload -F../../Libs -MMD -MT dependencies -MF /Users/administrator/Documents/UploadedProjects/<user id>/build/B4iProject.build/Release-iphoneos/B4iProject.build/Objects-normal/arm64/b4i_auswahl.d --serialize-diagnostics /Users/administrator/Documents/UploadedProjects/<user id>/build/B4iProject.build/Release-iphoneos/B4iProject.build/Objects-normal/arm64/b4i_auswahl.dia -c /Users/administrator/Documents/UploadedProjects/<user id>/B4iProject/b4i_auswahl.m -o /Users/administrator/Documents/UploadedProjects/<user id>/build/B4iProject.build/Release-iphoneos/B4iProject.build/Objects-normal/arm64/b4i_auswahl.o
In file included from /Users/administrator/Documents/UploadedProjects/<user id>/B4iProject/b4i_auswahl.m:2:
In file included from /Users/administrator/Documents/UploadedProjects/<user id>/B4iProject/b4i_auswahl.h:9:
/Users/administrator/Documents/Libs/iCustomListView.h:2:1: error: duplicate interface definition for class 'b4i_customlistview'
@interface b4i_customlistview : B4IClass
^
In file included from /Users/administrator/Documents/UploadedProjects/<user id>/B4iProject/b4i_auswahl.m:2:
In file included from /Users/administrator/Documents/UploadedProjects/<user id>/B4iProject/b4i_auswahl.h:4:
/Users/administrator/Documents/Libs/xCustomListView.h:4:12: note: previous definition is here
@interface b4i_customlistview : B4IClass
^
In file included from /Users/administrator/Documents/UploadedProjects/<user id>/B4iProject/b4i_auswahl.m:2:
In file included from /Users/administrator/Documents/UploadedProjects/<user id>/B4iProject/b4i_auswahl.h:9:
/Users/administrator/Documents/Libs/iCustomListView.h:7:32: error: property has a previous declaration
@property (nonatomic)NSString* _eventname;
^
In file included from /Users/administrator/Documents/UploadedProjects/<user id>/B4iProject/b4i_auswahl.m:2:
In file included from /Users/administrator/Documents/UploadedProjects/<user id>/B4iProject/b4i_auswahl.h:4:
/Users/administrator/Documents/Libs/xCustomListView.h:35:32: note: property declared here
@property (nonatomic)NSString* _eventname;
^
In file included from /Users/administrator/Documents/UploadedProjects/<user id>/B4iProject/b4i_auswahl.m:2:
In file included from /Users/administrator/Documents/UploadedProjects/<user id>/B4iProject/b4i_auswahl.h:9:
/Users/administrator/Documents/Libs/iCustomListView.h:8:32: error: property has a previous declaration
@property (nonatomic)NSObject* _callback;
^
In file included from /Users/administrator/Documents/UploadedProjects/<user id>/B4iProject/b4i_auswahl.m:2:
In file included from /Users/administrator/Documents/UploadedProjects/<user id>/B4iProject/b4i_auswahl.h:4:
/Users/administrator/Documents/Libs/xCustomListView.h:36:32: note: property declared here
@property (nonatomic)NSObject* _callback;
^
In file included from /Users/administrator/Documents/UploadedProjects/<user id>/B4iProject/b4i_auswahl.m:2:
In file included from /Users/administrator/Documents/UploadedProjects/<user id>/B4iProject/b4i_auswahl.h:9:
/Users/administrator/Documents/Libs/iCustomListView.h:9:34: error: property has a previous declaration
@property (nonatomic)B4IWeakRef* _mbase;
^
In file included from /Users/administrator/Documents/UploadedProjects/<user id>/B4iProject/b4i_auswahl.m:2:
In file included from /Users/administrator/Documents/UploadedProjects/<user id>/B4iProject/b4i_auswahl.h:4:
/Users/administrator/Documents/Libs/xCustomListView.h:31:38: note: property declared here
@property (nonatomic)B4XViewWrapper* _mbase;
^
In file included from /Users/administrator/Documents/UploadedProjects/<user id>/B4iProject/b4i_auswahl.m:2:
In file included from /Users/administrator/Documents/UploadedProjects/<user id>/B4iProject/b4i_auswahl.h:9:
/Users/administrator/Documents/Libs/iCustomListView.h:10:37: error: property has a previous declaration
@property (nonatomic)B4IScrollView* _sv;
^
In file included from /Users/administrator/Documents/UploadedProjects/<user id>/B4iProject/b4i_auswahl.m:2:
In file included from /Users/administrator/Documents/UploadedProjects/<user id>/B4iProject/b4i_auswahl.h:4:
/Users/administrator/Documents/Libs/xCustomListView.h:32:38: note: property declared here
@property (nonatomic)B4XViewWrapper* _sv;
^
In file included from /Users/administrator/Documents/UploadedProjects/<user id>/B4iProject/b4i_auswahl.m:2:
In file included from /Users/administrator/Documents/UploadedProjects/<user id>/B4iProject/b4i_auswahl.h:9:
/Users/administrator/Documents/Libs/iCustomListView.h:11:31: error: property has a previous declaration
@property (nonatomic)B4IList* _items;
^
In file included from /Users/administrator/Documents/UploadedProjects/<user id>/B4iProject/b4i_auswahl.m:2:
In file included from /Users/administrator/Documents/UploadedProjects/<user id>/B4iProject/b4i_auswahl.h:4:
/Users/administrator/Documents/Libs/xCustomListView.h:33:31: note: property declared here
@property (nonatomic)B4IList* _items;
^
In file included from /Users/administrator/Documents/UploadedProjects/<user id>/B4iProject/b4i_auswahl.m:2:
In file included from /Users/administrator/Documents/UploadedProjects/<user id>/B4iProject/b4i_auswahl.h:9:
/Users/administrator/Documents/Libs/iCustomListView.h:15:26: error: property has a previous declaration
@property (nonatomic)int _defaulttextcolor;
^
In file included from /Users/administrator/Documents/UploadedProjects/<user id>/B4iProject/b4i_auswahl.m:2:
In file included from /Users/administrator/Documents/UploadedProjects/<user id>/B4iProject/b4i_auswahl.h:4:
/Users/administrator/Documents/Libs/xCustomListView.h:37:26: note: property declared here
@property (nonatomic)int _defaulttextcolor;
^
In file included from /Users/administrator/Documents/UploadedProjects/<user id>/B4iProject/b4i_auswahl.m:2:
In file included from /Users/administrator/Documents/UploadedProjects/<user id>/B4iProject/b4i_auswahl.h:9:
/Users/administrator/Documents/Libs/iCustomListView.h:16:26: error: property has a previous declaration
@property (nonatomic)int _defaulttextbackgroundcolor;
^
In file included from /Users/administrator/Documents/UploadedProjects/<user id>/B4iProject/b4i_auswahl.m:2:
In file included from /Users/administrator/Documents/UploadedProjects/<user id>/B4iProject/b4i_auswahl.h:4:
/Users/administrator/Documents/Libs/xCustomListView.h:38:26: note: property declared here
@property (nonatomic)int _defaulttextbackgroundcolor;
^
8 errors generated.

CompileC build/B4iProject.build/Release-iphoneos/B4iProject.build/Objects-normal/arm64/b4i_login.o B4iProject/b4i_login.m normal arm64 objective-c com.apple.compilers.llvm.clang.1_0.compiler
cd /Users/administrator/Documents/UploadedProjects/<user id>
export LANG=en_US.US-ASCII
export PATH="/Applications/Xcode.app/Contents/Developer/Platforms/iPhoneOS.platform/Developer/usr/bin:/Applications/Xcode.app/Contents/Developer/usr/bin:/usr/local/bin:/usr/bin:/bin:/usr/sbin:/sbin"
/Applications/Xcode.app/Contents/Developer/Toolchains/XcodeDefault.xctoolchain/usr/bin/clang -x objective-c -arch arm64 -fmessage-length=0 -fdiagnostics-show-note-include-stack -fmacro-backtrace-limit=0 -std=gnu99 -fobjc-arc -fmodules -gmodules -fmodules-prune-interval=86400 -fmodules-prune-after=345600 -fbuild-session-file=/var/folders/35/nx43fs8567l9z_wvvpc35snh0000gn/C/org.llvm.clang/ModuleCache/Session.modulevalidation -fmodules-validate-once-per-build-session -Wnon-modular-include-in-framework-module -Werror=non-modular-include-in-framework-module -Wno-trigraphs -fpascal-strings -O0 -Wno-missing-field-initializers -Wno-missing-prototypes -Werror=return-type -Wno-implicit-atomic-properties -Werror=deprecated-objc-isa-usage -Werror=objc-root-class -Wno-arc-repeated-use-of-weak -Wduplicate-method-match -Wno-missing-braces -Wparentheses -Wswitch -Wunused-function -Wno-unused-label -Wno-unused-parameter -Wunused-variable -Wunused-value -Wempty-body -Wuninitialized -Wconditional-uninitialized -Wno-unknown-pragmas -Wno-shadow -Wno-four-char-constants -Wno-conversion -Wconstant-conversion -Wint-conversion -Wbool-conversion -Wenum-conversion -Wno-float-conversion -Wno-non-literal-null-conversion -Wno-objc-literal-conversion -Wshorten-64-to-32 -Wpointer-sign -Wno-newline-eof -Wno-selector -Wno-strict-selector-match -Wundeclared-selector -Wno-deprecated-implementations -DB4I_VERSION=10 -DNS_BLOCK_ASSERTIONS=1 -isysroot /Applications/Xcode.app/Contents/Developer/Platforms/iPhoneOS.platform/Developer/SDKs/iPhoneOS11.2.sdk -fstrict-aliasing -Wprotocol -Wdeprecated-declarations -miphoneos-version-min=7.0 -fvisibility=hidden -Wno-sign-conversion -Wno-infinite-recursion -Wno-comma -Wno-block-capture-autoreleasing -Wno-strict-prototypes -iquote /Users/administrator/Documents/UploadedProjects/<user id>/build/B4iProject.build/Release-iphoneos/B4iProject.build/B4i\ Example-generated-files.hmap -I/Users/administrator/Documents/UploadedProjects/<user id>/build/B4iProject.build/Release-iphoneos/B4iProject.build/B4i\ Example-own-target-headers.hmap -I/Users/administrator/Documents/UploadedProjects/<user id>/build/B4iProject.build/Release-iphoneos/B4iProject.build/B4i\ Example-all-target-headers.hmap -iquote /Users/administrator/Documents/UploadedProjects/<user id>/build/B4iProject.build/Release-iphoneos/B4iProject.build/B4i\ Example-project-headers.hmap -I/Users/administrator/Documents/UploadedProjects/<user id>/Payload/include -I/Users/administrator/Documents/UploadedProjects/<user id>/build/B4iProject.build/Release-iphoneos/B4iProject.build/DerivedSources/arm64 -I/Users/administrator/Documents/UploadedProjects/<user id>/build/B4iProject.build/Release-iphoneos/B4iProject.build/DerivedSources -F/Users/administrator/Documents/UploadedProjects/<user id>/Payload -F../../Libs -MMD -MT dependencies -MF /Users/administrator/Documents/UploadedProjects/<user id>/build/B4iProject.build/Release-iphoneos/B4iProject.build/Objects-normal/arm64/b4i_login.d --serialize-diagnostics /Users/administrator/Documents/UploadedProjects/<user id>/build/B4iProject.build/Release-iphoneos/B4iProject.build/Objects-normal/arm64/b4i_login.dia -c /Users/administrator/Documents/UploadedProjects/<user id>/B4iProject/b4i_login.m -o /Users/administrator/Documents/UploadedProjects/<user id>/build/B4iProject.build/Release-iphoneos/B4iProject.build/Objects-normal/arm64/b4i_login.o
In file included from /Users/administrator/Documents/UploadedProjects/<user id>/B4iProject/b4i_login.m:2:
In file included from /Users/administrator/Documents/UploadedProjects/<user id>/B4iProject/b4i_login.h:9:
/Users/administrator/Documents/Libs/iCustomListView.h:2:1: error: duplicate interface definition for class 'b4i_customlistview'
@interface b4i_customlistview : B4IClass
^
In file included from /Users/administrator/Documents/UploadedProjects/<user id>/B4iProject/b4i_login.m:2:
In file included from /Users/administrator/Documents/UploadedProjects/<user id>/B4iProject/b4i_login.h:4:
/Users/administrator/Documents/Libs/xCustomListView.h:4:12: note: previous definition is here
@interface b4i_customlistview : B4IClass
^
In file included from /Users/administrator/Documents/UploadedProjects/<user id>/B4iProject/b4i_login.m:2:
In file included from /Users/administrator/Documents/UploadedProjects/<user id>/B4iProject/b4i_login.h:9:
/Users/administrator/Documents/Libs/iCustomListView.h:7:32: error: property has a previous declaration
@property (nonatomic)NSString* _eventname;
^
In file included from /Users/administrator/Documents/UploadedProjects/<user id>/B4iProject/b4i_login.m:2:
In file included from /Users/administrator/Documents/UploadedProjects/<user id>/B4iProject/b4i_login.h:4:
/Users/administrator/Documents/Libs/xCustomListView.h:35:32: note: property declared here
@property (nonatomic)NSString* _eventname;
^
In file included from /Users/administrator/Documents/UploadedProjects/<user id>/B4iProject/b4i_login.m:2:
In file included from /Users/administrator/Documents/UploadedProjects/<user id>/B4iProject/b4i_login.h:9:
/Users/administrator/Documents/Libs/iCustomListView.h:8:32: error: property has a previous declaration
@property (nonatomic)NSObject* _callback;
^
In file included from /Users/administrator/Documents/UploadedProjects/<user id>/B4iProject/b4i_login.m:2:
In file included from /Users/administrator/Documents/UploadedProjects/<user id>/B4iProject/b4i_login.h:4:
/Users/administrator/Documents/Libs/xCustomListView.h:36:32: note: property declared here
@property (nonatomic)NSObject* _callback;
^
In file included from /Users/administrator/Documents/UploadedProjects/<user id>/B4iProject/b4i_login.m:2:
In file included from /Users/administrator/Documents/UploadedProjects/<user id>/B4iProject/b4i_login.h:9:
/Users/administrator/Documents/Libs/iCustomListView.h:9:34: error: property has a previous declaration
@property (nonatomic)B4IWeakRef* _mbase;
^
In file included from /Users/administrator/Documents/UploadedProjects/<user id>/B4iProject/b4i_login.m:2:
In file included from /Users/administrator/Documents/UploadedProjects/<user id>/B4iProject/b4i_login.h:4:
/Users/administrator/Documents/Libs/xCustomListView.h:31:38: note: property declared here
@property (nonatomic)B4XViewWrapper* _mbase;
^
In file included from /Users/administrator/Documents/UploadedProjects/<user id>/B4iProject/b4i_login.m:2:
In file included from /Users/administrator/Documents/UploadedProjects/<user id>/B4iProject/b4i_login.h:9:
/Users/administrator/Documents/Libs/iCustomListView.h:10:37: error: property has a previous declaration
@property (nonatomic)B4IScrollView* _sv;
^
In file included from /Users/administrator/Documents/UploadedProjects/<user id>/B4iProject/b4i_login.m:2:
In file included from /Users/administrator/Documents/UploadedProjects/<user id>/B4iProject/b4i_login.h:4:
/Users/administrator/Documents/Libs/xCustomListView.h:32:38: note: property declared here
@property (nonatomic)B4XViewWrapper* _sv;
^
In file included from /Users/administrator/Documents/UploadedProjects/<user id>/B4iProject/b4i_login.m:2:
In file included from /Users/administrator/Documents/UploadedProjects/<user id>/B4iProject/b4i_login.h:9:
/Users/administrator/Documents/Libs/iCustomListView.h:11:31: error: property has a previous declaration
@property (nonatomic)B4IList* _items;
^
In file included from /Users/administrator/Documents/UploadedProjects/<user id>/B4iProject/b4i_login.m:2:
In file included from /Users/administrator/Documents/UploadedProjects/<user id>/B4iProject/b4i_login.h:4:
/Users/administrator/Documents/Libs/xCustomListView.h:33:31: note: property declared here
@property (nonatomic)B4IList* _items;
^
In file included from /Users/administrator/Documents/UploadedProjects/<user id>/B4iProject/b4i_login.m:2:
In file included from /Users/administrator/Documents/UploadedProjects/<user id>/B4iProject/b4i_login.h:9:
/Users/administrator/Documents/Libs/iCustomListView.h:15:26: error: property has a previous declaration
@property (nonatomic)int _defaulttextcolor;
^
In file included from /Users/administrator/Documents/UploadedProjects/<user id>/B4iProject/b4i_login.m:2:
In file included from /Users/administrator/Documents/UploadedProjects/<user id>/B4iProject/b4i_login.h:4:
/Users/administrator/Documents/Libs/xCustomListView.h:37:26: note: property declared here
@property (nonatomic)int _defaulttextcolor;
^
In file included from /Users/administrator/Documents/UploadedProjects/<user id>/B4iProject/b4i_login.m:2:
In file included from /Users/administrator/Documents/UploadedProjects/<user id>/B4iProject/b4i_login.h:9:
/Users/administrator/Documents/Libs/iCustomListView.h:16:26: error: property has a previous declaration
@property (nonatomic)int _defaulttextbackgroundcolor;
^
In file included from /Users/administrator/Documents/UploadedProjects/<user id>/B4iProject/b4i_login.m:2:
In file included from /Users/administrator/Documents/UploadedProjects/<user id>/B4iProject/b4i_login.h:4:
/Users/administrator/Documents/Libs/xCustomListView.h:38:26: note: property declared here
@property (nonatomic)int _defaulttextbackgroundcolor;
^
8 errors generated.

CompileC build/B4iProject.build/Release-iphoneos/B4iProject.build/Objects-normal/arm64/b4i_main.o B4iProject/b4i_main.m normal arm64 objective-c com.apple.compilers.llvm.clang.1_0.compiler
cd /Users/administrator/Documents/UploadedProjects/<user id>
export LANG=en_US.US-ASCII
export PATH="/Applications/Xcode.app/Contents/Developer/Platforms/iPhoneOS.platform/Developer/usr/bin:/Applications/Xcode.app/Contents/Developer/usr/bin:/usr/local/bin:/usr/bin:/bin:/usr/sbin:/sbin"
/Applications/Xcode.app/Contents/Developer/Toolchains/XcodeDefault.xctoolchain/usr/bin/clang -x objective-c -arch arm64 -fmessage-length=0 -fdiagnostics-show-note-include-stack -fmacro-backtrace-limit=0 -std=gnu99 -fobjc-arc -fmodules -gmodules -fmodules-prune-interval=86400 -fmodules-prune-after=345600 -fbuild-session-file=/var/folders/35/nx43fs8567l9z_wvvpc35snh0000gn/C/org.llvm.clang/ModuleCache/Session.modulevalidation -fmodules-validate-once-per-build-session -Wnon-modular-include-in-framework-module -Werror=non-modular-include-in-framework-module -Wno-trigraphs -fpascal-strings -O0 -Wno-missing-field-initializers -Wno-missing-prototypes -Werror=return-type -Wno-implicit-atomic-properties -Werror=deprecated-objc-isa-usage -Werror=objc-root-class -Wno-arc-repeated-use-of-weak -Wduplicate-method-match -Wno-missing-braces -Wparentheses -Wswitch -Wunused-function -Wno-unused-label -Wno-unused-parameter -Wunused-variable -Wunused-value -Wempty-body -Wuninitialized -Wconditional-uninitialized -Wno-unknown-pragmas -Wno-shadow -Wno-four-char-constants -Wno-conversion -Wconstant-conversion -Wint-conversion -Wbool-conversion -Wenum-conversion -Wno-float-conversion -Wno-non-literal-null-conversion -Wno-objc-literal-conversion -Wshorten-64-to-32 -Wpointer-sign -Wno-newline-eof -Wno-selector -Wno-strict-selector-match -Wundeclared-selector -Wno-deprecated-implementations -DB4I_VERSION=10 -DNS_BLOCK_ASSERTIONS=1 -isysroot /Applications/Xcode.app/Contents/Developer/Platforms/iPhoneOS.platform/Developer/SDKs/iPhoneOS11.2.sdk -fstrict-aliasing -Wprotocol -Wdeprecated-declarations -miphoneos-version-min=7.0 -fvisibility=hidden -Wno-sign-conversion -Wno-infinite-recursion -Wno-comma -Wno-block-capture-autoreleasing -Wno-strict-prototypes -iquote /Users/administrator/Documents/UploadedProjects/<user id>/build/B4iProject.build/Release-iphoneos/B4iProject.build/B4i\ Example-generated-files.hmap -I/Users/administrator/Documents/UploadedProjects/<user id>/build/B4iProject.build/Release-iphoneos/B4iProject.build/B4i\ Example-own-target-headers.hmap -I/Users/administrator/Documents/UploadedProjects/<user id>/build/B4iProject.build/Release-iphoneos/B4iProject.build/B4i\ Example-all-target-headers.hmap -iquote /Users/administrator/Documents/UploadedProjects/<user id>/build/B4iProject.build/Release-iphoneos/B4iProject.build/B4i\ Example-project-headers.hmap -I/Users/administrator/Documents/UploadedProjects/<user id>/Payload/include -I/Users/administrator/Documents/UploadedProjects/<user id>/build/B4iProject.build/Release-iphoneos/B4iProject.build/DerivedSources/arm64 -I/Users/administrator/Documents/UploadedProjects/<user id>/build/B4iProject.build/Release-iphoneos/B4iProject.build/DerivedSources -F/Users/administrator/Documents/UploadedProjects/<user id>/Payload -F../../Libs -MMD -MT dependencies -MF /Users/administrator/Documents/UploadedProjects/<user id>/build/B4iProject.build/Release-iphoneos/B4iProject.build/Objects-normal/arm64/b4i_main.d --serialize-diagnostics /Users/administrator/Documents/UploadedProjects/<user id>/build/B4iProject.build/Release-iphoneos/B4iProject.build/Objects-normal/arm64/b4i_main.dia -c /Users/administrator/Documents/UploadedProjects/<user id>/B4iProject/b4i_main.m -o /Users/administrator/Documents/UploadedProjects/<user id>/build/B4iProject.build/Release-iphoneos/B4iProject.build/Objects-normal/arm64/b4i_main.o


Error: ** BUILD FAILED **


The following build commands failed:
CompileC build/B4iProject.build/Release-iphoneos/B4iProject.build/Objects-normal/arm64/b4i_auswahl.o B4iProject/b4i_auswahl.m normal arm64 objective-c com.apple.compilers.llvm.clang.1_0.compiler
(1 failure)
------------------------------------------------------------------------------------------------------------------------------------------------------------------------------------------------------------------------------------------------------------------
 

joergb

Member
Licensed User
wow, thank you very much.
Great suppurt on sunday morning .
And it works .

thanks again
 
Top