iOS Question Error building to iOS Simulator

JonPM

Well-Known Member
Licensed User
Hey all! It's been a while since I've been around here but I've picked B4x back up and now having difficulties building to iOS Simulator. I can build to a device just fine, but I get the error message below when building to the Simulator:

B4X:
B4i Version: 4.81
Parsing code.    (0.01s)
Compiling code.    (0.73s)
Compiling layouts code.    (0.06s)
Compiling debugger engine code.    (6.41s)
Building Xcode project    (0.98s)
Sending data to remote compiler.    Error
Out: Build settings from command line:
    ARCHS = x86_64
    CODE_SIGNING_REQUIRED = NO
    CONFIGURATION_BUILD_DIR = /Users/jon/UploadedProjects/<user id>/Payload
    PRODUCT_NAME = B4i Example
    SDKROOT = iphonesimulator11.3

=== BUILD TARGET B4iProject OF PROJECT B4iProject WITH CONFIGURATION Release ===

Check dependencies

Create product structure
/bin/mkdir -p /Users/jon/UploadedProjects/<user id>/Payload/B4i\ Example.app

CompileC build/B4iProject.build/Release-iphonesimulator/B4iProject.build/Objects-normal/x86_64/main.o B4iProject/main.m normal x86_64 objective-c com.apple.compilers.llvm.clang.1_0.compiler
    cd /Users/jon/UploadedProjects/<user id>
    export LANG=en_US.US-ASCII
    export PATH="/Applications/Xcode.app/Contents/Developer/Platforms/iPhoneSimulator.platform/Developer/usr/bin:/Applications/Xcode.app/Contents/Developer/usr/bin:/usr/local/bin:/usr/bin:/bin:/usr/sbin:/sbin:/opt/X11/bin:/usr/local/git/bin:/Users/jon/sdk/platform-tools/:/Users/jon/Development/adt-bundle-mac-x86_64-20130729/sdk/platform-tools/:/Users/jon/flutter/bin"
    /Applications/Xcode.app/Contents/Developer/Toolchains/XcodeDefault.xctoolchain/usr/bin/clang -x objective-c -arch x86_64 -fmessage-length=0 -fdiagnostics-show-note-include-stack -fmacro-backtrace-limit=0 -std=gnu99 -fobjc-arc -fmodules -gmodules -fmodules-prune-interval=86400 -fmodules-prune-after=345600 -fbuild-session-file=/var/folders/kt/gs50l3pd5h5074qf4q3b8wph0000gn/C/org.llvm.clang/ModuleCache.noindex/Session.modulevalidation -fmodules-validate-once-per-build-session -Wnon-modular-include-in-framework-module -Werror=non-modular-include-in-framework-module -Wno-trigraphs -fpascal-strings -O0 -Wno-missing-field-initializers -Wno-missing-prototypes -Werror=return-type -Wno-implicit-atomic-properties -Werror=deprecated-objc-isa-usage -Werror=objc-root-class -Wno-arc-repeated-use-of-weak -Wduplicate-method-match -Wno-missing-braces -Wparentheses -Wswitch -Wunused-function -Wno-unused-label -Wno-unused-parameter -Wunused-variable -Wunused-value -Wempty-body -Wuninitialized -Wconditional-uninitialized -Wno-unknown-pragmas -Wno-shadow -Wno-four-char-constants -Wno-conversion -Wconstant-conversion -Wint-conversion -Wbool-conversion -Wenum-conversion -Wno-float-conversion -Wno-non-literal-null-conversion -Wno-objc-literal-conversion -Wshorten-64-to-32 -Wpointer-sign -Wno-newline-eof -Wno-selector -Wno-strict-selector-match -Wundeclared-selector -Wno-deprecated-implementations -DNS_BLOCK_ASSERTIONS=1 -DOBJC_OLD_DISPATCH_PROTOTYPES=1 -isysroot /Applications/Xcode.app/Contents/Developer/Platforms/iPhoneSimulator.platform/Developer/SDKs/iPhoneSimulator11.3.sdk -fasm-blocks -fstrict-aliasing -Wprotocol -Wdeprecated-declarations -mios-simulator-version-min=7.0 -fvisibility=hidden -Wno-sign-conversion -Wno-infinite-recursion -Wno-comma -Wno-block-capture-autoreleasing -Wno-strict-prototypes -fobjc-abi-version=2 -fobjc-legacy-dispatch -iquote /Users/jon/UploadedProjects/<user id>/build/B4iProject.build/Release-iphonesimulator/B4iProject.build/B4i\ Example-generated-files.hmap -I/Users/jon/UploadedProjects/<user id>/build/B4iProject.build/Release-iphonesimulator/B4iProject.build/B4i\ Example-own-target-headers.hmap -I/Users/jon/UploadedProjects/<user id>/build/B4iProject.build/Release-iphonesimulator/B4iProject.build/B4i\ Example-all-target-headers.hmap -iquote /Users/jon/UploadedProjects/<user id>/build/B4iProject.build/Release-iphonesimulator/B4iProject.build/B4i\ Example-project-headers.hmap -I/Users/jon/UploadedProjects/<user id>/Payload/include -I/Users/jon/UploadedProjects/<user id>/build/B4iProject.build/Release-iphonesimulator/B4iProject.build/DerivedSources/x86_64 -I/Users/jon/UploadedProjects/<user id>/build/B4iProject.build/Release-iphonesimulator/B4iProject.build/DerivedSources -F/Users/jon/UploadedProjects/<user id>/Payload -F../../Libs -MMD -MT dependencies -MF /Users/jon/UploadedProjects/<user id>/build/B4iProject.build/Release-iphonesimulator/B4iProject.build/Objects-normal/x86_64/main.d --serialize-diagnostics /Users/jon/UploadedProjects/<user id>/build/B4iProject.build/Release-iphonesimulator/B4iProject.build/Objects-normal/x86_64/main.dia -c /Users/jon/UploadedProjects/<user id>/B4iProject/main.m -o /Users/jon/UploadedProjects/<user id>/build/B4iProject.build/Release-iphonesimulator/B4iProject.build/Objects-normal/x86_64/main.o

CompileC build/B4iProject.build/Release-iphonesimulator/B4iProject.build/Objects-normal/x86_64/b4i_calcs.o B4iProject/b4i_calcs.m normal x86_64 objective-c com.apple.compilers.llvm.clang.1_0.compiler
    cd /Users/jon/UploadedProjects/<user id>
    export LANG=en_US.US-ASCII
    export PATH="/Applications/Xcode.app/Contents/Developer/Platforms/iPhoneSimulator.platform/Developer/usr/bin:/Applications/Xcode.app/Contents/Developer/usr/bin:/usr/local/bin:/usr/bin:/bin:/usr/sbin:/sbin:/opt/X11/bin:/usr/local/git/bin:/Users/jon/sdk/platform-tools/:/Users/jon/Development/adt-bundle-mac-x86_64-20130729/sdk/platform-tools/:/Users/jon/flutter/bin"
    /Applications/Xcode.app/Contents/Developer/Toolchains/XcodeDefault.xctoolchain/usr/bin/clang -x objective-c -arch x86_64 -fmessage-length=0 -fdiagnostics-show-note-include-stack -fmacro-backtrace-limit=0 -std=gnu99 -fobjc-arc -fmodules -gmodules -fmodules-prune-interval=86400 -fmodules-prune-after=345600 -fbuild-session-file=/var/folders/kt/gs50l3pd5h5074qf4q3b8wph0000gn/C/org.llvm.clang/ModuleCache.noindex/Session.modulevalidation -fmodules-validate-once-per-build-session -Wnon-modular-include-in-framework-module -Werror=non-modular-include-in-framework-module -Wno-trigraphs -fpascal-strings -O0 -Wno-missing-field-initializers -Wno-missing-prototypes -Werror=return-type -Wno-implicit-atomic-properties -Werror=deprecated-objc-isa-usage -Werror=objc-root-class -Wno-arc-repeated-use-of-weak -Wduplicate-method-match -Wno-missing-braces -Wparentheses -Wswitch -Wunused-function -Wno-unused-label -Wno-unused-parameter -Wunused-variable -Wunused-value -Wempty-body -Wuninitialized -Wconditional-uninitialized -Wno-unknown-pragmas -Wno-shadow -Wno-four-char-constants -Wno-conversion -Wconstant-conversion -Wint-conversion -Wbool-conversion -Wenum-conversion -Wno-float-conversion -Wno-non-literal-null-conversion -Wno-objc-literal-conversion -Wshorten-64-to-32 -Wpointer-sign -Wno-newline-eof -Wno-selector -Wno-strict-selector-match -Wundeclared-selector -Wno-deprecated-implementations -DNS_BLOCK_ASSERTIONS=1 -DOBJC_OLD_DISPATCH_PROTOTYPES=1 -isysroot /Applications/Xcode.app/Contents/Developer/Platforms/iPhoneSimulator.platform/Developer/SDKs/iPhoneSimulator11.3.sdk -fasm-blocks -fstrict-aliasing -Wprotocol -Wdeprecated-declarations -mios-simulator-version-min=7.0 -fvisibility=hidden -Wno-sign-conversion -Wno-infinite-recursion -Wno-comma -Wno-block-capture-autoreleasing -Wno-strict-prototypes -fobjc-abi-version=2 -fobjc-legacy-dispatch -iquote /Users/jon/UploadedProjects/<user id>/build/B4iProject.build/Release-iphonesimulator/B4iProject.build/B4i\ Example-generated-files.hmap -I/Users/jon/UploadedProjects/<user id>/build/B4iProject.build/Release-iphonesimulator/B4iProject.build/B4i\ Example-own-target-headers.hmap -I/Users/jon/UploadedProjects/<user id>/build/B4iProject.build/Release-iphonesimulator/B4iProject.build/B4i\ Example-all-target-headers.hmap -iquote /Users/jon/UploadedProjects/<user id>/build/B4iProject.build/Release-iphonesimulator/B4iProject.build/B4i\ Example-project-headers.hmap -I/Users/jon/UploadedProjects/<user id>/Payload/include -I/Users/jon/UploadedProjects/<user id>/build/B4iProject.build/Release-iphonesimulator/B4iProject.build/DerivedSources/x86_64 -I/Users/jon/UploadedProjects/<user id>/build/B4iProject.build/Release-iphonesimulator/B4iProject.build/DerivedSources -F/Users/jon/UploadedProjects/<user id>/Payload -F../../Libs -MMD -MT dependencies -MF /Users/jon/UploadedProjects/<user id>/build/B4iProject.build/Release-iphonesimulator/B4iProject.build/Objects-normal/x86_64/b4i_calcs.d --serialize-diagnostics /Users/jon/UploadedProjects/<user id>/build/B4iProject.build/Release-iphonesimulator/B4iProject.build/Objects-normal/x86_64/b4i_calcs.dia -c /Users/jon/UploadedProjects/<user id>/B4iProject/b4i_calcs.m -o /Users/jon/UploadedProjects/<user id>/build/B4iProject.build/Release-iphonesimulator/B4iProject.build/Objects-normal/x86_64/b4i_calcs.o
In file included from /Users/jon/UploadedProjects/<user id>/B4iProject/b4i_calcs.m:2:
/Users/jon/UploadedProjects/<user id>/B4iProject/b4i_calcs.h:1:9: fatal error: 'iCore.h' file not found
#import "iCore.h"
        ^~~~~~~~~
1 error generated.

CompileC build/B4iProject.build/Release-iphonesimulator/B4iProject.build/Objects-normal/x86_64/LS_scv.o B4iProject/LS_scv.m normal x86_64 objective-c com.apple.compilers.llvm.clang.1_0.compiler
    cd /Users/jon/UploadedProjects/<user id>
    export LANG=en_US.US-ASCII
    export PATH="/Applications/Xcode.app/Contents/Developer/Platforms/iPhoneSimulator.platform/Developer/usr/bin:/Applications/Xcode.app/Contents/Developer/usr/bin:/usr/local/bin:/usr/bin:/bin:/usr/sbin:/sbin:/opt/X11/bin:/usr/local/git/bin:/Users/jon/sdk/platform-tools/:/Users/jon/Development/adt-bundle-mac-x86_64-20130729/sdk/platform-tools/:/Users/jon/flutter/bin"
    /Applications/Xcode.app/Contents/Developer/Toolchains/XcodeDefault.xctoolchain/usr/bin/clang -x objective-c -arch x86_64 -fmessage-length=0 -fdiagnostics-show-note-include-stack -fmacro-backtrace-limit=0 -std=gnu99 -fobjc-arc -fmodules -gmodules -fmodules-prune-interval=86400 -fmodules-prune-after=345600 -fbuild-session-file=/var/folders/kt/gs50l3pd5h5074qf4q3b8wph0000gn/C/org.llvm.clang/ModuleCache.noindex/Session.modulevalidation -fmodules-validate-once-per-build-session -Wnon-modular-include-in-framework-module -Werror=non-modular-include-in-framework-module -Wno-trigraphs -fpascal-strings -O0 -Wno-missing-field-initializers -Wno-missing-prototypes -Werror=return-type -Wno-implicit-atomic-properties -Werror=deprecated-objc-isa-usage -Werror=objc-root-class -Wno-arc-repeated-use-of-weak -Wduplicate-method-match -Wno-missing-braces -Wparentheses -Wswitch -Wunused-function -Wno-unused-label -Wno-unused-parameter -Wunused-variable -Wunused-value -Wempty-body -Wuninitialized -Wconditional-uninitialized -Wno-unknown-pragmas -Wno-shadow -Wno-four-char-constants -Wno-conversion -Wconstant-conversion -Wint-conversion -Wbool-conversion -Wenum-conversion -Wno-float-conversion -Wno-non-literal-null-conversion -Wno-objc-literal-conversion -Wshorten-64-to-32 -Wpointer-sign -Wno-newline-eof -Wno-selector -Wno-strict-selector-match -Wundeclared-selector -Wno-deprecated-implementations -DNS_BLOCK_ASSERTIONS=1 -DOBJC_OLD_DISPATCH_PROTOTYPES=1 -isysroot /Applications/Xcode.app/Contents/Developer/Platforms/iPhoneSimulator.platform/Developer/SDKs/iPhoneSimulator11.3.sdk -fasm-blocks -fstrict-aliasing -Wprotocol -Wdeprecated-declarations -mios-simulator-version-min=7.0 -fvisibility=hidden -Wno-sign-conversion -Wno-infinite-recursion -Wno-comma -Wno-block-capture-autoreleasing -Wno-strict-prototypes -fobjc-abi-version=2 -fobjc-legacy-dispatch -iquote /Users/jon/UploadedProjects/<user id>/build/B4iProject.build/Release-iphonesimulator/B4iProject.build/B4i\ Example-generated-files.hmap -I/Users/jon/UploadedProjects/<user id>/build/B4iProject.build/Release-iphonesimulator/B4iProject.build/B4i\ Example-own-target-headers.hmap -I/Users/jon/UploadedProjects/<user id>/build/B4iProject.build/Release-iphonesimulator/B4iProject.build/B4i\ Example-all-target-headers.hmap -iquote /Users/jon/UploadedProjects/<user id>/build/B4iProject.build/Release-iphonesimulator/B4iProject.build/B4i\ Example-project-headers.hmap -I/Users/jon/UploadedProjects/<user id>/Payload/include -I/Users/jon/UploadedProjects/<user id>/build/B4iProject.build/Release-iphonesimulator/B4iProject.build/DerivedSources/x86_64 -I/Users/jon/UploadedProjects/<user id>/build/B4iProject.build/Release-iphonesimulator/B4iProject.build/DerivedSources -F/Users/jon/UploadedProjects/<user id>/Payload -F../../Libs -MMD -MT dependencies -MF /Users/jon/UploadedProjects/<user id>/build/B4iProject.build/Release-iphonesimulator/B4iProject.build/Objects-normal/x86_64/LS_scv.d --serialize-diagnostics /Users/jon/UploadedProjects/<user id>/build/B4iProject.build/Release-iphonesimulator/B4iProject.build/Objects-normal/x86_64/LS_scv.dia -c /Users/jon/UploadedProjects/<user id>/B4iProject/LS_scv.m -o /Users/jon/UploadedProjects/<user id>/build/B4iProject.build/Release-iphonesimulator/B4iProject.build/Objects-normal/x86_64/LS_scv.o
/Users/jon/UploadedProjects/<user id>/B4iProject/LS_scv.m:2:9: fatal error: 'iCore.h' file not found
#import "iCore.h"
        ^~~~~~~~~
1 error generated.

CompileC build/B4iProject.build/Release-iphonesimulator/B4iProject.build/Objects-normal/x86_64/LS_1.o B4iProject/LS_1.m normal x86_64 objective-c com.apple.compilers.llvm.clang.1_0.compiler
    cd /Users/jon/UploadedProjects/<user id>
    export LANG=en_US.US-ASCII
    export PATH="/Applications/Xcode.app/Contents/Developer/Platforms/iPhoneSimulator.platform/Developer/usr/bin:/Applications/Xcode.app/Contents/Developer/usr/bin:/usr/local/bin:/usr/bin:/bin:/usr/sbin:/sbin:/opt/X11/bin:/usr/local/git/bin:/Users/jon/sdk/platform-tools/:/Users/jon/Development/adt-bundle-mac-x86_64-20130729/sdk/platform-tools/:/Users/jon/flutter/bin"
    /Applications/Xcode.app/Contents/Developer/Toolchains/XcodeDefault.xctoolchain/usr/bin/clang -x objective-c -arch x86_64 -fmessage-length=0 -fdiagnostics-show-note-include-stack -fmacro-backtrace-limit=0 -std=gnu99 -fobjc-arc -fmodules -gmodules -fmodules-prune-interval=86400 -fmodules-prune-after=345600 -fbuild-session-file=/var/folders/kt/gs50l3pd5h5074qf4q3b8wph0000gn/C/org.llvm.clang/ModuleCache.noindex/Session.modulevalidation -fmodules-validate-once-per-build-session -Wnon-modular-include-in-framework-module -Werror=non-modular-include-in-framework-module -Wno-trigraphs -fpascal-strings -O0 -Wno-missing-field-initializers -Wno-missing-prototypes -Werror=return-type -Wno-implicit-atomic-properties -Werror=deprecated-objc-isa-usage -Werror=objc-root-class -Wno-arc-repeated-use-of-weak -Wduplicate-method-match -Wno-missing-braces -Wparentheses -Wswitch -Wunused-function -Wno-unused-label -Wno-unused-parameter -Wunused-variable -Wunused-value -Wempty-body -Wuninitialized -Wconditional-uninitialized -Wno-unknown-pragmas -Wno-shadow -Wno-four-char-constants -Wno-conversion -Wconstant-conversion -Wint-conversion -Wbool-conversion -Wenum-conversion -Wno-float-conversion -Wno-non-literal-null-conversion -Wno-objc-literal-conversion -Wshorten-64-to-32 -Wpointer-sign -Wno-newline-eof -Wno-selector -Wno-strict-selector-match -Wundeclared-selector -Wno-deprecated-implementations -DNS_BLOCK_ASSERTIONS=1 -DOBJC_OLD_DISPATCH_PROTOTYPES=1 -isysroot /Applications/Xcode.app/Contents/Developer/Platforms/iPhoneSimulator.platform/Developer/SDKs/iPhoneSimulator11.3.sdk -fasm-blocks -fstrict-aliasing -Wprotocol -Wdeprecated-declarations -mios-simulator-version-min=7.0 -fvisibility=hidden -Wno-sign-conversion -Wno-infinite-recursion -Wno-comma -Wno-block-capture-autoreleasing -Wno-strict-prototypes -fobjc-abi-version=2 -fobjc-legacy-dispatch -iquote /Users/jon/UploadedProjects/<user id>/build/B4iProject.build/Release-iphonesimulator/B4iProject.build/B4i\ Example-generated-files.hmap -I/Users/jon/UploadedProjects/<user id>/build/B4iProject.build/Release-iphonesimulator/B4iProject.build/B4i\ Example-own-target-headers.hmap -I/Users/jon/UploadedProjects/<user id>/build/B4iProject.build/Release-iphonesimulator/B4iProject.build/B4i\ Example-all-target-headers.hmap -iquote /Users/jon/UploadedProjects/<user id>/build/B4iProject.build/Release-iphonesimulator/B4iProject.build/B4i\ Example-project-headers.hmap -I/Users/jon/UploadedProjects/<user id>/Payload/include -I/Users/jon/UploadedProjects/<user id>/build/B4iProject.build/Release-iphonesimulator/B4iProject.build/DerivedSources/x86_64 -I/Users/jon/UploadedProjects/<user id>/build/B4iProject.build/Release-iphonesimulator/B4iProject.build/DerivedSources -F/Users/jon/UploadedProjects/<user id>/Payload -F../../Libs -MMD -MT dependencies -MF /Users/jon/UploadedProjects/<user id>/build/B4iProject.build/Release-iphonesimulator/B4iProject.build/Objects-normal/x86_64/LS_1.d --serialize-diagnostics /Users/jon/UploadedProjects/<user id>/build/B4iProject.build/Release-iphonesimulator/B4iProject.build/Objects-normal/x86_64/LS_1.dia -c /Users/jon/UploadedProjects/<user id>/B4iProject/LS_1.m -o /Users/jon/UploadedProjects/<user id>/build/B4iProject.build/Release-iphonesimulator/B4iProject.build/Objects-normal/x86_64/LS_1.o
/Users/jon/UploadedProjects/<user id>/B4iProject/LS_1.m:2:9: fatal error: 'iCore.h' file not found
#import "iCore.h"
        ^~~~~~~~~
1 error generated.


Error: ** BUILD FAILED **


The following build commands failed:
    CompileC build/B4iProject.build/Release-iphonesimulator/B4iProject.build/Objects-normal/x86_64/b4i_calcs.o B4iProject/b4i_calcs.m normal x86_64 objective-c com.apple.compilers.llvm.clang.1_0.compiler
    CompileC build/B4iProject.build/Release-iphonesimulator/B4iProject.build/Objects-normal/x86_64/LS_scv.o B4iProject/LS_scv.m normal x86_64 objective-c com.apple.compilers.llvm.clang.1_0.compiler
    CompileC build/B4iProject.build/Release-iphonesimulator/B4iProject.build/Objects-normal/x86_64/LS_1.o B4iProject/LS_1.m normal x86_64 objective-c com.apple.compilers.llvm.clang.1_0.compiler
(3 failures)
 
Top