JavaScript is disabled. For a better experience, please enable JavaScript in your browser before proceeding.
You are using an out of date browser. It may not display this or other websites correctly.
You should upgrade or use an
alternative browser .
iOS Question Error in Build Release APP
Active Member
Licensed User
Hello,
Today I made some changes to 2 apps, and I have the same error in 2 Apps when trying to build release APP in hosted builder.
I use 4.40 version, the error I get is this:
B4i Version: 4.40 BETA #1
Parsing code. (0.04s)
Compiling code. (0.09s)
Compiling layouts code. (0.02s)
Building Xcode project (0.25s)
Sending data to remote compiler. Error
Out: Build settings from command line:
ARCHS = armv7 arm64
CODE_SIGN_IDENTITY = iPhone
CONFIGURATION_BUILD_DIR = /Users/administrator/Documents/UploadedProjects/<user id>/Payload
OTHER_CODE_SIGN_FLAGS = --keychain <user id>
PRODUCT_NAME = De Prati
PROVISIONING_PROFILE = 23d0bb49-42d4-4037-ad6d-545eed5cf6c8
=== BUILD TARGET B4iProject OF PROJECT B4iProject WITH CONFIGURATION Release ===
Check dependencies
Write auxiliary files
write-file /Users/administrator/Documents/UploadedProjects/<user id>/build/B4iProject.build/Release-iphoneos/B4iProject.build/De\ Prati.hmap
/bin/mkdir -p /Users/administrator/Documents/UploadedProjects/<user id>/build/B4iProject.build/Release-iphoneos/B4iProject.build/Objects-normal/arm64
write-file /Users/administrator/Documents/UploadedProjects/<user id>/build/B4iProject.build/Release-iphoneos/B4iProject.build/Objects-normal/arm64/De\ Prati.LinkFileList
write-file /Users/administrator/Documents/UploadedProjects/<user id>/build/B4iProject.build/Release-iphoneos/B4iProject.build/De\ Prati-all-target-headers.hmap
write-file /Users/administrator/Documents/UploadedProjects/<user id>/build/B4iProject.build/Release-iphoneos/B4iProject.build/De\ Prati-generated-files.hmap
write-file /Users/administrator/Documents/UploadedProjects/<user id>/build/B4iProject.build/Release-iphoneos/B4iProject.build/De\ Prati-project-headers.hmap
write-file /Users/administrator/Documents/UploadedProjects/<user id>/build/B4iProject.build/Release-iphoneos/B4iProject.build/De\ Prati-own-target-headers.hmap
/bin/mkdir -p /Users/administrator/Documents/UploadedProjects/<user id>/build/B4iProject.build/Release-iphoneos/B4iProject.build/Objects-normal/armv7
write-file /Users/administrator/Documents/UploadedProjects/<user id>/build/B4iProject.build/Release-iphoneos/B4iProject.build/Objects-normal/armv7/De\ Prati.LinkFileList
write-file /Users/administrator/Documents/UploadedProjects/<user id>/build/B4iProject.build/Release-iphoneos/B4iProject.build/De\ Prati-all-non-framework-target-headers.hmap
Create product structure
/bin/mkdir -p /Users/administrator/Documents/UploadedProjects/<user id>/Payload/De\ Prati.app
CompileC build/B4iProject.build/Release-iphoneos/B4iProject.build/Objects-normal/armv7/main.o B4iProject/main.m normal armv7 objective-c com.apple.compilers.llvm.clang.1_0.compiler
cd /Users/administrator/Documents/UploadedProjects/<user id>
export LANG=en_US.US-ASCII
export PATH="/Applications/Xcode.app/Contents/Developer/Platforms/iPhoneOS.platform/Developer/usr/bin:/Applications/Xcode.app/Contents/Developer/usr/bin:/usr/local/bin:/usr/bin:/bin:/usr/sbin:/sbin"
/Applications/Xcode.app/Contents/Developer/Toolchains/XcodeDefault.xctoolchain/usr/bin/clang -x objective-c -arch armv7 -fmessage-length=0 -fdiagnostics-show-note-include-stack -fmacro-backtrace-limit=0 -std=gnu99 -fobjc-arc -fmodules -gmodules -fmodules-prune-interval=86400 -fmodules-prune-after=345600 -fbuild-session-file=/var/folders/35/nx43fs8567l9z_wvvpc35snh0000gn/C/org.llvm.clang/ModuleCache/Session.modulevalidation -fmodules-validate-once-per-build-session -Wnon-modular-include-in-framework-module -Werror=non-modular-include-in-framework-module -Wno-trigraphs -fpascal-strings -O0 -Wno-missing-field-initializers -Wno-missing-prototypes -Werror=return-type -Wno-implicit-atomic-properties -Werror=deprecated-objc-isa-usage -Werror=objc-root-class -Wno-arc-repeated-use-of-weak -Wduplicate-method-match -Wno-missing-braces -Wparentheses -Wswitch -Wunused-function -Wno-unused-label -Wno-unused-parameter -Wunused-variable -Wunused-value -Wempty-body -Wconditional-uninitialized -Wno-unknown-pragmas -Wno-shadow -Wno-four-char-constants -Wno-conversion -Wconstant-conversion -Wint-conversion -Wbool-conversion -Wenum-conversion -Wshorten-64-to-32 -Wpointer-sign -Wno-newline-eof -Wno-selector -Wno-strict-selector-match -Wundeclared-selector -Wno-deprecated-implementations -DNS_BLOCK_ASSERTIONS=1 -isysroot /Applications/Xcode.app/Contents/Developer/Platforms/iPhoneOS.platform/Developer/SDKs/iPhoneOS10.1.sdk -fstrict-aliasing -Wprotocol -Wdeprecated-declarations -miphoneos-version-min=8.0 -g -fvisibility=hidden -Wno-sign-conversion -Wno-infinite-recursion -iquote /Users/administrator/Documents/UploadedProjects/<user id>/build/B4iProject.build/Release-iphoneos/B4iProject.build/De\ Prati-generated-files.hmap -I/Users/administrator/Documents/UploadedProjects/<user id>/build/B4iProject.build/Release-iphoneos/B4iProject.build/De\ Prati-own-target-headers.hmap -I/Users/administrator/Documents/UploadedProjects/<user id>/build/B4iProject.build/Release-iphoneos/B4iProject.build/De\ Prati-all-target-headers.hmap -iquote /Users/administrator/Documents/UploadedProjects/<user id>/build/B4iProject.build/Release-iphoneos/B4iProject.build/De\ Prati-project-headers.hmap -I/Users/administrator/Documents/UploadedProjects/<user id>/Payload/include -I/Users/administrator/Documents/UploadedProjects/<user id>/build/B4iProject.build/Release-iphoneos/B4iProject.build/DerivedSources/armv7 -I/Users/administrator/Documents/UploadedProjects/<user id>/build/B4iProject.build/Release-iphoneos/B4iProject.build/DerivedSources -F/Users/administrator/Documents/UploadedProjects/<user id>/Payload -F../../Libs -MMD -MT dependencies -MF /Users/administrator/Documents/UploadedProjects/<user id>/build/B4iProject.build/Release-iphoneos/B4iProject.build/Objects-normal/armv7/main.d --serialize-diagnostics /Users/administrator/Documents/UploadedProjects/<user id>/build/B4iProject.build/Release-iphoneos/B4iProject.build/Objects-normal/armv7/main.dia -c /Users/administrator/Documents/UploadedProjects/<user id>/B4iProject/main.m -o /Users/administrator/Documents/UploadedProjects/<user id>/build/B4iProject.build/Release-iphoneos/B4iProject.build/Objects-normal/armv7/main.o
CompileC build/B4iProject.build/Release-iphoneos/B4iProject.build/Objects-normal/armv7/b4i_contenidomodule.o B4iProject/b4i_contenidomodule.m normal armv7 objective-c com.apple.compilers.llvm.clang.1_0.compiler
cd /Users/administrator/Documents/UploadedProjects/<user id>
export LANG=en_US.US-ASCII
export PATH="/Applications/Xcode.app/Contents/Developer/Platforms/iPhoneOS.platform/Developer/usr/bin:/Applications/Xcode.app/Contents/Developer/usr/bin:/usr/local/bin:/usr/bin:/bin:/usr/sbin:/sbin"
/Applications/Xcode.app/Contents/Developer/Toolchains/XcodeDefault.xctoolchain/usr/bin/clang -x objective-c -arch armv7 -fmessage-length=0 -fdiagnostics-show-note-include-stack -fmacro-backtrace-limit=0 -std=gnu99 -fobjc-arc -fmodules -gmodules -fmodules-prune-interval=86400 -fmodules-prune-after=345600 -fbuild-session-file=/var/folders/35/nx43fs8567l9z_wvvpc35snh0000gn/C/org.llvm.clang/ModuleCache/Session.modulevalidation -fmodules-validate-once-per-build-session -Wnon-modular-include-in-framework-module -Werror=non-modular-include-in-framework-module -Wno-trigraphs -fpascal-strings -O0 -Wno-missing-field-initializers -Wno-missing-prototypes -Werror=return-type -Wno-implicit-atomic-properties -Werror=deprecated-objc-isa-usage -Werror=objc-root-class -Wno-arc-repeated-use-of-weak -Wduplicate-method-match -Wno-missing-braces -Wparentheses -Wswitch -Wunused-function -Wno-unused-label -Wno-unused-parameter -Wunused-variable -Wunused-value -Wempty-body -Wconditional-uninitialized -Wno-unknown-pragmas -Wno-shadow -Wno-four-char-constants -Wno-conversion -Wconstant-conversion -Wint-conversion -Wbool-conversion -Wenum-conversion -Wshorten-64-to-32 -Wpointer-sign -Wno-newline-eof -Wno-selector -Wno-strict-selector-match -Wundeclared-selector -Wno-deprecated-implementations -DNS_BLOCK_ASSERTIONS=1 -isysroot /Applications/Xcode.app/Contents/Developer/Platforms/iPhoneOS.platform/Developer/SDKs/iPhoneOS10.1.sdk -fstrict-aliasing -Wprotocol -Wdeprecated-declarations -miphoneos-version-min=8.0 -g -fvisibility=hidden -Wno-sign-conversion -Wno-infinite-recursion -iquote /Users/administrator/Documents/UploadedProjects/<user id>/build/B4iProject.build/Release-iphoneos/B4iProject.build/De\ Prati-generated-files.hmap -I/Users/administrator/Documents/UploadedProjects/<user id>/build/B4iProject.build/Release-iphoneos/B4iProject.build/De\ Prati-own-target-headers.hmap -I/Users/administrator/Documents/UploadedProjects/<user id>/build/B4iProject.build/Release-iphoneos/B4iProject.build/De\ Prati-all-target-headers.hmap -iquote /Users/administrator/Documents/UploadedProjects/<user id>/build/B4iProject.build/Release-iphoneos/B4iProject.build/De\ Prati-project-headers.hmap -I/Users/administrator/Documents/UploadedProjects/<user id>/Payload/include -I/Users/administrator/Documents/UploadedProjects/<user id>/build/B4iProject.build/Release-iphoneos/B4iProject.build/DerivedSources/armv7 -I/Users/administrator/Documents/UploadedProjects/<user id>/build/B4iProject.build/Release-iphoneos/B4iProject.build/DerivedSources -F/Users/administrator/Documents/UploadedProjects/<user id>/Payload -F../../Libs -MMD -MT dependencies -MF /Users/administrator/Documents/UploadedProjects/<user id>/build/B4iProject.build/Release-iphoneos/B4iProject.build/Objects-normal/armv7/b4i_contenidomodule.d --serialize-diagnostics /Users/administrator/Documents/UploadedProjects/<user id>/build/B4iProject.build/Release-iphoneos/B4iProject.build/Objects-normal/armv7/b4i_contenidomodule.dia -c /Users/administrator/Documents/UploadedProjects/<user id>/B4iProject/b4i_contenidomodule.m -o /Users/administrator/Documents/UploadedProjects/<user id>/build/B4iProject.build/Release-iphoneos/B4iProject.build/Objects-normal/armv7/b4i_contenidomodule.o
In file included from /Users/administrator/Documents/UploadedProjects/<user id>/B4iProject/b4i_contenidomodule.m:3:
/Users/administrator/Documents/UploadedProjects/<user id>/B4iProject/b4i_main.h:41:35: error: type of property '_globals' ('b4i_globals *') does not match type of accessor '_globals' ('void')
@property (nonatomic)b4i_globals* _globals;
^
/Users/administrator/Documents/UploadedProjects/<user id>/B4iProject/b4i_main.h:29:1: note: declared here
- (void) _globals;
^
In file included from /Users/administrator/Documents/UploadedProjects/<user id>/B4iProject/b4i_contenidomodule.m:4:
/Users/administrator/Documents/UploadedProjects/<user id>/B4iProject/b4i_startmodule.h:82:35: error: type of property '_globals' ('b4i_globals *') does not match type of accessor '_globals' ('void')
@property (nonatomic)b4i_globals* _globals;
^
/Users/administrator/Documents/UploadedProjects/<user id>/B4iProject/b4i_startmodule.h:32:1: note: declared here
- (void) _globals;
^
2 errors generated.
CompileC build/B4iProject.build/Release-iphoneos/B4iProject.build/Objects-normal/armv7/b4i_globals.o B4iProject/b4i_globals.m normal armv7 objective-c com.apple.compilers.llvm.clang.1_0.compiler
cd /Users/administrator/Documents/UploadedProjects/<user id>
export LANG=en_US.US-ASCII
export PATH="/Applications/Xcode.app/Contents/Developer/Platforms/iPhoneOS.platform/Developer/usr/bin:/Applications/Xcode.app/Contents/Developer/usr/bin:/usr/local/bin:/usr/bin:/bin:/usr/sbin:/sbin"
/Applications/Xcode.app/Contents/Developer/Toolchains/XcodeDefault.xctoolchain/usr/bin/clang -x objective-c -arch armv7 -fmessage-length=0 -fdiagnostics-show-note-include-stack -fmacro-backtrace-limit=0 -std=gnu99 -fobjc-arc -fmodules -gmodules -fmodules-prune-interval=86400 -fmodules-prune-after=345600 -fbuild-session-file=/var/folders/35/nx43fs8567l9z_wvvpc35snh0000gn/C/org.llvm.clang/ModuleCache/Session.modulevalidation -fmodules-validate-once-per-build-session -Wnon-modular-include-in-framework-module -Werror=non-modular-include-in-framework-module -Wno-trigraphs -fpascal-strings -O0 -Wno-missing-field-initializers -Wno-missing-prototypes -Werror=return-type -Wno-implicit-atomic-properties -Werror=deprecated-objc-isa-usage -Werror=objc-root-class -Wno-arc-repeated-use-of-weak -Wduplicate-method-match -Wno-missing-braces -Wparentheses -Wswitch -Wunused-function -Wno-unused-label -Wno-unused-parameter -Wunused-variable -Wunused-value -Wempty-body -Wconditional-uninitialized -Wno-unknown-pragmas -Wno-shadow -Wno-four-char-constants -Wno-conversion -Wconstant-conversion -Wint-conversion -Wbool-conversion -Wenum-conversion -Wshorten-64-to-32 -Wpointer-sign -Wno-newline-eof -Wno-selector -Wno-strict-selector-match -Wundeclared-selector -Wno-deprecated-implementations -DNS_BLOCK_ASSERTIONS=1 -isysroot /Applications/Xcode.app/Contents/Developer/Platforms/iPhoneOS.platform/Developer/SDKs/iPhoneOS10.1.sdk -fstrict-aliasing -Wprotocol -Wdeprecated-declarations -miphoneos-version-min=8.0 -g -fvisibility=hidden -Wno-sign-conversion -Wno-infinite-recursion -iquote /Users/administrator/Documents/UploadedProjects/<user id>/build/B4iProject.build/Release-iphoneos/B4iProject.build/De\ Prati-generated-files.hmap -I/Users/administrator/Documents/UploadedProjects/<user id>/build/B4iProject.build/Release-iphoneos/B4iProject.build/De\ Prati-own-target-headers.hmap -I/Users/administrator/Documents/UploadedProjects/<user id>/build/B4iProject.build/Release-iphoneos/B4iProject.build/De\ Prati-all-target-headers.hmap -iquote /Users/administrator/Documents/UploadedProjects/<user id>/build/B4iProject.build/Release-iphoneos/B4iProject.build/De\ Prati-project-headers.hmap -I/Users/administrator/Documents/UploadedProjects/<user id>/Payload/include -I/Users/administrator/Documents/UploadedProjects/<user id>/build/B4iProject.build/Release-iphoneos/B4iProject.build/DerivedSources/armv7 -I/Users/administrator/Documents/UploadedProjects/<user id>/build/B4iProject.build/Release-iphoneos/B4iProject.build/DerivedSources -F/Users/administrator/Documents/UploadedProjects/<user id>/Payload -F../../Libs -MMD -MT dependencies -MF /Users/administrator/Documents/UploadedProjects/<user id>/build/B4iProject.build/Release-iphoneos/B4iProject.build/Objects-normal/armv7/b4i_globals.d --serialize-diagnostics /Users/administrator/Documents/UploadedProjects/<user id>/build/B4iProject.build/Release-iphoneos/B4iProject.build/Objects-normal/armv7/b4i_globals.dia -c /Users/administrator/Documents/UploadedProjects/<user id>/B4iProject/b4i_globals.m -o /Users/administrator/Documents/UploadedProjects/<user id>/build/B4iProject.build/Release-iphoneos/B4iProject.build/Objects-normal/armv7/b4i_globals.o
In file included from /Users/administrator/Documents/UploadedProjects/<user id>/B4iProject/b4i_globals.m:3:
/Users/administrator/Documents/UploadedProjects/<user id>/B4iProject/b4i_main.h:41:35: error: type of property '_globals' ('b4i_globals *') does not match type of accessor '_globals' ('void')
@property (nonatomic)b4i_globals* _globals;
^
/Users/administrator/Documents/UploadedProjects/<user id>/B4iProject/b4i_main.h:29:1: note: declared here
- (void) _globals;
^
In file included from /Users/administrator/Documents/UploadedProjects/<user id>/B4iProject/b4i_globals.m:4:
/Users/administrator/Documents/UploadedProjects/<user id>/B4iProject/b4i_startmodule.h:82:35: error: type of property '_globals' ('b4i_globals *') does not match type of accessor '_globals' ('void')
@property (nonatomic)b4i_globals* _globals;
^
/Users/administrator/Documents/UploadedProjects/<user id>/B4iProject/b4i_startmodule.h:32:1: note: declared here
- (void) _globals;
^
CompileC build/B4iProject.build/Release-iphoneos/B4iProject.build/Objects-normal/armv7/b4i_imagedownloader.o B4iProject/b4i_imagedownloader.m normal armv7 objective-c com.apple.compilers.llvm.clang.1_0.compiler
cd /Users/administrator/Documents/UploadedProjects/<user id>
export LANG=en_US.US-ASCII
export PATH="/Applications/Xcode.app/Contents/Developer/Platforms/iPhoneOS.platform/Developer/usr/bin:/Applications/Xcode.app/Contents/Developer/usr/bin:/usr/local/bin:/usr/bin:/bin:/usr/sbin:/sbin"
/Applications/Xcode.app/Contents/Developer/Toolchains/XcodeDefault.xctoolchain/usr/bin/clang -x objective-c -arch armv7 -fmessage-length=0 -fdiagnostics-show-note-include-stack -fmacro-backtrace-limit=0 -std=gnu99 -fobjc-arc -fmodules -gmodules -fmodules-prune-interval=86400 -fmodules-prune-after=345600 -fbuild-session-file=/var/folders/35/nx43fs8567l9z_wvvpc35snh0000gn/C/org.llvm.clang/ModuleCache/Session.modulevalidation -fmodules-validate-once-per-build-session -Wnon-modular-include-in-framework-module -Werror=non-modular-include-in-framework-module -Wno-trigraphs -fpascal-strings -O0 -Wno-missing-field-initializers -Wno-missing-prototypes -Werror=return-type -Wno-implicit-atomic-properties -Werror=deprecated-objc-isa-usage -Werror=objc-root-class -Wno-arc-repeated-use-of-weak -Wduplicate-method-match -Wno-missing-braces -Wparentheses -Wswitch -Wunused-function -Wno-unused-label -Wno-unused-parameter -Wunused-variable -Wunused-value -Wempty-body -Wconditional-uninitialized -Wno-unknown-pragmas -Wno-shadow -Wno-four-char-constants -Wno-conversion -Wconstant-conversion -Wint-conversion -Wbool-conversion -Wenum-conversion -Wshorten-64-to-32 -Wpointer-sign -Wno-newline-eof -Wno-selector -Wno-strict-selector-match -Wundeclared-selector -Wno-deprecated-implementations -DNS_BLOCK_ASSERTIONS=1 -isysroot /Applications/Xcode.app/Contents/Developer/Platforms/iPhoneOS.platform/Developer/SDKs/iPhoneOS10.1.sdk -fstrict-aliasing -Wprotocol -Wdeprecated-declarations -miphoneos-version-min=8.0 -g -fvisibility=hidden -Wno-sign-conversion -Wno-infinite-recursion -iquote /Users/administrator/Documents/UploadedProjects/<user id>/build/B4iProject.build/Release-iphoneos/B4iProject.build/De\ Prati-generated-files.hmap -I/Users/administrator/Documents/UploadedProjects/<user id>/build/B4iProject.build/Release-iphoneos/B4iProject.build/De\ Prati-own-target-headers.hmap -I/Users/administrator/Documents/UploadedProjects/<user id>/build/B4iProject.build/Release-iphoneos/B4iProject.build/De\ Prati-all-target-headers.hmap -iquote /Users/administrator/Documents/UploadedProjects/<user id>/build/B4iProject.build/Release-iphoneos/B4iProject.build/De\ Prati-project-headers.hmap -I/Users/administrator/Documents/UploadedProjects/<user id>/Payload/include -I/Users/administrator/Documents/UploadedProjects/<user id>/build/B4iProject.build/Release-iphoneos/B4iProject.build/DerivedSources/armv7 -I/Users/administrator/Documents/UploadedProjects/<user id>/build/B4iProject.build/Release-iphoneos/B4iProject.build/DerivedSources -F/Users/administrator/Documents/UploadedProjects/<user id>/Payload -F../../Libs -MMD -MT dependencies -MF /Users/administrator/Documents/UploadedProjects/<user id>/build/B4iProject.build/Release-iphoneos/B4iProject.build/Objects-normal/armv7/b4i_imagedownloader.d --serialize-diagnostics /Users/administrator/Documents/UploadedProjects/<user id>/build/B4iProject.build/Release-iphoneos/B4iProject.build/Objects-normal/armv7/b4i_imagedownloader.dia -c /Users/administrator/Documents/UploadedProjects/<user id>/B4iProject/b4i_imagedownloader.m -o /Users/administrator/Documents/UploadedProjects/<user id>/build/B4iProject.build/Release-iphoneos/B4iProject.build/Objects-normal/armv7/b4i_imagedownloader.o
In file included from /Users/administrator/Documents/UploadedProjects/<user id>/B4iProject/b4i_imagedownloader.m:3:
/Users/administrator/Documents/UploadedProjects/<user id>/B4iProject/b4i_main.h:41:35: error: type of property '_globals' ('b4i_globals *') does not match type of accessor '_globals' ('void')
@property (nonatomic)b4i_globals* _globals;
^
/Users/administrator/Documents/UploadedProjects/<user id>/B4iProject/b4i_main.h:29:1: note: declared here
- (void) _globals;
^
In file included from /Users/administrator/Documents/UploadedProjects/<user id>/B4iProject/b4i_imagedownloader.m:4:
/Users/administrator/Documents/UploadedProjects/<user id>/B4iProject/b4i_startmodule.h:82:35: error: type of property '_globals' ('b4i_globals *') does not match type of accessor '_globals' ('void')
@property (nonatomic)b4i_globals* _globals;
^
/Users/administrator/Documents/UploadedProjects/<user id>/B4iProject/b4i_startmodule.h:32:1: note: declared here
- (void) _globals;
^
2 errors generated.
CompileC build/B4iProject.build/Release-iphoneos/B4iProject.build/Objects-normal/armv7/b4i_listadomodule.o B4iProject/b4i_listadomodule.m normal armv7 objective-c com.apple.compilers.llvm.clang.1_0.compiler
cd /Users/administrator/Documents/UploadedProjects/<user id>
export LANG=en_US.US-ASCII
export PATH="/Applications/Xcode.app/Contents/Developer/Platforms/iPhoneOS.platform/Developer/usr/bin:/Applications/Xcode.app/Contents/Developer/usr/bin:/usr/local/bin:/usr/bin:/bin:/usr/sbin:/sbin"
/Applications/Xcode.app/Contents/Developer/Toolchains/XcodeDefault.xctoolchain/usr/bin/clang -x objective-c -arch armv7 -fmessage-length=0 -fdiagnostics-show-note-include-stack -fmacro-backtrace-limit=0 -std=gnu99 -fobjc-arc -fmodules -gmodules -fmodules-prune-interval=86400 -fmodules-prune-after=345600 -fbuild-session-file=/var/folders/35/nx43fs8567l9z_wvvpc35snh0000gn/C/org.llvm.clang/ModuleCache/Session.modulevalidation -fmodules-validate-once-per-build-session -Wnon-modular-include-in-framework-module -Werror=non-modular-include-in-framework-module -Wno-trigraphs -fpascal-strings -O0 -Wno-missing-field-initializers -Wno-missing-prototypes -Werror=return-type -Wno-implicit-atomic-properties -Werror=deprecated-objc-isa-usage -Werror=objc-root-class -Wno-arc-repeated-use-of-weak -Wduplicate-method-match -Wno-missing-braces -Wparentheses -Wswitch -Wunused-function -Wno-unused-label -Wno-unused-parameter -Wunused-variable -Wunused-value -Wempty-body -Wconditional-uninitialized -Wno-unknown-pragmas -Wno-shadow -Wno-four-char-constants -Wno-conversion -Wconstant-conversion -Wint-conversion -Wbool-conversion -Wenum-conversion -Wshorten-64-to-32 -Wpointer-sign -Wno-newline-eof -Wno-selector -Wno-strict-selector-match -Wundeclared-selector -Wno-deprecated-implementations -DNS_BLOCK_ASSERTIONS=1 -isysroot /Applications/Xcode.app/Contents/Developer/Platforms/iPhoneOS.platform/Developer/SDKs/iPhoneOS10.1.sdk -fstrict-aliasing -Wprotocol -Wdeprecated-declarations -miphoneos-version-min=8.0 -g -fvisibility=hidden -Wno-sign-conversion -Wno-infinite-recursion -iquote /Users/administrator/Documents/UploadedProjects/<user id>/build/B4iProject.build/Release-iphoneos/B4iProject.build/De\ Prati-generated-files.hmap -I/Users/administrator/Documents/UploadedProjects/<user id>/build/B4iProject.build/Release-iphoneos/B4iProject.build/De\ Prati-own-target-headers.hmap -I/Users/administrator/Documents/UploadedProjects/<user id>/build/B4iProject.build/Release-iphoneos/B4iProject.build/De\ Prati-all-target-headers.hmap -iquote /Users/administrator/Documents/UploadedProjects/<user id>/build/B4iProject.build/Release-iphoneos/B4iProject.build/De\ Prati-project-headers.hmap -I/Users/administrator/Documents/UploadedProjects/<user id>/Payload/include -I/Users/administrator/Documents/UploadedProjects/<user id>/build/B4iProject.build/Release-iphoneos/B4iProject.build/DerivedSources/armv7 -I/Users/administrator/Documents/UploadedProjects/<user id>/build/B4iProject.build/Release-iphoneos/B4iProject.build/DerivedSources -F/Users/administrator/Documents/UploadedProjects/<user id>/Payload -F../../Libs -MMD -MT dependencies -MF /Users/administrator/Documents/UploadedProjects/<user id>/build/B4iProject.build/Release-iphoneos/B4iProject.build/Objects-normal/armv7/b4i_listadomodule.d --serialize-diagnostics /Users/administrator/Documents/UploadedProjects/<user id>/build/B4iProject.build/Release-iphoneos/B4iProject.build/Objects-normal/armv7/b4i_listadomodule.dia -c /Users/administrator/Documents/UploadedProjects/<user id>/B4iProject/b4i_listadomodule.m -o /Users/administrator/Documents/UploadedProjects/<user id>/build/B4iProject.build/Release-iphoneos/B4iProject.build/Objects-normal/armv7/b4i_listadomodule.o
Error: ** BUILD FAILED **
The following build commands failed:
CompileC build/B4iProject.build/Release-iphoneos/B4iProject.build/Objects-normal/armv7/b4i_contenidomodule.o B4iProject/b4i_contenidomodule.m normal armv7 objective-c com.apple.compilers.llvm.clang.1_0.compiler
CompileC build/B4iProject.build/Release-iphoneos/B4iProject.build/Objects-normal/armv7/b4i_imagedownloader.o B4iProject/b4i_imagedownloader.m normal armv7 objective-c com.apple.compilers.llvm.clang.1_0.compiler
(2 failures)
B4X founder
Staff member
Licensed User
Longtime User
Did you create a sub named Globals? Try to rename it.
Active Member
Licensed User
It is a module class named Globals, but it is weird, I have other app with the same name module, yesterday I tested with that app and I builded without issues, that app has the same module.
I changed the module name to "GlobalsModule" and I got the same:
B4i Version: 4.40 BETA #1
Parsing code. (0.05s)
Compiling code. (0.21s)
Compiling layouts code. (0.02s)
Building Xcode project (0.38s)
Sending data to remote compiler. Error
Out: Build settings from command line:
ARCHS = armv7 arm64
CODE_SIGN_IDENTITY = iPhone
CONFIGURATION_BUILD_DIR = /Users/administrator/Documents/UploadedProjects/<user id>/Payload
OTHER_CODE_SIGN_FLAGS = --keychain <user id>
PRODUCT_NAME = De Prati
PROVISIONING_PROFILE = 23d0bb49-42d4-4037-ad6d-545eed5cf6c8
=== BUILD TARGET B4iProject OF PROJECT B4iProject WITH CONFIGURATION Release ===
Check dependencies
Write auxiliary files
write-file /Users/administrator/Documents/UploadedProjects/<user id>/build/B4iProject.build/Release-iphoneos/B4iProject.build/De\ Prati.hmap
/bin/mkdir -p /Users/administrator/Documents/UploadedProjects/<user id>/build/B4iProject.build/Release-iphoneos/B4iProject.build/Objects-normal/arm64
write-file /Users/administrator/Documents/UploadedProjects/<user id>/build/B4iProject.build/Release-iphoneos/B4iProject.build/Objects-normal/arm64/De\ Prati.LinkFileList
write-file /Users/administrator/Documents/UploadedProjects/<user id>/build/B4iProject.build/Release-iphoneos/B4iProject.build/De\ Prati-all-target-headers.hmap
write-file /Users/administrator/Documents/UploadedProjects/<user id>/build/B4iProject.build/Release-iphoneos/B4iProject.build/De\ Prati-generated-files.hmap
write-file /Users/administrator/Documents/UploadedProjects/<user id>/build/B4iProject.build/Release-iphoneos/B4iProject.build/De\ Prati-project-headers.hmap
write-file /Users/administrator/Documents/UploadedProjects/<user id>/build/B4iProject.build/Release-iphoneos/B4iProject.build/De\ Prati-own-target-headers.hmap
/bin/mkdir -p /Users/administrator/Documents/UploadedProjects/<user id>/build/B4iProject.build/Release-iphoneos/B4iProject.build/Objects-normal/armv7
write-file /Users/administrator/Documents/UploadedProjects/<user id>/build/B4iProject.build/Release-iphoneos/B4iProject.build/Objects-normal/armv7/De\ Prati.LinkFileList
write-file /Users/administrator/Documents/UploadedProjects/<user id>/build/B4iProject.build/Release-iphoneos/B4iProject.build/De\ Prati-all-non-framework-target-headers.hmap
Create product structure
/bin/mkdir -p /Users/administrator/Documents/UploadedProjects/<user id>/Payload/De\ Prati.app
CompileC build/B4iProject.build/Release-iphoneos/B4iProject.build/Objects-normal/armv7/main.o B4iProject/main.m normal armv7 objective-c com.apple.compilers.llvm.clang.1_0.compiler
cd /Users/administrator/Documents/UploadedProjects/<user id>
export LANG=en_US.US-ASCII
export PATH="/Applications/Xcode.app/Contents/Developer/Platforms/iPhoneOS.platform/Developer/usr/bin:/Applications/Xcode.app/Contents/Developer/usr/bin:/usr/local/bin:/usr/bin:/bin:/usr/sbin:/sbin"
/Applications/Xcode.app/Contents/Developer/Toolchains/XcodeDefault.xctoolchain/usr/bin/clang -x objective-c -arch armv7 -fmessage-length=0 -fdiagnostics-show-note-include-stack -fmacro-backtrace-limit=0 -std=gnu99 -fobjc-arc -fmodules -gmodules -fmodules-prune-interval=86400 -fmodules-prune-after=345600 -fbuild-session-file=/var/folders/35/nx43fs8567l9z_wvvpc35snh0000gn/C/org.llvm.clang/ModuleCache/Session.modulevalidation -fmodules-validate-once-per-build-session -Wnon-modular-include-in-framework-module -Werror=non-modular-include-in-framework-module -Wno-trigraphs -fpascal-strings -O0 -Wno-missing-field-initializers -Wno-missing-prototypes -Werror=return-type -Wno-implicit-atomic-properties -Werror=deprecated-objc-isa-usage -Werror=objc-root-class -Wno-arc-repeated-use-of-weak -Wduplicate-method-match -Wno-missing-braces -Wparentheses -Wswitch -Wunused-function -Wno-unused-label -Wno-unused-parameter -Wunused-variable -Wunused-value -Wempty-body -Wconditional-uninitialized -Wno-unknown-pragmas -Wno-shadow -Wno-four-char-constants -Wno-conversion -Wconstant-conversion -Wint-conversion -Wbool-conversion -Wenum-conversion -Wshorten-64-to-32 -Wpointer-sign -Wno-newline-eof -Wno-selector -Wno-strict-selector-match -Wundeclared-selector -Wno-deprecated-implementations -DNS_BLOCK_ASSERTIONS=1 -isysroot /Applications/Xcode.app/Contents/Developer/Platforms/iPhoneOS.platform/Developer/SDKs/iPhoneOS10.1.sdk -fstrict-aliasing -Wprotocol -Wdeprecated-declarations -miphoneos-version-min=8.0 -g -fvisibility=hidden -Wno-sign-conversion -Wno-infinite-recursion -iquote /Users/administrator/Documents/UploadedProjects/<user id>/build/B4iProject.build/Release-iphoneos/B4iProject.build/De\ Prati-generated-files.hmap -I/Users/administrator/Documents/UploadedProjects/<user id>/build/B4iProject.build/Release-iphoneos/B4iProject.build/De\ Prati-own-target-headers.hmap -I/Users/administrator/Documents/UploadedProjects/<user id>/build/B4iProject.build/Release-iphoneos/B4iProject.build/De\ Prati-all-target-headers.hmap -iquote /Users/administrator/Documents/UploadedProjects/<user id>/build/B4iProject.build/Release-iphoneos/B4iProject.build/De\ Prati-project-headers.hmap -I/Users/administrator/Documents/UploadedProjects/<user id>/Payload/include -I/Users/administrator/Documents/UploadedProjects/<user id>/build/B4iProject.build/Release-iphoneos/B4iProject.build/DerivedSources/armv7 -I/Users/administrator/Documents/UploadedProjects/<user id>/build/B4iProject.build/Release-iphoneos/B4iProject.build/DerivedSources -F/Users/administrator/Documents/UploadedProjects/<user id>/Payload -F../../Libs -MMD -MT dependencies -MF /Users/administrator/Documents/UploadedProjects/<user id>/build/B4iProject.build/Release-iphoneos/B4iProject.build/Objects-normal/armv7/main.d --serialize-diagnostics /Users/administrator/Documents/UploadedProjects/<user id>/build/B4iProject.build/Release-iphoneos/B4iProject.build/Objects-normal/armv7/main.dia -c /Users/administrator/Documents/UploadedProjects/<user id>/B4iProject/main.m -o /Users/administrator/Documents/UploadedProjects/<user id>/build/B4iProject.build/Release-iphoneos/B4iProject.build/Objects-normal/armv7/main.o
CompileC build/B4iProject.build/Release-iphoneos/B4iProject.build/Objects-normal/armv7/b4i_globalsmodule.o B4iProject/b4i_globalsmodule.m normal armv7 objective-c com.apple.compilers.llvm.clang.1_0.compiler
cd /Users/administrator/Documents/UploadedProjects/<user id>
export LANG=en_US.US-ASCII
export PATH="/Applications/Xcode.app/Contents/Developer/Platforms/iPhoneOS.platform/Developer/usr/bin:/Applications/Xcode.app/Contents/Developer/usr/bin:/usr/local/bin:/usr/bin:/bin:/usr/sbin:/sbin"
/Applications/Xcode.app/Contents/Developer/Toolchains/XcodeDefault.xctoolchain/usr/bin/clang -x objective-c -arch armv7 -fmessage-length=0 -fdiagnostics-show-note-include-stack -fmacro-backtrace-limit=0 -std=gnu99 -fobjc-arc -fmodules -gmodules -fmodules-prune-interval=86400 -fmodules-prune-after=345600 -fbuild-session-file=/var/folders/35/nx43fs8567l9z_wvvpc35snh0000gn/C/org.llvm.clang/ModuleCache/Session.modulevalidation -fmodules-validate-once-per-build-session -Wnon-modular-include-in-framework-module -Werror=non-modular-include-in-framework-module -Wno-trigraphs -fpascal-strings -O0 -Wno-missing-field-initializers -Wno-missing-prototypes -Werror=return-type -Wno-implicit-atomic-properties -Werror=deprecated-objc-isa-usage -Werror=objc-root-class -Wno-arc-repeated-use-of-weak -Wduplicate-method-match -Wno-missing-braces -Wparentheses -Wswitch -Wunused-function -Wno-unused-label -Wno-unused-parameter -Wunused-variable -Wunused-value -Wempty-body -Wconditional-uninitialized -Wno-unknown-pragmas -Wno-shadow -Wno-four-char-constants -Wno-conversion -Wconstant-conversion -Wint-conversion -Wbool-conversion -Wenum-conversion -Wshorten-64-to-32 -Wpointer-sign -Wno-newline-eof -Wno-selector -Wno-strict-selector-match -Wundeclared-selector -Wno-deprecated-implementations -DNS_BLOCK_ASSERTIONS=1 -isysroot /Applications/Xcode.app/Contents/Developer/Platforms/iPhoneOS.platform/Developer/SDKs/iPhoneOS10.1.sdk -fstrict-aliasing -Wprotocol -Wdeprecated-declarations -miphoneos-version-min=8.0 -g -fvisibility=hidden -Wno-sign-conversion -Wno-infinite-recursion -iquote /Users/administrator/Documents/UploadedProjects/<user id>/build/B4iProject.build/Release-iphoneos/B4iProject.build/De\ Prati-generated-files.hmap -I/Users/administrator/Documents/UploadedProjects/<user id>/build/B4iProject.build/Release-iphoneos/B4iProject.build/De\ Prati-own-target-headers.hmap -I/Users/administrator/Documents/UploadedProjects/<user id>/build/B4iProject.build/Release-iphoneos/B4iProject.build/De\ Prati-all-target-headers.hmap -iquote /Users/administrator/Documents/UploadedProjects/<user id>/build/B4iProject.build/Release-iphoneos/B4iProject.build/De\ Prati-project-headers.hmap -I/Users/administrator/Documents/UploadedProjects/<user id>/Payload/include -I/Users/administrator/Documents/UploadedProjects/<user id>/build/B4iProject.build/Release-iphoneos/B4iProject.build/DerivedSources/armv7 -I/Users/administrator/Documents/UploadedProjects/<user id>/build/B4iProject.build/Release-iphoneos/B4iProject.build/DerivedSources -F/Users/administrator/Documents/UploadedProjects/<user id>/Payload -F../../Libs -MMD -MT dependencies -MF /Users/administrator/Documents/UploadedProjects/<user id>/build/B4iProject.build/Release-iphoneos/B4iProject.build/Objects-normal/armv7/b4i_globalsmodule.d --serialize-diagnostics /Users/administrator/Documents/UploadedProjects/<user id>/build/B4iProject.build/Release-iphoneos/B4iProject.build/Objects-normal/armv7/b4i_globalsmodule.dia -c /Users/administrator/Documents/UploadedProjects/<user id>/B4iProject/b4i_globalsmodule.m -o /Users/administrator/Documents/UploadedProjects/<user id>/build/B4iProject.build/Release-iphoneos/B4iProject.build/Objects-normal/armv7/b4i_globalsmodule.o
In file included from /Users/administrator/Documents/UploadedProjects/<user id>/B4iProject/b4i_globalsmodule.m:3:
/Users/administrator/Documents/UploadedProjects/<user id>/B4iProject/b4i_main.h:45:41: error: type of property '_globalsmodule' ('b4i_globalsmodule *') does not match type of accessor '_globalsmodule' ('void')
@property (nonatomic)b4i_globalsmodule* _globalsmodule;
^
/Users/administrator/Documents/UploadedProjects/<user id>/B4iProject/b4i_main.h:29:1: note: declared here
- (void) _globalsmodule;
^
In file included from /Users/administrator/Documents/UploadedProjects/<user id>/B4iProject/b4i_globalsmodule.m:4:
/Users/administrator/Documents/UploadedProjects/<user id>/B4iProject/b4i_startmodule.h:86:41: error: type of property '_globalsmodule' ('b4i_globalsmodule *') does not match type of accessor '_globalsmodule' ('void')
@property (nonatomic)b4i_globalsmodule* _globalsmodule;
^
/Users/administrator/Documents/UploadedProjects/<user id>/B4iProject/b4i_startmodule.h:32:1: note: declared here
- (void) _globalsmodule;
^
CompileC build/B4iProject.build/Release-iphoneos/B4iProject.build/Objects-normal/armv7/b4i_imagedownloader.o B4iProject/b4i_imagedownloader.m normal armv7 objective-c com.apple.compilers.llvm.clang.1_0.compiler
cd /Users/administrator/Documents/UploadedProjects/<user id>
export LANG=en_US.US-ASCII
export PATH="/Applications/Xcode.app/Contents/Developer/Platforms/iPhoneOS.platform/Developer/usr/bin:/Applications/Xcode.app/Contents/Developer/usr/bin:/usr/local/bin:/usr/bin:/bin:/usr/sbin:/sbin"
/Applications/Xcode.app/Contents/Developer/Toolchains/XcodeDefault.xctoolchain/usr/bin/clang -x objective-c -arch armv7 -fmessage-length=0 -fdiagnostics-show-note-include-stack -fmacro-backtrace-limit=0 -std=gnu99 -fobjc-arc -fmodules -gmodules -fmodules-prune-interval=86400 -fmodules-prune-after=345600 -fbuild-session-file=/var/folders/35/nx43fs8567l9z_wvvpc35snh0000gn/C/org.llvm.clang/ModuleCache/Session.modulevalidation -fmodules-validate-once-per-build-session -Wnon-modular-include-in-framework-module -Werror=non-modular-include-in-framework-module -Wno-trigraphs -fpascal-strings -O0 -Wno-missing-field-initializers -Wno-missing-prototypes -Werror=return-type -Wno-implicit-atomic-properties -Werror=deprecated-objc-isa-usage -Werror=objc-root-class -Wno-arc-repeated-use-of-weak -Wduplicate-method-match -Wno-missing-braces -Wparentheses -Wswitch -Wunused-function -Wno-unused-label -Wno-unused-parameter -Wunused-variable -Wunused-value -Wempty-body -Wconditional-uninitialized -Wno-unknown-pragmas -Wno-shadow -Wno-four-char-constants -Wno-conversion -Wconstant-conversion -Wint-conversion -Wbool-conversion -Wenum-conversion -Wshorten-64-to-32 -Wpointer-sign -Wno-newline-eof -Wno-selector -Wno-strict-selector-match -Wundeclared-selector -Wno-deprecated-implementations -DNS_BLOCK_ASSERTIONS=1 -isysroot /Applications/Xcode.app/Contents/Developer/Platforms/iPhoneOS.platform/Developer/SDKs/iPhoneOS10.1.sdk -fstrict-aliasing -Wprotocol -Wdeprecated-declarations -miphoneos-version-min=8.0 -g -fvisibility=hidden -Wno-sign-conversion -Wno-infinite-recursion -iquote /Users/administrator/Documents/UploadedProjects/<user id>/build/B4iProject.build/Release-iphoneos/B4iProject.build/De\ Prati-generated-files.hmap -I/Users/administrator/Documents/UploadedProjects/<user id>/build/B4iProject.build/Release-iphoneos/B4iProject.build/De\ Prati-own-target-headers.hmap -I/Users/administrator/Documents/UploadedProjects/<user id>/build/B4iProject.build/Release-iphoneos/B4iProject.build/De\ Prati-all-target-headers.hmap -iquote /Users/administrator/Documents/UploadedProjects/<user id>/build/B4iProject.build/Release-iphoneos/B4iProject.build/De\ Prati-project-headers.hmap -I/Users/administrator/Documents/UploadedProjects/<user id>/Payload/include -I/Users/administrator/Documents/UploadedProjects/<user id>/build/B4iProject.build/Release-iphoneos/B4iProject.build/DerivedSources/armv7 -I/Users/administrator/Documents/UploadedProjects/<user id>/build/B4iProject.build/Release-iphoneos/B4iProject.build/DerivedSources -F/Users/administrator/Documents/UploadedProjects/<user id>/Payload -F../../Libs -MMD -MT dependencies -MF /Users/administrator/Documents/UploadedProjects/<user id>/build/B4iProject.build/Release-iphoneos/B4iProject.build/Objects-normal/armv7/b4i_imagedownloader.d --serialize-diagnostics /Users/administrator/Documents/UploadedProjects/<user id>/build/B4iProject.build/Release-iphoneos/B4iProject.build/Objects-normal/armv7/b4i_imagedownloader.dia -c /Users/administrator/Documents/UploadedProjects/<user id>/B4iProject/b4i_imagedownloader.m -o /Users/administrator/Documents/UploadedProjects/<user id>/build/B4iProject.build/Release-iphoneos/B4iProject.build/Objects-normal/armv7/b4i_imagedownloader.o
In file included from /Users/administrator/Documents/UploadedProjects/<user id>/B4iProject/b4i_imagedownloader.m:3:
/Users/administrator/Documents/UploadedProjects/<user id>/B4iProject/b4i_main.h:45:41: error: type of property '_globalsmodule' ('b4i_globalsmodule *') does not match type of accessor '_globalsmodule' ('void')
@property (nonatomic)b4i_globalsmodule* _globalsmodule;
^
/Users/administrator/Documents/UploadedProjects/<user id>/B4iProject/b4i_main.h:29:1: note: declared here
- (void) _globalsmodule;
^
In file included from /Users/administrator/Documents/UploadedProjects/<user id>/B4iProject/b4i_imagedownloader.m:4:
/Users/administrator/Documents/UploadedProjects/<user id>/B4iProject/b4i_startmodule.h:86:41: error: type of property '_globalsmodule' ('b4i_globalsmodule *') does not match type of accessor '_globalsmodule' ('void')
@property (nonatomic)b4i_globalsmodule* _globalsmodule;
^
/Users/administrator/Documents/UploadedProjects/<user id>/B4iProject/b4i_startmodule.h:32:1: note: declared here
- (void) _globalsmodule;
^
2 errors generated.
CompileC build/B4iProject.build/Release-iphoneos/B4iProject.build/Objects-normal/armv7/b4i_contenidomodule.o B4iProject/b4i_contenidomodule.m normal armv7 objective-c com.apple.compilers.llvm.clang.1_0.compiler
cd /Users/administrator/Documents/UploadedProjects/<user id>
export LANG=en_US.US-ASCII
export PATH="/Applications/Xcode.app/Contents/Developer/Platforms/iPhoneOS.platform/Developer/usr/bin:/Applications/Xcode.app/Contents/Developer/usr/bin:/usr/local/bin:/usr/bin:/bin:/usr/sbin:/sbin"
/Applications/Xcode.app/Contents/Developer/Toolchains/XcodeDefault.xctoolchain/usr/bin/clang -x objective-c -arch armv7 -fmessage-length=0 -fdiagnostics-show-note-include-stack -fmacro-backtrace-limit=0 -std=gnu99 -fobjc-arc -fmodules -gmodules -fmodules-prune-interval=86400 -fmodules-prune-after=345600 -fbuild-session-file=/var/folders/35/nx43fs8567l9z_wvvpc35snh0000gn/C/org.llvm.clang/ModuleCache/Session.modulevalidation -fmodules-validate-once-per-build-session -Wnon-modular-include-in-framework-module -Werror=non-modular-include-in-framework-module -Wno-trigraphs -fpascal-strings -O0 -Wno-missing-field-initializers -Wno-missing-prototypes -Werror=return-type -Wno-implicit-atomic-properties -Werror=deprecated-objc-isa-usage -Werror=objc-root-class -Wno-arc-repeated-use-of-weak -Wduplicate-method-match -Wno-missing-braces -Wparentheses -Wswitch -Wunused-function -Wno-unused-label -Wno-unused-parameter -Wunused-variable -Wunused-value -Wempty-body -Wconditional-uninitialized -Wno-unknown-pragmas -Wno-shadow -Wno-four-char-constants -Wno-conversion -Wconstant-conversion -Wint-conversion -Wbool-conversion -Wenum-conversion -Wshorten-64-to-32 -Wpointer-sign -Wno-newline-eof -Wno-selector -Wno-strict-selector-match -Wundeclared-selector -Wno-deprecated-implementations -DNS_BLOCK_ASSERTIONS=1 -isysroot /Applications/Xcode.app/Contents/Developer/Platforms/iPhoneOS.platform/Developer/SDKs/iPhoneOS10.1.sdk -fstrict-aliasing -Wprotocol -Wdeprecated-declarations -miphoneos-version-min=8.0 -g -fvisibility=hidden -Wno-sign-conversion -Wno-infinite-recursion -iquote /Users/administrator/Documents/UploadedProjects/<user id>/build/B4iProject.build/Release-iphoneos/B4iProject.build/De\ Prati-generated-files.hmap -I/Users/administrator/Documents/UploadedProjects/<user id>/build/B4iProject.build/Release-iphoneos/B4iProject.build/De\ Prati-own-target-headers.hmap -I/Users/administrator/Documents/UploadedProjects/<user id>/build/B4iProject.build/Release-iphoneos/B4iProject.build/De\ Prati-all-target-headers.hmap -iquote /Users/administrator/Documents/UploadedProjects/<user id>/build/B4iProject.build/Release-iphoneos/B4iProject.build/De\ Prati-project-headers.hmap -I/Users/administrator/Documents/UploadedProjects/<user id>/Payload/include -I/Users/administrator/Documents/UploadedProjects/<user id>/build/B4iProject.build/Release-iphoneos/B4iProject.build/DerivedSources/armv7 -I/Users/administrator/Documents/UploadedProjects/<user id>/build/B4iProject.build/Release-iphoneos/B4iProject.build/DerivedSources -F/Users/administrator/Documents/UploadedProjects/<user id>/Payload -F../../Libs -MMD -MT dependencies -MF /Users/administrator/Documents/UploadedProjects/<user id>/build/B4iProject.build/Release-iphoneos/B4iProject.build/Objects-normal/armv7/b4i_contenidomodule.d --serialize-diagnostics /Users/administrator/Documents/UploadedProjects/<user id>/build/B4iProject.build/Release-iphoneos/B4iProject.build/Objects-normal/armv7/b4i_contenidomodule.dia -c /Users/administrator/Documents/UploadedProjects/<user id>/B4iProject/b4i_contenidomodule.m -o /Users/administrator/Documents/UploadedProjects/<user id>/build/B4iProject.build/Release-iphoneos/B4iProject.build/Objects-normal/armv7/b4i_contenidomodule.o
In file included from /Users/administrator/Documents/UploadedProjects/<user id>/B4iProject/b4i_contenidomodule.m:3:
/Users/administrator/Documents/UploadedProjects/<user id>/B4iProject/b4i_main.h:45:41: error: type of property '_globalsmodule' ('b4i_globalsmodule *') does not match type of accessor '_globalsmodule' ('void')
@property (nonatomic)b4i_globalsmodule* _globalsmodule;
^
/Users/administrator/Documents/UploadedProjects/<user id>/B4iProject/b4i_main.h:29:1: note: declared here
- (void) _globalsmodule;
^
In file included from /Users/administrator/Documents/UploadedProjects/<user id>/B4iProject/b4i_contenidomodule.m:4:
/Users/administrator/Documents/UploadedProjects/<user id>/B4iProject/b4i_startmodule.h:86:41: error: type of property '_globalsmodule' ('b4i_globalsmodule *') does not match type of accessor '_globalsmodule' ('void')
@property (nonatomic)b4i_globalsmodule* _globalsmodule;
^
/Users/administrator/Documents/UploadedProjects/<user id>/B4iProject/b4i_startmodule.h:32:1: note: declared here
- (void) _globalsmodule;
^
2 errors generated.
CompileC build/B4iProject.build/Release-iphoneos/B4iProject.build/Objects-normal/armv7/b4i_listadomodule.o B4iProject/b4i_listadomodule.m normal armv7 objective-c com.apple.compilers.llvm.clang.1_0.compiler
cd /Users/administrator/Documents/UploadedProjects/<user id>
export LANG=en_US.US-ASCII
export PATH="/Applications/Xcode.app/Contents/Developer/Platforms/iPhoneOS.platform/Developer/usr/bin:/Applications/Xcode.app/Contents/Developer/usr/bin:/usr/local/bin:/usr/bin:/bin:/usr/sbin:/sbin"
/Applications/Xcode.app/Contents/Developer/Toolchains/XcodeDefault.xctoolchain/usr/bin/clang -x objective-c -arch armv7 -fmessage-length=0 -fdiagnostics-show-note-include-stack -fmacro-backtrace-limit=0 -std=gnu99 -fobjc-arc -fmodules -gmodules -fmodules-prune-interval=86400 -fmodules-prune-after=345600 -fbuild-session-file=/var/folders/35/nx43fs8567l9z_wvvpc35snh0000gn/C/org.llvm.clang/ModuleCache/Session.modulevalidation -fmodules-validate-once-per-build-session -Wnon-modular-include-in-framework-module -Werror=non-modular-include-in-framework-module -Wno-trigraphs -fpascal-strings -O0 -Wno-missing-field-initializers -Wno-missing-prototypes -Werror=return-type -Wno-implicit-atomic-properties -Werror=deprecated-objc-isa-usage -Werror=objc-root-class -Wno-arc-repeated-use-of-weak -Wduplicate-method-match -Wno-missing-braces -Wparentheses -Wswitch -Wunused-function -Wno-unused-label -Wno-unused-parameter -Wunused-variable -Wunused-value -Wempty-body -Wconditional-uninitialized -Wno-unknown-pragmas -Wno-shadow -Wno-four-char-constants -Wno-conversion -Wconstant-conversion -Wint-conversion -Wbool-conversion -Wenum-conversion -Wshorten-64-to-32 -Wpointer-sign -Wno-newline-eof -Wno-selector -Wno-strict-selector-match -Wundeclared-selector -Wno-deprecated-implementations -DNS_BLOCK_ASSERTIONS=1 -isysroot /Applications/Xcode.app/Contents/Developer/Platforms/iPhoneOS.platform/Developer/SDKs/iPhoneOS10.1.sdk -fstrict-aliasing -Wprotocol -Wdeprecated-declarations -miphoneos-version-min=8.0 -g -fvisibility=hidden -Wno-sign-conversion -Wno-infinite-recursion -iquote /Users/administrator/Documents/UploadedProjects/<user id>/build/B4iProject.build/Release-iphoneos/B4iProject.build/De\ Prati-generated-files.hmap -I/Users/administrator/Documents/UploadedProjects/<user id>/build/B4iProject.build/Release-iphoneos/B4iProject.build/De\ Prati-own-target-headers.hmap -I/Users/administrator/Documents/UploadedProjects/<user id>/build/B4iProject.build/Release-iphoneos/B4iProject.build/De\ Prati-all-target-headers.hmap -iquote /Users/administrator/Documents/UploadedProjects/<user id>/build/B4iProject.build/Release-iphoneos/B4iProject.build/De\ Prati-project-headers.hmap -I/Users/administrator/Documents/UploadedProjects/<user id>/Payload/include -I/Users/administrator/Documents/UploadedProjects/<user id>/build/B4iProject.build/Release-iphoneos/B4iProject.build/DerivedSources/armv7 -I/Users/administrator/Documents/UploadedProjects/<user id>/build/B4iProject.build/Release-iphoneos/B4iProject.build/DerivedSources -F/Users/administrator/Documents/UploadedProjects/<user id>/Payload -F../../Libs -MMD -MT dependencies -MF /Users/administrator/Documents/UploadedProjects/<user id>/build/B4iProject.build/Release-iphoneos/B4iProject.build/Objects-normal/armv7/b4i_listadomodule.d --serialize-diagnostics /Users/administrator/Documents/UploadedProjects/<user id>/build/B4iProject.build/Release-iphoneos/B4iProject.build/Objects-normal/armv7/b4i_listadomodule.dia -c /Users/administrator/Documents/UploadedProjects/<user id>/B4iProject/b4i_listadomodule.m -o /Users/administrator/Documents/UploadedProjects/<user id>/build/B4iProject.build/Release-iphoneos/B4iProject.build/Objects-normal/armv7/b4i_listadomodule.o
Error: ** BUILD FAILED **
The following build commands failed:
CompileC build/B4iProject.build/Release-iphoneos/B4iProject.build/Objects-normal/armv7/b4i_contenidomodule.o B4iProject/b4i_contenidomodule.m normal armv7 objective-c com.apple.compilers.llvm.clang.1_0.compiler
(1 failure)
When I compile to Debug I don't have issues
I updated this app on Nov 27th almost with the same code and hosted builder and it worked with issues.
Maybe you can delete directory in hosted builder ?
Thanks
Active Member
Licensed User
I found the issue, I removed HTTP job and WaitFor from Application Remote Notification and I putted it in a Module.
Thanks