iOS Tutorial GoogleMaps Tutorial

Status
Not open for further replies.

valentino s

Active Member
Licensed User
Was my problem too. Thanks a lot, I'd highlight this step ! Just to help, here the page from which you can enable API:

2015-12-01_081902.jpg
 
Last edited:

Dany Rocha

New Member
Licensed User
I'm using Mac builder hosted service to compile the code, but is giving an error: www.basic4ppc.com/b4i/files/GoogleMaps.zip

-------------------------------------


Undefined symbols for architecture armv7:
"_vImageBoxConvolve_Planar8", referenced from:
(anonymous namespace)::CreateBlurredImage(CGImage*, float, float) in GoogleMaps
ld: symbol(s) not found for architecture armv7
clang: error: linker command failed with exit code 1 (use -v to see invocation)


Error: ** BUILD FAILED **


The following build commands failed:
Ld Payload/B4i\ Example.app/B4i\ Example normal armv7
(1 failure)
 
Last edited by a moderator:

Dany Rocha

New Member
Licensed User
Problem solved.
Yes it was a mistake on my part. I put the name of the app example instead of the name of m'y app. I put com.ciginfo.exemple instead com.ciginfo.kindabreak associated to my google apikey. Desolated.

Can you explain to me more detailed as it did for Google Maps work
 

nicieri

Active Member
Licensed User
On my mac:

CPro:~ c$ sudo gem install cocoapods
Password:
Successfully installed cocoapods-0.39.0
Parsing documentation for cocoapods-0.39.0
1 gem installed


I have the last version of Bundle.. and Framework in Libs path.

What is the mistake?



B4i version: 2.31
Parsing code. (0.00s)
Compiling code. (1.21s)
Compiling layouts code. (0.00s)
Compiling debugger engine code. (1.15s)
Building Xcode project (1.24s)
Sending data to remote compiler. Error
Out: Build settings from command line:
ARCHS = i386
CODE_SIGNING_REQUIRED = NO
CONFIGURATION_BUILD_DIR = /Users/cieri/Downloads/macserver/UploadedProjects/<user id>/Payload
PRODUCT_NAME = B4i Example
SDKROOT = iphonesimulator9.2

=== BUILD TARGET B4iProject OF PROJECT B4iProject WITH CONFIGURATION Release ===

Check dependencies

Create product structure
/bin/mkdir -p /Users/cieri/Downloads/macserver/UploadedProjects/<user id>/Payload/B4i\ Example.app

ProcessInfoPlistFile Payload/B4i\ Example.app/Info.plist B4iProject/B4iProject-Info.plist
cd /Users/cieri/Downloads/macserver/UploadedProjects/<user id>
export PATH="/Applications/Xcode.app/Contents/Developer/Platforms/iPhoneSimulator.platform/Developer/usr/bin:/Applications/Xcode.app/Contents/Developer/usr/bin:/usr/local/bin:/usr/bin:/bin:/usr/sbin:/sbin"
builtin-infoPlistUtility /Users/cieri/Downloads/macserver/UploadedProjects/<user id>/B4iProject/B4iProject-Info.plist -genpkginfo /Users/cieri/Downloads/macserver/UploadedProjects/<user id>/Payload/B4i\ Example.app/PkgInfo -expandbuildsettings -format binary -platform iphonesimulator -o /Users/cieri/Downloads/macserver/UploadedProjects/<user id>/Payload/B4i\ Example.app/Info.plist

CompileC build/B4iProject.build/Release-iphonesimulator/B4iProject.build/Objects-normal/i386/main.o B4iProject/main.m normal i386 objective-c com.apple.compilers.llvm.clang.1_0.compiler
cd /Users/cieri/Downloads/macserver/UploadedProjects/<user id>
export LANG=en_US.US-ASCII
export PATH="/Applications/Xcode.app/Contents/Developer/Platforms/iPhoneSimulator.platform/Developer/usr/bin:/Applications/Xcode.app/Contents/Developer/usr/bin:/usr/local/bin:/usr/bin:/bin:/usr/sbin:/sbin"
/Applications/Xcode.app/Contents/Developer/Toolchains/XcodeDefault.xctoolchain/usr/bin/clang -x objective-c -arch i386 -fmessage-length=0 -fdiagnostics-show-note-include-stack -fmacro-backtrace-limit=0 -std=gnu99 -fobjc-arc -fmodules -gmodules -fmodules-prune-interval=86400 -fmodules-prune-after=345600 -fbuild-session-file=/var/folders/gw/2x1bwmkx0d596f8rrqwyqhs40000gn/C/org.llvm.clang/ModuleCache/Session.modulevalidation -fmodules-validate-once-per-build-session -Wnon-modular-include-in-framework-module -Werror=non-modular-include-in-framework-module -Wno-trigraphs -fpascal-strings -O0 -Wno-missing-field-initializers -Wno-missing-prototypes -Werror=return-type -Wno-implicit-atomic-properties -Werror=deprecated-objc-isa-usage -Werror=objc-root-class -Wno-arc-repeated-use-of-weak -Wduplicate-method-match -Wno-missing-braces -Wparentheses -Wswitch -Wunused-function -Wno-unused-label -Wno-unused-parameter -Wunused-variable -Wunused-value -Wempty-body -Wconditional-uninitialized -Wno-unknown-pragmas -Wno-shadow -Wno-four-char-constants -Wno-conversion -Wconstant-conversion -Wint-conversion -Wbool-conversion -Wenum-conversion -Wshorten-64-to-32 -Wpointer-sign -Wno-newline-eof -Wno-selector -Wno-strict-selector-match -Wundeclared-selector -Wno-deprecated-implementations -DNS_BLOCK_ASSERTIONS=1 -isysroot /Applications/Xcode.app/Contents/Developer/Platforms/iPhoneSimulator.platform/Developer/SDKs/iPhoneSimulator9.2.sdk -fasm-blocks -fstrict-aliasing -Wprotocol -Wdeprecated-declarations -mios-simulator-version-min=7.0 -fvisibility=hidden -Wno-sign-conversion -fobjc-abi-version=2 -fobjc-legacy-dispatch -iquote /Users/cieri/Downloads/macserver/UploadedProjects/<user id>/build/B4iProject.build/Release-iphonesimulator/B4iProject.build/B4i\ Example-generated-files.hmap -I/Users/cieri/Downloads/macserver/UploadedProjects/<user id>/build/B4iProject.build/Release-iphonesimulator/B4iProject.build/B4i\ Example-own-target-headers.hmap -I/Users/cieri/Downloads/macserver/UploadedProjects/<user id>/build/B4iProject.build/Release-iphonesimulator/B4iProject.build/B4i\ Example-all-target-headers.hmap -iquote /Users/cieri/Downloads/macserver/UploadedProjects/<user id>/build/B4iProject.build/Release-iphonesimulator/B4iProject.build/B4i\ Example-project-headers.hmap -I/Users/cieri/Downloads/macserver/UploadedProjects/<user id>/Payload/include -I/Users/cieri/Downloads/macserver/UploadedProjects/<user id>/build/B4iProject.build/Release-iphonesimulator/B4iProject.build/DerivedSources/i386 -I/Users/cieri/Downloads/macserver/UploadedProjects/<user id>/build/B4iProject.build/Release-iphonesimulator/B4iProject.build/DerivedSources -F/Users/cieri/Downloads/macserver/UploadedProjects/<user id>/Payload -F../../Libs -MMD -MT dependencies -MF /Users/cieri/Downloads/macserver/UploadedProjects/<user id>/build/B4iProject.build/Release-iphonesimulator/B4iProject.build/Objects-normal/i386/main.d --serialize-diagnostics /Users/cieri/Downloads/macserver/UploadedProjects/<user id>/build/B4iProject.build/Release-iphonesimulator/B4iProject.build/Objects-normal/i386/main.dia -c /Users/cieri/Downloads/macserver/UploadedProjects/<user id>/B4iProject/main.m -o /Users/cieri/Downloads/macserver/UploadedProjects/<user id>/build/B4iProject.build/Release-iphonesimulator/B4iProject.build/Objects-normal/i386/main.o

CompileC build/B4iProject.build/Release-iphonesimulator/B4iProject.build/Objects-normal/i386/b4i_googlemapsextra.o B4iProject/b4i_googlemapsextra.m normal i386 objective-c com.apple.compilers.llvm.clang.1_0.compiler
cd /Users/cieri/Downloads/macserver/UploadedProjects/<user id>
export LANG=en_US.US-ASCII
export PATH="/Applications/Xcode.app/Contents/Developer/Platforms/iPhoneSimulator.platform/Developer/usr/bin:/Applications/Xcode.app/Contents/Developer/usr/bin:/usr/local/bin:/usr/bin:/bin:/usr/sbin:/sbin"
/Applications/Xcode.app/Contents/Developer/Toolchains/XcodeDefault.xctoolchain/usr/bin/clang -x objective-c -arch i386 -fmessage-length=0 -fdiagnostics-show-note-include-stack -fmacro-backtrace-limit=0 -std=gnu99 -fobjc-arc -fmodules -gmodules -fmodules-prune-interval=86400 -fmodules-prune-after=345600 -fbuild-session-file=/var/folders/gw/2x1bwmkx0d596f8rrqwyqhs40000gn/C/org.llvm.clang/ModuleCache/Session.modulevalidation -fmodules-validate-once-per-build-session -Wnon-modular-include-in-framework-module -Werror=non-modular-include-in-framework-module -Wno-trigraphs -fpascal-strings -O0 -Wno-missing-field-initializers -Wno-missing-prototypes -Werror=return-type -Wno-implicit-atomic-properties -Werror=deprecated-objc-isa-usage -Werror=objc-root-class -Wno-arc-repeated-use-of-weak -Wduplicate-method-match -Wno-missing-braces -Wparentheses -Wswitch -Wunused-function -Wno-unused-label -Wno-unused-parameter -Wunused-variable -Wunused-value -Wempty-body -Wconditional-uninitialized -Wno-unknown-pragmas -Wno-shadow -Wno-four-char-constants -Wno-conversion -Wconstant-conversion -Wint-conversion -Wbool-conversion -Wenum-conversion -Wshorten-64-to-32 -Wpointer-sign -Wno-newline-eof -Wno-selector -Wno-strict-selector-match -Wundeclared-selector -Wno-deprecated-implementations -DNS_BLOCK_ASSERTIONS=1 -isysroot /Applications/Xcode.app/Contents/Developer/Platforms/iPhoneSimulator.platform/Developer/SDKs/iPhoneSimulator9.2.sdk -fasm-blocks -fstrict-aliasing -Wprotocol -Wdeprecated-declarations -mios-simulator-version-min=7.0 -fvisibility=hidden -Wno-sign-conversion -fobjc-abi-version=2 -fobjc-legacy-dispatch -iquote /Users/cieri/Downloads/macserver/UploadedProjects/<user id>/build/B4iProject.build/Release-iphonesimulator/B4iProject.build/B4i\ Example-generated-files.hmap -I/Users/cieri/Downloads/macserver/UploadedProjects/<user id>/build/B4iProject.build/Release-iphonesimulator/B4iProject.build/B4i\ Example-own-target-headers.hmap -I/Users/cieri/Downloads/macserver/UploadedProjects/<user id>/build/B4iProject.build/Release-iphonesimulator/B4iProject.build/B4i\ Example-all-target-headers.hmap -iquote /Users/cieri/Downloads/macserver/UploadedProjects/<user id>/build/B4iProject.build/Release-iphonesimulator/B4iProject.build/B4i\ Example-project-headers.hmap -I/Users/cieri/Downloads/macserver/UploadedProjects/<user id>/Payload/include -I/Users/cieri/Downloads/macserver/UploadedProjects/<user id>/build/B4iProject.build/Release-iphonesimulator/B4iProject.build/DerivedSources/i386 -I/Users/cieri/Downloads/macserver/UploadedProjects/<user id>/build/B4iProject.build/Release-iphonesimulator/B4iProject.build/DerivedSources -F/Users/cieri/Downloads/macserver/UploadedProjects/<user id>/Payload -F../../Libs -MMD -MT dependencies -MF /Users/cieri/Downloads/macserver/UploadedProjects/<user id>/build/B4iProject.build/Release-iphonesimulator/B4iProject.build/Objects-normal/i386/b4i_googlemapsextra.d --serialize-diagnostics /Users/cieri/Downloads/macserver/UploadedProjects/<user id>/build/B4iProject.build/Release-iphonesimulator/B4iProject.build/Objects-normal/i386/b4i_googlemapsextra.dia -c /Users/cieri/Downloads/macserver/UploadedProjects/<user id>/B4iProject/b4i_googlemapsextra.m -o /Users/cieri/Downloads/macserver/UploadedProjects/<user id>/build/B4iProject.build/Release-iphonesimulator/B4iProject.build/Objects-normal/i386/b4i_googlemapsextra.o

CompileC build/B4iProject.build/Release-iphonesimulator/B4iProject.build/Objects-normal/i386/b4i_main.o B4iProject/b4i_main.m normal i386 objective-c com.apple.compilers.llvm.clang.1_0.compiler
cd /Users/cieri/Downloads/macserver/UploadedProjects/<user id>
export LANG=en_US.US-ASCII
export PATH="/Applications/Xcode.app/Contents/Developer/Platforms/iPhoneSimulator.platform/Developer/usr/bin:/Applications/Xcode.app/Contents/Developer/usr/bin:/usr/local/bin:/usr/bin:/bin:/usr/sbin:/sbin"
/Applications/Xcode.app/Contents/Developer/Toolchains/XcodeDefault.xctoolchain/usr/bin/clang -x objective-c -arch i386 -fmessage-length=0 -fdiagnostics-show-note-include-stack -fmacro-backtrace-limit=0 -std=gnu99 -fobjc-arc -fmodules -gmodules -fmodules-prune-interval=86400 -fmodules-prune-after=345600 -fbuild-session-file=/var/folders/gw/2x1bwmkx0d596f8rrqwyqhs40000gn/C/org.llvm.clang/ModuleCache/Session.modulevalidation -fmodules-validate-once-per-build-session -Wnon-modular-include-in-framework-module -Werror=non-modular-include-in-framework-module -Wno-trigraphs -fpascal-strings -O0 -Wno-missing-field-initializers -Wno-missing-prototypes -Werror=return-type -Wno-implicit-atomic-properties -Werror=deprecated-objc-isa-usage -Werror=objc-root-class -Wno-arc-repeated-use-of-weak -Wduplicate-method-match -Wno-missing-braces -Wparentheses -Wswitch -Wunused-function -Wno-unused-label -Wno-unused-parameter -Wunused-variable -Wunused-value -Wempty-body -Wconditional-uninitialized -Wno-unknown-pragmas -Wno-shadow -Wno-four-char-constants -Wno-conversion -Wconstant-conversion -Wint-conversion -Wbool-conversion -Wenum-conversion -Wshorten-64-to-32 -Wpointer-sign -Wno-newline-eof -Wno-selector -Wno-strict-selector-match -Wundeclared-selector -Wno-deprecated-implementations -DNS_BLOCK_ASSERTIONS=1 -isysroot /Applications/Xcode.app/Contents/Developer/Platforms/iPhoneSimulator.platform/Developer/SDKs/iPhoneSimulator9.2.sdk -fasm-blocks -fstrict-aliasing -Wprotocol -Wdeprecated-declarations -mios-simulator-version-min=7.0 -fvisibility=hidden -Wno-sign-conversion -fobjc-abi-version=2 -fobjc-legacy-dispatch -iquote /Users/cieri/Downloads/macserver/UploadedProjects/<user id>/build/B4iProject.build/Release-iphonesimulator/B4iProject.build/B4i\ Example-generated-files.hmap -I/Users/cieri/Downloads/macserver/UploadedProjects/<user id>/build/B4iProject.build/Release-iphonesimulator/B4iProject.build/B4i\ Example-own-target-headers.hmap -I/Users/cieri/Downloads/macserver/UploadedProjects/<user id>/build/B4iProject.build/Release-iphonesimulator/B4iProject.build/B4i\ Example-all-target-headers.hmap -iquote /Users/cieri/Downloads/macserver/UploadedProjects/<user id>/build/B4iProject.build/Release-iphonesimulator/B4iProject.build/B4i\ Example-project-headers.hmap -I/Users/cieri/Downloads/macserver/UploadedProjects/<user id>/Payload/include -I/Users/cieri/Downloads/macserver/UploadedProjects/<user id>/build/B4iProject.build/Release-iphonesimulator/B4iProject.build/DerivedSources/i386 -I/Users/cieri/Downloads/macserver/UploadedProjects/<user id>/build/B4iProject.build/Release-iphonesimulator/B4iProject.build/DerivedSources -F/Users/cieri/Downloads/macserver/UploadedProjects/<user id>/Payload -F../../Libs -MMD -MT dependencies -MF /Users/cieri/Downloads/macserver/UploadedProjects/<user id>/build/B4iProject.build/Release-iphonesimulator/B4iProject.build/Objects-normal/i386/b4i_main.d --serialize-diagnostics /Users/cieri/Downloads/macserver/UploadedProjects/<user id>/build/B4iProject.build/Release-iphonesimulator/B4iProject.build/Objects-normal/i386/b4i_main.dia -c /Users/cieri/Downloads/macserver/UploadedProjects/<user id>/B4iProject/b4i_main.m -o /Users/cieri/Downloads/macserver/UploadedProjects/<user id>/build/B4iProject.build/Release-iphonesimulator/B4iProject.build/Objects-normal/i386/b4i_main.o

Ld Payload/B4i\ Example.app/B4i\ Example normal i386
cd /Users/cieri/Downloads/macserver/UploadedProjects/<user id>
export IPHONEOS_DEPLOYMENT_TARGET=7.0
export PATH="/Applications/Xcode.app/Contents/Developer/Platforms/iPhoneSimulator.platform/Developer/usr/bin:/Applications/Xcode.app/Contents/Developer/usr/bin:/usr/local/bin:/usr/bin:/bin:/usr/sbin:/sbin"
/Applications/Xcode.app/Contents/Developer/Toolchains/XcodeDefault.xctoolchain/usr/bin/clang -arch i386 -isysroot /Applications/Xcode.app/Contents/Developer/Platforms/iPhoneSimulator.platform/Developer/SDKs/iPhoneSimulator9.2.sdk -L/Users/cieri/Downloads/macserver/UploadedProjects/<user id>/Payload -L../../Libs -F/Users/cieri/Downloads/macserver/UploadedProjects/<user id>/Payload -F../../Libs -filelist /Users/cieri/Downloads/macserver/UploadedProjects/<user id>/build/B4iProject.build/Release-iphonesimulator/B4iProject.build/Objects-normal/i386/B4i\ Example.LinkFileList -mios-simulator-version-min=7.0 -Xlinker -objc_abi_version -Xlinker 2 -ObjC -fobjc-arc -fobjc-link-runtime -lCore -framework Foundation -framework CoreGraphics -framework UIKit -liGoogleMaps -framework AVFoundation -framework CoreData -framework CoreLocation -framework CoreText -framework GLKit -framework ImageIO -lc++ -licucore -lz -framework OpenGLES -framework QuartzCore -framework SystemConfiguration -framework GoogleMaps -liDebug2 -Xlinker -dependency_info -Xlinker /Users/cieri/Downloads/macserver/UploadedProjects/<user id>/build/B4iProject.build/Release-iphonesimulator/B4iProject.build/Objects-normal/i386/B4i\ Example_dependency_info.dat -o /Users/cieri/Downloads/macserver/UploadedProjects/<user id>/Payload/B4i\ Example.app/B4i\ Example
Undefined symbols for architecture i386:
"_vImageBoxConvolve_Planar8", referenced from:
(anonymous namespace)::CreateBlurredImage(CGImage*, float, float) in GoogleMaps
ld: symbol(s) not found for architecture i386
clang: error: linker command failed with exit code 1 (use -v to see invocation)


Error: ** BUILD FAILED **


The following build commands failed:
Ld Payload/B4i\ Example.app/B4i\ Example normal i386
(1 failure)
 

Ohanian

Active Member
Licensed User
Hi,

I’m trying to resize the map so I can put some other views on the page, but the gmap always takes the whole screen even when I set this:

Page1.RootPanel.AddView(gmap, 0, 0, 0, 0)

Any explanation?
 

Attachments

marcick

Well-Known Member
Licensed User
resize it in Page1_Resize
For example:

B4X:
Private Sub Page1_Resize(Width As Int, Height As Int)
    gmap.Top=Lbl_Address.Top+Lbl_Address.Height
    gmap.Height=Height-gmap.Top
End Sub
 

cloner7801

Active Member
Licensed User
Why I get this error

B4X:
ClientParametersRequest failed, 7 attempts remaining (0 vs 6). Error Domain=NSURLErrorDomain Code=-1001 "The request timed out." UserInfo={NSErrorFailingURLStringKey=https://clients4.google.com/glm/mmap, _kCFStreamErrorCodeKey=-2102, NSErrorFailingURLKey=https://clients4.google.com/glm/mmap, NSLocalizedDescription=The request timed out., _kCFStreamErrorDomainKey=4, NSUnderlyingError=0x14554a30 {Error Domain=kCFErrorDomainCFNetwork Code=-1001 "(null)" UserInfo={_kCFStreamErrorDomainKey=4, _kCFStreamErrorCodeKey=-2102}}}
I enabled google map api for ios in console and I get api and add in project
 

tamayo461

Member
Licensed User
Hi i have the last version of lib and framework but:

Error: ** BUILD FAILED **


The following build commands failed:
CompileC build/B4iProject.build/Release-iphoneos/B4iProject.build/Objects-normal/armv7/b4i_googlemapsextra.o B4iProject/b4i_googlemapsextra.m normal armv7 objective-c com.apple.compilers.llvm.clang.1_0.compiler
(1 failure)
 

Amin Ismail

Active Member
Licensed User
If you are using a local Mac builder then you need to copy the framework to the Libs folder that is under the builder folder.
Do you have to just copy it to the Libs folder after downloading the SDK file. Or do you also need to install the SDK on the Mac? I did exactly what you said (except the "Install" part) and the build fails.
 

Amin Ismail

Active Member
Licensed User
I went ahead and did that ... copied all the files in the ZIP to the Libs folder. But the Build still fails (see below). Hosted Build Server works/compiles fine with the same program.

B4i Version: 4.40
Parsing code. (0.02s)
Compiling code. (0.36s)
Compiling layouts code. (0.04s)
Compiling debugger engine code. (2.60s)
Building Xcode project (1.91s)
Sending data to remote compiler. Error
B4i line: 61
cvs.DrawLine(0, cvs.TargetRect.Bottom - 1dip, scr
no visible @interface for 'B4XCanvas' declares the selector 'DrawLine::::::'

Out: Build settings from command line:
ARCHS = armv7
CODE_SIGN_IDENTITY = iPhone
CONFIGURATION_BUILD_DIR = /Users/aminismail/Desktop/B4Imacserver/UploadedProjects/<user id>/Payload
OTHER_CODE_SIGN_FLAGS = --keychain <user id>
PRODUCT_NAME = B4i Example
PROVISIONING_PROFILE = 472376b8-72ec-40d2-a913-a65ce002252d

=== BUILD TARGET B4iProject OF PROJECT B4iProject WITH CONFIGURATION Release ===

Check dependencies

Write auxiliary files
write-file /Users/aminismail/Desktop/B4Imacserver/UploadedProjects/<user id>/build/B4iProject.build/Release-iphoneos/B4iProject.build/B4i\ Example-generated-files.hmap
write-file /Users/aminismail/Desktop/B4Imacserver/UploadedProjects/<user id>/build/B4iProject.build/Release-iphoneos/B4iProject.build/B4i\ Example-all-target-headers.hmap
write-file /Users/aminismail/Desktop/B4Imacserver/UploadedProjects/<user id>/build/B4iProject.build/Release-iphoneos/B4iProject.build/B4i\ Example-own-target-headers.hmap
write-file /Users/aminismail/Desktop/B4Imacserver/UploadedProjects/<user id>/build/B4iProject.build/Release-iphoneos/B4iProject.build/B4i\ Example-project-headers.hmap
write-file /Users/aminismail/Desktop/B4Imacserver/UploadedProjects/<user id>/build/B4iProject.build/Release-iphoneos/B4iProject.build/B4i\ Example.hmap
/bin/mkdir -p /Users/aminismail/Desktop/B4Imacserver/UploadedProjects/<user id>/build/B4iProject.build/Release-iphoneos/B4iProject.build/Objects-normal/armv7
write-file /Users/aminismail/Desktop/B4Imacserver/UploadedProjects/<user id>/build/B4iProject.build/Release-iphoneos/B4iProject.build/Objects-normal/armv7/B4i\ Example.LinkFileList
write-file /Users/aminismail/Desktop/B4Imacserver/UploadedProjects/<user id>/build/B4iProject.build/Release-iphoneos/B4iProject.build/B4i\ Example-all-non-framework-target-headers.hmap

Create product structure
/bin/mkdir -p /Users/aminismail/Desktop/B4Imacserver/UploadedProjects/<user id>/Payload/B4i\ Example.app

CompileC build/B4iProject.build/Release-iphoneos/B4iProject.build/Objects-normal/armv7/main.o B4iProject/main.m normal armv7 objective-c com.apple.compilers.llvm.clang.1_0.compiler
cd /Users/aminismail/Desktop/B4Imacserver/UploadedProjects/<user id>
export LANG=en_US.US-ASCII
export PATH="/Applications/Xcode.app/Contents/Developer/Platforms/iPhoneOS.platform/Developer/usr/bin:/Applications/Xcode.app/Contents/Developer/usr/bin:/usr/bin:/bin:/usr/sbin:/sbin:/usr/local/bin"
/Applications/Xcode.app/Contents/Developer/Toolchains/XcodeDefault.xctoolchain/usr/bin/clang -x objective-c -arch armv7 -fmessage-length=0 -fdiagnostics-show-note-include-stack -fmacro-backtrace-limit=0 -std=gnu99 -fobjc-arc -fmodules -gmodules -fmodules-prune-interval=86400 -fmodules-prune-after=345600 -fbuild-session-file=/var/folders/rd/7yjcqkl934s6bcqsrhph4sww0000gn/C/org.llvm.clang/ModuleCache/Session.modulevalidation -fmodules-validate-once-per-build-session -Wnon-modular-include-in-framework-module -Werror=non-modular-include-in-framework-module -Wno-trigraphs -fpascal-strings -O0 -Wno-missing-field-initializers -Wno-missing-prototypes -Werror=return-type -Wno-implicit-atomic-properties -Werror=deprecated-objc-isa-usage -Werror=objc-root-class -Wno-arc-repeated-use-of-weak -Wduplicate-method-match -Wno-missing-braces -Wparentheses -Wswitch -Wunused-function -Wno-unused-label -Wno-unused-parameter -Wunused-variable -Wunused-value -Wempty-body -Wuninitialized -Wconditional-uninitialized -Wno-unknown-pragmas -Wno-shadow -Wno-four-char-constants -Wno-conversion -Wconstant-conversion -Wint-conversion -Wbool-conversion -Wenum-conversion -Wno-float-conversion -Wno-non-literal-null-conversion -Wno-objc-literal-conversion -Wshorten-64-to-32 -Wpointer-sign -Wno-newline-eof -Wno-selector -Wno-strict-selector-match -Wundeclared-selector -Wno-deprecated-implementations -DNS_BLOCK_ASSERTIONS=1 -isysroot /Applications/Xcode.app/Contents/Developer/Platforms/iPhoneOS.platform/Developer/SDKs/iPhoneOS11.2.sdk -fstrict-aliasing -Wprotocol -Wdeprecated-declarations -miphoneos-version-min=7.0 -fvisibility=hidden -Wno-sign-conversion -Wno-infinite-recursion -Wno-comma -Wno-block-capture-autoreleasing -Wno-strict-prototypes -iquote /Users/aminismail/Desktop/B4Imacserver/UploadedProjects/<user id>/build/B4iProject.build/Release-iphoneos/B4iProject.build/B4i\ Example-generated-files.hmap -I/Users/aminismail/Desktop/B4Imacserver/UploadedProjects/<user id>/build/B4iProject.build/Release-iphoneos/B4iProject.build/B4i\ Example-own-target-headers.hmap -I/Users/aminismail/Desktop/B4Imacserver/UploadedProjects/<user id>/build/B4iProject.build/Release-iphoneos/B4iProject.build/B4i\ Example-all-target-headers.hmap -iquote /Users/aminismail/Desktop/B4Imacserver/UploadedProjects/<user id>/build/B4iProject.build/Release-iphoneos/B4iProject.build/B4i\ Example-project-headers.hmap -I/Users/aminismail/Desktop/B4Imacserver/UploadedProjects/<user id>/Payload/include -I/Users/aminismail/Desktop/B4Imacserver/UploadedProjects/<user id>/build/B4iProject.build/Release-iphoneos/B4iProject.build/DerivedSources/armv7 -I/Users/aminismail/Desktop/B4Imacserver/UploadedProjects/<user id>/build/B4iProject.build/Release-iphoneos/B4iProject.build/DerivedSources -F/Users/aminismail/Desktop/B4Imacserver/UploadedProjects/<user id>/Payload -F../../Libs -MMD -MT dependencies -MF /Users/aminismail/Desktop/B4Imacserver/UploadedProjects/<user id>/build/B4iProject.build/Release-iphoneos/B4iProject.build/Objects-normal/armv7/main.d --serialize-diagnostics /Users/aminismail/Desktop/B4Imacserver/UploadedProjects/<user id>/build/B4iProject.build/Release-iphoneos/B4iProject.build/Objects-normal/armv7/main.dia -c /Users/aminismail/Desktop/B4Imacserver/UploadedProjects/<user id>/B4iProject/main.m -o /Users/aminismail/Desktop/B4Imacserver/UploadedProjects/<user id>/build/B4iProject.build/Release-iphoneos/B4iProject.build/Objects-normal/armv7/main.o

CompileC build/B4iProject.build/Release-iphoneos/B4iProject.build/Objects-normal/armv7/b4i_googlemapsextra.o B4iProject/b4i_googlemapsextra.m normal armv7 objective-c com.apple.compilers.llvm.clang.1_0.compiler
cd /Users/aminismail/Desktop/B4Imacserver/UploadedProjects/<user id>
export LANG=en_US.US-ASCII
export PATH="/Applications/Xcode.app/Contents/Developer/Platforms/iPhoneOS.platform/Developer/usr/bin:/Applications/Xcode.app/Contents/Developer/usr/bin:/usr/bin:/bin:/usr/sbin:/sbin:/usr/local/bin"
/Applications/Xcode.app/Contents/Developer/Toolchains/XcodeDefault.xctoolchain/usr/bin/clang -x objective-c -arch armv7 -fmessage-length=0 -fdiagnostics-show-note-include-stack -fmacro-backtrace-limit=0 -std=gnu99 -fobjc-arc -fmodules -gmodules -fmodules-prune-interval=86400 -fmodules-prune-after=345600 -fbuild-session-file=/var/folders/rd/7yjcqkl934s6bcqsrhph4sww0000gn/C/org.llvm.clang/ModuleCache/Session.modulevalidation -fmodules-validate-once-per-build-session -Wnon-modular-include-in-framework-module -Werror=non-modular-include-in-framework-module -Wno-trigraphs -fpascal-strings -O0 -Wno-missing-field-initializers -Wno-missing-prototypes -Werror=return-type -Wno-implicit-atomic-properties -Werror=deprecated-objc-isa-usage -Werror=objc-root-class -Wno-arc-repeated-use-of-weak -Wduplicate-method-match -Wno-missing-braces -Wparentheses -Wswitch -Wunused-function -Wno-unused-label -Wno-unused-parameter -Wunused-variable -Wunused-value -Wempty-body -Wuninitialized -Wconditional-uninitialized -Wno-unknown-pragmas -Wno-shadow -Wno-four-char-constants -Wno-conversion -Wconstant-conversion -Wint-conversion -Wbool-conversion -Wenum-conversion -Wno-float-conversion -Wno-non-literal-null-conversion -Wno-objc-literal-conversion -Wshorten-64-to-32 -Wpointer-sign -Wno-newline-eof -Wno-selector -Wno-strict-selector-match -Wundeclared-selector -Wno-deprecated-implementations -DNS_BLOCK_ASSERTIONS=1 -isysroot /Applications/Xcode.app/Contents/Developer/Platforms/iPhoneOS.platform/Developer/SDKs/iPhoneOS11.2.sdk -fstrict-aliasing -Wprotocol -Wdeprecated-declarations -miphoneos-version-min=7.0 -fvisibility=hidden -Wno-sign-conversion -Wno-infinite-recursion -Wno-comma -Wno-block-capture-autoreleasing -Wno-strict-prototypes -iquote /Users/aminismail/Desktop/B4Imacserver/UploadedProjects/<user id>/build/B4iProject.build/Release-iphoneos/B4iProject.build/B4i\ Example-generated-files.hmap -I/Users/aminismail/Desktop/B4Imacserver/UploadedProjects/<user id>/build/B4iProject.build/Release-iphoneos/B4iProject.build/B4i\ Example-own-target-headers.hmap -I/Users/aminismail/Desktop/B4Imacserver/UploadedProjects/<user id>/build/B4iProject.build/Release-iphoneos/B4iProject.build/B4i\ Example-all-target-headers.hmap -iquote /Users/aminismail/Desktop/B4Imacserver/UploadedProjects/<user id>/build/B4iProject.build/Release-iphoneos/B4iProject.build/B4i\ Example-project-headers.hmap -I/Users/aminismail/Desktop/B4Imacserver/UploadedProjects/<user id>/Payload/include -I/Users/aminismail/Desktop/B4Imacserver/UploadedProjects/<user id>/build/B4iProject.build/Release-iphoneos/B4iProject.build/DerivedSources/armv7 -I/Users/aminismail/Desktop/B4Imacserver/UploadedProjects/<user id>/build/B4iProject.build/Release-iphoneos/B4iProject.build/DerivedSources -F/Users/aminismail/Desktop/B4Imacserver/UploadedProjects/<user id>/Payload -F../../Libs -MMD -MT dependencies -MF /Users/aminismail/Desktop/B4Imacserver/UploadedProjects/<user id>/build/B4iProject.build/Release-iphoneos/B4iProject.build/Objects-normal/armv7/b4i_googlemapsextra.d --serialize-diagnostics /Users/aminismail/Desktop/B4Imacserver/UploadedProjects/<user id>/build/B4iProject.build/Release-iphoneos/B4iProject.build/Objects-normal/armv7/b4i_googlemapsextra.dia -c /Users/aminismail/Desktop/B4Imacserver/UploadedProjects/<user id>/B4iProject/b4i_googlemapsextra.m -o /Users/aminismail/Desktop/B4Imacserver/UploadedProjects/<user id>/build/B4iProject.build/Release-iphoneos/B4iProject.build/Objects-normal/armv7/b4i_googlemapsextra.o
In file included from /Users/aminismail/Desktop/B4Imacserver/UploadedProjects/<user id>/B4iProject/b4i_googlemapsextra.m:2:
/Users/aminismail/Desktop/B4Imacserver/UploadedProjects/<user id>/B4iProject/b4i_googlemapsextra.h:5:9: warning: non-portable path to file '"iHttp.h"'; specified path differs in case from file name on disk [-Wnonportable-include-path]
#import "ihttp.h"
^~~~~~~~~
"iHttp.h"
/Users/aminismail/Desktop/B4Imacserver/UploadedProjects/<user id>/B4iProject/b4i_googlemapsextra.h:6:9: warning: non-portable path to file '"iStringUtils.h"'; specified path differs in case from file name on disk [-Wnonportable-include-path]
#import "istringutils.h"
^~~~~~~~~~~~~~~~
"iStringUtils.h"
/Users/aminismail/Desktop/B4Imacserver/UploadedProjects/<user id>/B4iProject/b4i_googlemapsextra.h:7:9: warning: non-portable path to file '"iHUD.h"'; specified path differs in case from file name on disk [-Wnonportable-include-path]
#import "ihud.h"
^~~~~~~~
"iHUD.h"
In file included from /Users/aminismail/Desktop/B4Imacserver/UploadedProjects/<user id>/B4iProject/b4i_googlemapsextra.m:3:
/Users/aminismail/Desktop/B4Imacserver/UploadedProjects/<user id>/B4iProject/b4i_main.h:5:9: warning: non-portable path to file '"iHttp.h"'; specified path differs in case from file name on disk [-Wnonportable-include-path]
#import "ihttp.h"
^~~~~~~~~
"iHttp.h"
/Users/aminismail/Desktop/B4Imacserver/UploadedProjects/<user id>/B4iProject/b4i_main.h:6:9: warning: non-portable path to file '"iStringUtils.h"'; specified path differs in case from file name on disk [-Wnonportable-include-path]
#import "istringutils.h"
^~~~~~~~~~~~~~~~
"iStringUtils.h"
/Users/aminismail/Desktop/B4Imacserver/UploadedProjects/<user id>/B4iProject/b4i_main.h:7:9: warning: non-portable path to file '"iHUD.h"'; specified path differs in case from file name on disk [-Wnonportable-include-path]
#import "ihud.h"
^~~~~~~~
"iHUD.h"
In file included from /Users/aminismail/Desktop/B4Imacserver/UploadedProjects/<user id>/B4iProject/b4i_googlemapsextra.m:4:
/Users/aminismail/Desktop/B4Imacserver/UploadedProjects/<user id>/B4iProject/b4i_mapscale.h:5:9: warning: non-portable path to file '"iHttp.h"'; specified path differs in case from file name on disk [-Wnonportable-include-path]
#import "ihttp.h"
^~~~~~~~~
"iHttp.h"
/Users/aminismail/Desktop/B4Imacserver/UploadedProjects/<user id>/B4iProject/b4i_mapscale.h:6:9: warning: non-portable path to file '"iStringUtils.h"'; specified path differs in case from file name on disk [-Wnonportable-include-path]
#import "istringutils.h"
^~~~~~~~~~~~~~~~
"iStringUtils.h"
/Users/aminismail/Desktop/B4Imacserver/UploadedProjects/<user id>/B4iProject/b4i_mapscale.h:7:9: warning: non-portable path to file '"iHUD.h"'; specified path differs in case from file name on disk [-Wnonportable-include-path]
#import "ihud.h"
^~~~~~~~
"iHUD.h"

CompileC build/B4iProject.build/Release-iphoneos/B4iProject.build/Objects-normal/armv7/b4i_mapscale.o B4iProject/b4i_mapscale.m normal armv7 objective-c com.apple.compilers.llvm.clang.1_0.compiler
cd /Users/aminismail/Desktop/B4Imacserver/UploadedProjects/<user id>
export LANG=en_US.US-ASCII
export PATH="/Applications/Xcode.app/Contents/Developer/Platforms/iPhoneOS.platform/Developer/usr/bin:/Applications/Xcode.app/Contents/Developer/usr/bin:/usr/bin:/bin:/usr/sbin:/sbin:/usr/local/bin"
/Applications/Xcode.app/Contents/Developer/Toolchains/XcodeDefault.xctoolchain/usr/bin/clang -x objective-c -arch armv7 -fmessage-length=0 -fdiagnostics-show-note-include-stack -fmacro-backtrace-limit=0 -std=gnu99 -fobjc-arc -fmodules -gmodules -fmodules-prune-interval=86400 -fmodules-prune-after=345600 -fbuild-session-file=/var/folders/rd/7yjcqkl934s6bcqsrhph4sww0000gn/C/org.llvm.clang/ModuleCache/Session.modulevalidation -fmodules-validate-once-per-build-session -Wnon-modular-include-in-framework-module -Werror=non-modular-include-in-framework-module -Wno-trigraphs -fpascal-strings -O0 -Wno-missing-field-initializers -Wno-missing-prototypes -Werror=return-type -Wno-implicit-atomic-properties -Werror=deprecated-objc-isa-usage -Werror=objc-root-class -Wno-arc-repeated-use-of-weak -Wduplicate-method-match -Wno-missing-braces -Wparentheses -Wswitch -Wunused-function -Wno-unused-label -Wno-unused-parameter -Wunused-variable -Wunused-value -Wempty-body -Wuninitialized -Wconditional-uninitialized -Wno-unknown-pragmas -Wno-shadow -Wno-four-char-constants -Wno-conversion -Wconstant-conversion -Wint-conversion -Wbool-conversion -Wenum-conversion -Wno-float-conversion -Wno-non-literal-null-conversion -Wno-objc-literal-conversion -Wshorten-64-to-32 -Wpointer-sign -Wno-newline-eof -Wno-selector -Wno-strict-selector-match -Wundeclared-selector -Wno-deprecated-implementations -DNS_BLOCK_ASSERTIONS=1 -isysroot /Applications/Xcode.app/Contents/Developer/Platforms/iPhoneOS.platform/Developer/SDKs/iPhoneOS11.2.sdk -fstrict-aliasing -Wprotocol -Wdeprecated-declarations -miphoneos-version-min=7.0 -fvisibility=hidden -Wno-sign-conversion -Wno-infinite-recursion -Wno-comma -Wno-block-capture-autoreleasing -Wno-strict-prototypes -iquote /Users/aminismail/Desktop/B4Imacserver/UploadedProjects/<user id>/build/B4iProject.build/Release-iphoneos/B4iProject.build/B4i\ Example-generated-files.hmap -I/Users/aminismail/Desktop/B4Imacserver/UploadedProjects/<user id>/build/B4iProject.build/Release-iphoneos/B4iProject.build/B4i\ Example-own-target-headers.hmap -I/Users/aminismail/Desktop/B4Imacserver/UploadedProjects/<user id>/build/B4iProject.build/Release-iphoneos/B4iProject.build/B4i\ Example-all-target-headers.hmap -iquote /Users/aminismail/Desktop/B4Imacserver/UploadedProjects/<user id>/build/B4iProject.build/Release-iphoneos/B4iProject.build/B4i\ Example-project-headers.hmap -I/Users/aminismail/Desktop/B4Imacserver/UploadedProjects/<user id>/Payload/include -I/Users/aminismail/Desktop/B4Imacserver/UploadedProjects/<user id>/build/B4iProject.build/Release-iphoneos/B4iProject.build/DerivedSources/armv7 -I/Users/aminismail/Desktop/B4Imacserver/UploadedProjects/<user id>/build/B4iProject.build/Release-iphoneos/B4iProject.build/DerivedSources -F/Users/aminismail/Desktop/B4Imacserver/UploadedProjects/<user id>/Payload -F../../Libs -MMD -MT dependencies -MF /Users/aminismail/Desktop/B4Imacserver/UploadedProjects/<user id>/build/B4iProject.build/Release-iphoneos/B4iProject.build/Objects-normal/armv7/b4i_mapscale.d --serialize-diagnostics /Users/aminismail/Desktop/B4Imacserver/UploadedProjects/<user id>/build/B4iProject.build/Release-iphoneos/B4iProject.build/Objects-normal/armv7/b4i_mapscale.dia -c /Users/aminismail/Desktop/B4Imacserver/UploadedProjects/<user id>/B4iProject/b4i_mapscale.m -o /Users/aminismail/Desktop/B4Imacserver/UploadedProjects/<user id>/build/B4iProject.build/Release-iphoneos/B4iProject.build/Objects-normal/armv7/b4i_mapscale.o
In file included from /Users/aminismail/Desktop/B4Imacserver/UploadedProjects/<user id>/B4iProject/b4i_mapscale.m:2:
/Users/aminismail/Desktop/B4Imacserver/UploadedProjects/<user id>/B4iProject/b4i_mapscale.h:5:9: warning: non-portable path to file '"iHttp.h"'; specified path differs in case from file name on disk [-Wnonportable-include-path]
#import "ihttp.h"
^~~~~~~~~
"iHttp.h"
/Users/aminismail/Desktop/B4Imacserver/UploadedProjects/<user id>/B4iProject/b4i_mapscale.h:6:9: warning: non-portable path to file '"iStringUtils.h"'; specified path differs in case from file name on disk [-Wnonportable-include-path]
#import "istringutils.h"
^~~~~~~~~~~~~~~~
"iStringUtils.h"
/Users/aminismail/Desktop/B4Imacserver/UploadedProjects/<user id>/B4iProject/b4i_mapscale.h:7:9: warning: non-portable path to file '"iHUD.h"'; specified path differs in case from file name on disk [-Wnonportable-include-path]
#import "ihud.h"
^~~~~~~~
"iHUD.h"
In file included from /Users/aminismail/Desktop/B4Imacserver/UploadedProjects/<user id>/B4iProject/b4i_mapscale.m:3:
/Users/aminismail/Desktop/B4Imacserver/UploadedProjects/<user id>/B4iProject/b4i_main.h:5:9: warning: non-portable path to file '"iHttp.h"'; specified path differs in case from file name on disk [-Wnonportable-include-path]
#import "ihttp.h"
^~~~~~~~~
"iHttp.h"
/Users/aminismail/Desktop/B4Imacserver/UploadedProjects/<user id>/B4iProject/b4i_main.h:6:9: warning: non-portable path to file '"iStringUtils.h"'; specified path differs in case from file name on disk [-Wnonportable-include-path]
#import "istringutils.h"
^~~~~~~~~~~~~~~~
"iStringUtils.h"
/Users/aminismail/Desktop/B4Imacserver/UploadedProjects/<user id>/B4iProject/b4i_main.h:7:9: warning: non-portable path to file '"iHUD.h"'; specified path differs in case from file name on disk [-Wnonportable-include-path]
#import "ihud.h"
^~~~~~~~
"iHUD.h"
In file included from /Users/aminismail/Desktop/B4Imacserver/UploadedProjects/<user id>/B4iProject/b4i_mapscale.m:4:
/Users/aminismail/Desktop/B4Imacserver/UploadedProjects/<user id>/B4iProject/b4i_googlemapsextra.h:5:9: warning: non-portable path to file '"iHttp.h"'; specified path differs in case from file name on disk [-Wnonportable-include-path]
#import "ihttp.h"
^~~~~~~~~
"iHttp.h"
/Users/aminismail/Desktop/B4Imacserver/UploadedProjects/<user id>/B4iProject/b4i_googlemapsextra.h:6:9: warning: non-portable path to file '"iStringUtils.h"'; specified path differs in case from file name on disk [-Wnonportable-include-path]
#import "istringutils.h"
^~~~~~~~~~~~~~~~
"iStringUtils.h"
/Users/aminismail/Desktop/B4Imacserver/UploadedProjects/<user id>/B4iProject/b4i_googlemapsextra.h:7:9: warning: non-portable path to file '"iHUD.h"'; specified path differs in case from file name on disk [-Wnonportable-include-path]
#import "ihud.h"
^~~~~~~~
"iHUD.h"
/Users/aminismail/Desktop/B4Imacserver/UploadedProjects/<user id>/B4iProject/b4i_mapscale.m:85:13: error: no visible @interface for 'B4XCanvas' declares the selector 'DrawLine::::::'
[__ref._cvs DrawLine:(float) (0) :(float) ([[__ref._cvs TargetRect] Bottom]-[self.__c DipToCurrent:(int) (1)]) :_screendistance :(float) ([[__ref._cvs TargetRect] Bottom]-[self.__c DipToCurrent:(int) (1)]) :[__ref._xui Color_Black] :(float) (_strokewidth)];
~~~~~~~~~~ ^~~~~~~~~~~~~~~~~~~~~~~~~~~~~~~~~~~~~~~~~~~~~~~~~~~~~~~~~~~~~~~~~~~~~~~~~~~~~~~~~~~~~~~~~~~~~~~~~~~~~~~~~~~~~~~~~~~~~~~~~~~~~~~~~~~~~~~~~~~~~~~~~~~~~~~~~~~~~~~~~~~~~~~~~~~~~~~~~~~~~~~~~~~~~~~~~~~~~~~~~~~~~~~~~~~~~~~~~~~~~
/Users/aminismail/Desktop/B4Imacserver/UploadedProjects/<user id>/B4iProject/b4i_mapscale.m:92:13: error: no visible @interface for 'B4XCanvas' declares the selector 'DrawLine::::::'
[__ref._cvs DrawLine:_screendistance :(float) ([[__ref._cvs TargetRect] Bottom]-[self.__c DipToCurrent:(int) (1)]) :_screendistance :(float) ([[__ref._cvs TargetRect] Bottom]-[self.__c DipToCurrent:(int) (6)]) :[__ref._xui Color_Black] :(float) (_strokewidth)];
~~~~~~~~~~ ^~~~~~~~~~~~~~~~~~~~~~~~~~~~~~~~~~~~~~~~~~~~~~~~~~~~~~~~~~~~~~~~~~~~~~~~~~~~~~~~~~~~~~~~~~~~~~~~~~~~~~~~~~~~~~~~~~~~~~~~~~~~~~~~~~~~~~~~~~~~~~~~~~~~~~~~~~~~~~~~~~~~~~~~~~~~~~~~~~~~~~~~~~~~~~~~~~~~~~~~~~~~~~~~~~~~~~~~~~~~~~~~~
9 warnings and 2 errors generated.

CompileC build/B4iProject.build/Release-iphoneos/B4iProject.build/Objects-normal/armv7/b4i_main.o B4iProject/b4i_main.m normal armv7 objective-c com.apple.compilers.llvm.clang.1_0.compiler
cd /Users/aminismail/Desktop/B4Imacserver/UploadedProjects/<user id>
export LANG=en_US.US-ASCII
export PATH="/Applications/Xcode.app/Contents/Developer/Platforms/iPhoneOS.platform/Developer/usr/bin:/Applications/Xcode.app/Contents/Developer/usr/bin:/usr/bin:/bin:/usr/sbin:/sbin:/usr/local/bin"
/Applications/Xcode.app/Contents/Developer/Toolchains/XcodeDefault.xctoolchain/usr/bin/clang -x objective-c -arch armv7 -fmessage-length=0 -fdiagnostics-show-note-include-stack -fmacro-backtrace-limit=0 -std=gnu99 -fobjc-arc -fmodules -gmodules -fmodules-prune-interval=86400 -fmodules-prune-after=345600 -fbuild-session-file=/var/folders/rd/7yjcqkl934s6bcqsrhph4sww0000gn/C/org.llvm.clang/ModuleCache/Session.modulevalidation -fmodules-validate-once-per-build-session -Wnon-modular-include-in-framework-module -Werror=non-modular-include-in-framework-module -Wno-trigraphs -fpascal-strings -O0 -Wno-missing-field-initializers -Wno-missing-prototypes -Werror=return-type -Wno-implicit-atomic-properties -Werror=deprecated-objc-isa-usage -Werror=objc-root-class -Wno-arc-repeated-use-of-weak -Wduplicate-method-match -Wno-missing-braces -Wparentheses -Wswitch -Wunused-function -Wno-unused-label -Wno-unused-parameter -Wunused-variable -Wunused-value -Wempty-body -Wuninitialized -Wconditional-uninitialized -Wno-unknown-pragmas -Wno-shadow -Wno-four-char-constants -Wno-conversion -Wconstant-conversion -Wint-conversion -Wbool-conversion -Wenum-conversion -Wno-float-conversion -Wno-non-literal-null-conversion -Wno-objc-literal-conversion -Wshorten-64-to-32 -Wpointer-sign -Wno-newline-eof -Wno-selector -Wno-strict-selector-match -Wundeclared-selector -Wno-deprecated-implementations -DNS_BLOCK_ASSERTIONS=1 -isysroot /Applications/Xcode.app/Contents/Developer/Platforms/iPhoneOS.platform/Developer/SDKs/iPhoneOS11.2.sdk -fstrict-aliasing -Wprotocol -Wdeprecated-declarations -miphoneos-version-min=7.0 -fvisibility=hidden -Wno-sign-conversion -Wno-infinite-recursion -Wno-comma -Wno-block-capture-autoreleasing -Wno-strict-prototypes -iquote /Users/aminismail/Desktop/B4Imacserver/UploadedProjects/<user id>/build/B4iProject.build/Release-iphoneos/B4iProject.build/B4i\ Example-generated-files.hmap -I/Users/aminismail/Desktop/B4Imacserver/UploadedProjects/<user id>/build/B4iProject.build/Release-iphoneos/B4iProject.build/B4i\ Example-own-target-headers.hmap -I/Users/aminismail/Desktop/B4Imacserver/UploadedProjects/<user id>/build/B4iProject.build/Release-iphoneos/B4iProject.build/B4i\ Example-all-target-headers.hmap -iquote /Users/aminismail/Desktop/B4Imacserver/UploadedProjects/<user id>/build/B4iProject.build/Release-iphoneos/B4iProject.build/B4i\ Example-project-headers.hmap -I/Users/aminismail/Desktop/B4Imacserver/UploadedProjects/<user id>/Payload/include -I/Users/aminismail/Desktop/B4Imacserver/UploadedProjects/<user id>/build/B4iProject.build/Release-iphoneos/B4iProject.build/DerivedSources/armv7 -I/Users/aminismail/Desktop/B4Imacserver/UploadedProjects/<user id>/build/B4iProject.build/Release-iphoneos/B4iProject.build/DerivedSources -F/Users/aminismail/Desktop/B4Imacserver/UploadedProjects/<user id>/Payload -F../../Libs -MMD -MT dependencies -MF /Users/aminismail/Desktop/B4Imacserver/UploadedProjects/<user id>/build/B4iProject.build/Release-iphoneos/B4iProject.build/Objects-normal/armv7/b4i_main.d --serialize-diagnostics /Users/aminismail/Desktop/B4Imacserver/UploadedProjects/<user id>/build/B4iProject.build/Release-iphoneos/B4iProject.build/Objects-normal/armv7/b4i_main.dia -c /Users/aminismail/Desktop/B4Imacserver/UploadedProjects/<user id>/B4iProject/b4i_main.m -o /Users/aminismail/Desktop/B4Imacserver/UploadedProjects/<user id>/build/B4iProject.build/Release-iphoneos/B4iProject.build/Objects-normal/armv7/b4i_main.o
In file included from /Users/aminismail/Desktop/B4Imacserver/UploadedProjects/<user id>/B4iProject/b4i_main.m:2:
/Users/aminismail/Desktop/B4Imacserver/UploadedProjects/<user id>/B4iProject/b4i_main.h:5:9: warning: non-portable path to file '"iHttp.h"'; specified path differs in case from file name on disk [-Wnonportable-include-path]
#import "ihttp.h"
^~~~~~~~~
"iHttp.h"
/Users/aminismail/Desktop/B4Imacserver/UploadedProjects/<user id>/B4iProject/b4i_main.h:6:9: warning: non-portable path to file '"iStringUtils.h"'; specified path differs in case from file name on disk [-Wnonportable-include-path]
#import "istringutils.h"
^~~~~~~~~~~~~~~~
"iStringUtils.h"
/Users/aminismail/Desktop/B4Imacserver/UploadedProjects/<user id>/B4iProject/b4i_main.h:7:9: warning: non-portable path to file '"iHUD.h"'; specified path differs in case from file name on disk [-Wnonportable-include-path]
#import "ihud.h"
^~~~~~~~
"iHUD.h"
In file included from /Users/aminismail/Desktop/B4Imacserver/UploadedProjects/<user id>/B4iProject/b4i_main.m:3:
/Users/aminismail/Desktop/B4Imacserver/UploadedProjects/<user id>/B4iProject/b4i_mapscale.h:5:9: warning: non-portable path to file '"iHttp.h"'; specified path differs in case from file name on disk [-Wnonportable-include-path]
#import "ihttp.h"
^~~~~~~~~
"iHttp.h"
/Users/aminismail/Desktop/B4Imacserver/UploadedProjects/<user id>/B4iProject/b4i_mapscale.h:6:9: warning: non-portable path to file '"iStringUtils.h"'; specified path differs in case from file name on disk [-Wnonportable-include-path]
#import "istringutils.h"
^~~~~~~~~~~~~~~~
"iStringUtils.h"
/Users/aminismail/Desktop/B4Imacserver/UploadedProjects/<user id>/B4iProject/b4i_mapscale.h:7:9: warning: non-portable path to file '"iHUD.h"'; specified path differs in case from file name on disk [-Wnonportable-include-path]
#import "ihud.h"
^~~~~~~~
"iHUD.h"
In file included from /Users/aminismail/Desktop/B4Imacserver/UploadedProjects/<user id>/B4iProject/b4i_main.m:4:
/Users/aminismail/Desktop/B4Imacserver/UploadedProjects/<user id>/B4iProject/b4i_googlemapsextra.h:5:9: warning: non-portable path to file '"iHttp.h"'; specified path differs in case from file name on disk [-Wnonportable-include-path]
#import "ihttp.h"
^~~~~~~~~
"iHttp.h"
/Users/aminismail/Desktop/B4Imacserver/UploadedProjects/<user id>/B4iProject/b4i_googlemapsextra.h:6:9: warning: non-portable path to file '"iStringUtils.h"'; specified path differs in case from file name on disk [-Wnonportable-include-path]
#import "istringutils.h"
^~~~~~~~~~~~~~~~
"iStringUtils.h"
/Users/aminismail/Desktop/B4Imacserver/UploadedProjects/<user id>/B4iProject/b4i_googlemapsextra.h:7:9: warning: non-portable path to file '"iHUD.h"'; specified path differs in case from file name on disk [-Wnonportable-include-path]
#import "ihud.h"
^~~~~~~~
"iHUD.h"

CompileC build/B4iProject.build/Release-iphoneos/B4iProject.build/Objects-normal/armv7/LS_1.o B4iProject/LS_1.m normal armv7 objective-c com.apple.compilers.llvm.clang.1_0.compiler
cd /Users/aminismail/Desktop/B4Imacserver/UploadedProjects/<user id>
export LANG=en_US.US-ASCII
export PATH="/Applications/Xcode.app/Contents/Developer/Platforms/iPhoneOS.platform/Developer/usr/bin:/Applications/Xcode.app/Contents/Developer/usr/bin:/usr/bin:/bin:/usr/sbin:/sbin:/usr/local/bin"
/Applications/Xcode.app/Contents/Developer/Toolchains/XcodeDefault.xctoolchain/usr/bin/clang -x objective-c -arch armv7 -fmessage-length=0 -fdiagnostics-show-note-include-stack -fmacro-backtrace-limit=0 -std=gnu99 -fobjc-arc -fmodules -gmodules -fmodules-prune-interval=86400 -fmodules-prune-after=345600 -fbuild-session-file=/var/folders/rd/7yjcqkl934s6bcqsrhph4sww0000gn/C/org.llvm.clang/ModuleCache/Session.modulevalidation -fmodules-validate-once-per-build-session -Wnon-modular-include-in-framework-module -Werror=non-modular-include-in-framework-module -Wno-trigraphs -fpascal-strings -O0 -Wno-missing-field-initializers -Wno-missing-prototypes -Werror=return-type -Wno-implicit-atomic-properties -Werror=deprecated-objc-isa-usage -Werror=objc-root-class -Wno-arc-repeated-use-of-weak -Wduplicate-method-match -Wno-missing-braces -Wparentheses -Wswitch -Wunused-function -Wno-unused-label -Wno-unused-parameter -Wunused-variable -Wunused-value -Wempty-body -Wuninitialized -Wconditional-uninitialized -Wno-unknown-pragmas -Wno-shadow -Wno-four-char-constants -Wno-conversion -Wconstant-conversion -Wint-conversion -Wbool-conversion -Wenum-conversion -Wno-float-conversion -Wno-non-literal-null-conversion -Wno-objc-literal-conversion -Wshorten-64-to-32 -Wpointer-sign -Wno-newline-eof -Wno-selector -Wno-strict-selector-match -Wundeclared-selector -Wno-deprecated-implementations -DNS_BLOCK_ASSERTIONS=1 -isysroot /Applications/Xcode.app/Contents/Developer/Platforms/iPhoneOS.platform/Developer/SDKs/iPhoneOS11.2.sdk -fstrict-aliasing -Wprotocol -Wdeprecated-declarations -miphoneos-version-min=7.0 -fvisibility=hidden -Wno-sign-conversion -Wno-infinite-recursion -Wno-comma -Wno-block-capture-autoreleasing -Wno-strict-prototypes -iquote /Users/aminismail/Desktop/B4Imacserver/UploadedProjects/<user id>/build/B4iProject.build/Release-iphoneos/B4iProject.build/B4i\ Example-generated-files.hmap -I/Users/aminismail/Desktop/B4Imacserver/UploadedProjects/<user id>/build/B4iProject.build/Release-iphoneos/B4iProject.build/B4i\ Example-own-target-headers.hmap -I/Users/aminismail/Desktop/B4Imacserver/UploadedProjects/<user id>/build/B4iProject.build/Release-iphoneos/B4iProject.build/B4i\ Example-all-target-headers.hmap -iquote /Users/aminismail/Desktop/B4Imacserver/UploadedProjects/<user id>/build/B4iProject.build/Release-iphoneos/B4iProject.build/B4i\ Example-project-headers.hmap -I/Users/aminismail/Desktop/B4Imacserver/UploadedProjects/<user id>/Payload/include -I/Users/aminismail/Desktop/B4Imacserver/UploadedProjects/<user id>/build/B4iProject.build/Release-iphoneos/B4iProject.build/DerivedSources/armv7 -I/Users/aminismail/Desktop/B4Imacserver/UploadedProjects/<user id>/build/B4iProject.build/Release-iphoneos/B4iProject.build/DerivedSources -F/Users/aminismail/Desktop/B4Imacserver/UploadedProjects/<user id>/Payload -F../../Libs -MMD -MT dependencies -MF /Users/aminismail/Desktop/B4Imacserver/UploadedProjects/<user id>/build/B4iProject.build/Release-iphoneos/B4iProject.build/Objects-normal/armv7/LS_1.d --serialize-diagnostics /Users/aminismail/Desktop/B4Imacserver/UploadedProjects/<user id>/build/B4iProject.build/Release-iphoneos/B4iProject.build/Objects-normal/armv7/LS_1.dia -c /Users/aminismail/Desktop/B4Imacserver/UploadedProjects/<user id>/B4iProject/LS_1.m -o /Users/aminismail/Desktop/B4Imacserver/UploadedProjects/<user id>/build/B4iProject.build/Release-iphoneos/B4iProject.build/Objects-normal/armv7/LS_1.o


Error: ** BUILD FAILED **


The following build commands failed:
CompileC build/B4iProject.build/Release-iphoneos/B4iProject.build/Objects-normal/armv7/b4i_mapscale.o B4iProject/b4i_mapscale.m normal armv7 objective-c com.apple.compilers.llvm.clang.1_0.compiler
(1 failure)
 

Amin Ismail

Active Member
Licensed User
Yes, I figured there was a Version mismatch since it complied fine on the Hosted Server. So I installed Build Server V4.6, replacing V4.41 which replaced XUI V1.40 with V1.50 and it complied and ran without any errors.
Thank you for confirming this.
 

Alberto Iglesias

Well-Known Member
Licensed User
This is a minimum project to google maps and still not working, now I got a strange error:


_OBJC_CLASS_$_CTTelephonyNetworkInfo"



I delete from this example the folder "Special/GoogleMaps.bundle" for for decrease the size of file to upload here.

Someone have any ideas how to fix this?

Thank you

Alberto Iglesias

BTW:
i'm using my local builder with:

* B4i v4.8.1
* Builder 4.6
  • iGoogleMaps: 1.40
  • libiGoogleMaps, size=167984, modified=08/17/2017 16:03:02
 

Attachments

Alberto Iglesias

Well-Known Member
Licensed User
Yes, I figured there was a Version mismatch since it complied fine on the Hosted Server. So I installed Build Server V4.6, replacing V4.41 which replaced XUI V1.40 with V1.50 and it complied and ran without any errors.
Thank you for confirming this.
I'm using the same version of Builder, iXUI 1.50 and still having the same error

-[B4XCanvas DrawLine::::::]: unrecognized selector sent to instance 0x1c0018830
 
Status
Not open for further replies.
Top