iOS Question googlempas problem

azzam223

Active Member
Licensed User
hello I have some problem when i try to load googlemaps library I tries many times to correct it

B4X:
Undefined symbols for architecture x86_64:
  "_OBJC_CLASS_$_CTTelephonyNetworkInfo", referenced from:
      objc-class-ref in GoogleMaps
ld: symbol(s) not found for architecture x86_64
clang: error: linker command failed with exit code 1 (use -v to see invocation)


Error: ** BUILD FAILED **


The following build commands failed:
    Ld Payload/result.app/result normal x86_64
(1 failure)
 

azzam223

Active Member
Licensed User
same problem when i create new project

this is full error I get it

B4X:
B4i Version: 4.40
Parsing code.    (0.00s)
Compiling code.    (0.03s)
Compiling layouts code.    (0.00s)
Compiling debugger engine code.    (0.73s)
Building Xcode project    (0.21s)
Sending data to remote compiler.    Error
Out: Build settings from command line:
    ARCHS = x86_64
    CODE_SIGNING_REQUIRED = NO
    CONFIGURATION_BUILD_DIR = /Users/---/Desktop/makserver/UploadedProjects/<user id>/Payload
    PRODUCT_NAME = B4i Example
    SDKROOT = iphonesimulator11.2

=== BUILD TARGET B4iProject OF PROJECT B4iProject WITH CONFIGURATION Release ===

Check dependencies

Write auxiliary files
write-file /Users/---/Desktop/makserver/UploadedProjects/<user id>/build/B4iProject.build/Release-iphonesimulator/B4iProject.build/Objects-normal/x86_64/B4i\ Example.LinkFileList
write-file /Users/---/Desktop/makserver/UploadedProjects/<user id>/build/B4iProject.build/Release-iphonesimulator/B4iProject.build/B4i\ Example.hmap
write-file /Users/---/Desktop/makserver/UploadedProjects/<user id>/build/B4iProject.build/Release-iphonesimulator/B4iProject.build/B4i\ Example-project-headers.hmap

Create product structure
/bin/mkdir -p /Users/---/Desktop/makserver/UploadedProjects/<user id>/Payload/B4i\ Example.app

CompileC build/B4iProject.build/Release-iphonesimulator/B4iProject.build/Objects-normal/x86_64/b4i_main.o B4iProject/b4i_main.m normal x86_64 objective-c com.apple.compilers.llvm.clang.1_0.compiler
    cd /Users/---/Desktop/makserver/UploadedProjects/<user id>
    export LANG=en_US.US-ASCII
    export PATH="/Applications/Xcode.app/Contents/Developer/Platforms/iPhoneSimulator.platform/Developer/usr/bin:/Applications/Xcode.app/Contents/Developer/usr/bin:/usr/local/bin:/usr/bin:/bin:/usr/sbin:/sbin"
    /Applications/Xcode.app/Contents/Developer/Toolchains/XcodeDefault.xctoolchain/usr/bin/clang -x objective-c -arch x86_64 -fmessage-length=0 -fdiagnostics-show-note-include-stack -fmacro-backtrace-limit=0 -std=gnu99 -fobjc-arc -fmodules -gmodules -fmodules-prune-interval=86400 -fmodules-prune-after=345600 -fbuild-session-file=/var/folders/z2/31wpmyl145x1clwhjfgsrqdh0000gn/C/org.llvm.clang/ModuleCache/Session.modulevalidation -fmodules-validate-once-per-build-session -Wnon-modular-include-in-framework-module -Werror=non-modular-include-in-framework-module -Wno-trigraphs -fpascal-strings -O0 -Wno-missing-field-initializers -Wno-missing-prototypes -Werror=return-type -Wno-implicit-atomic-properties -Werror=deprecated-objc-isa-usage -Werror=objc-root-class -Wno-arc-repeated-use-of-weak -Wduplicate-method-match -Wno-missing-braces -Wparentheses -Wswitch -Wunused-function -Wno-unused-label -Wno-unused-parameter -Wunused-variable -Wunused-value -Wempty-body -Wuninitialized -Wconditional-uninitialized -Wno-unknown-pragmas -Wno-shadow -Wno-four-char-constants -Wno-conversion -Wconstant-conversion -Wint-conversion -Wbool-conversion -Wenum-conversion -Wno-float-conversion -Wno-non-literal-null-conversion -Wno-objc-literal-conversion -Wshorten-64-to-32 -Wpointer-sign -Wno-newline-eof -Wno-selector -Wno-strict-selector-match -Wundeclared-selector -Wno-deprecated-implementations -DNS_BLOCK_ASSERTIONS=1 -isysroot /Applications/Xcode.app/Contents/Developer/Platforms/iPhoneSimulator.platform/Developer/SDKs/iPhoneSimulator11.2.sdk -fasm-blocks -fstrict-aliasing -Wprotocol -Wdeprecated-declarations -mios-simulator-version-min=7.0 -fvisibility=hidden -Wno-sign-conversion -Wno-infinite-recursion -Wno-comma -Wno-block-capture-autoreleasing -Wno-strict-prototypes -fobjc-abi-version=2 -fobjc-legacy-dispatch -iquote /Users/---/Desktop/makserver/UploadedProjects/<user id>/build/B4iProject.build/Release-iphonesimulator/B4iProject.build/B4i\ Example-generated-files.hmap -I/Users/---/Desktop/makserver/UploadedProjects/<user id>/build/B4iProject.build/Release-iphonesimulator/B4iProject.build/B4i\ Example-own-target-headers.hmap -I/Users/---/Desktop/makserver/UploadedProjects/<user id>/build/B4iProject.build/Release-iphonesimulator/B4iProject.build/B4i\ Example-all-target-headers.hmap -iquote /Users/---/Desktop/makserver/UploadedProjects/<user id>/build/B4iProject.build/Release-iphonesimulator/B4iProject.build/B4i\ Example-project-headers.hmap -I/Users/---/Desktop/makserver/UploadedProjects/<user id>/Payload/include -I/Users/---/Desktop/makserver/UploadedProjects/<user id>/build/B4iProject.build/Release-iphonesimulator/B4iProject.build/DerivedSources/x86_64 -I/Users/---/Desktop/makserver/UploadedProjects/<user id>/build/B4iProject.build/Release-iphonesimulator/B4iProject.build/DerivedSources -F/Users/---/Desktop/makserver/UploadedProjects/<user id>/Payload -F../../Libs -MMD -MT dependencies -MF /Users/---/Desktop/makserver/UploadedProjects/<user id>/build/B4iProject.build/Release-iphonesimulator/B4iProject.build/Objects-normal/x86_64/b4i_main.d --serialize-diagnostics /Users/---/Desktop/makserver/UploadedProjects/<user id>/build/B4iProject.build/Release-iphonesimulator/B4iProject.build/Objects-normal/x86_64/b4i_main.dia -c /Users/---/Desktop/makserver/UploadedProjects/<user id>/B4iProject/b4i_main.m -o /Users/---/Desktop/makserver/UploadedProjects/<user id>/build/B4iProject.build/Release-iphonesimulator/B4iProject.build/Objects-normal/x86_64/b4i_main.o

CompileC build/B4iProject.build/Release-iphonesimulator/B4iProject.build/Objects-normal/x86_64/main.o B4iProject/main.m normal x86_64 objective-c com.apple.compilers.llvm.clang.1_0.compiler
    cd /Users/---/Desktop/makserver/UploadedProjects/<user id>
    export LANG=en_US.US-ASCII
    export PATH="/Applications/Xcode.app/Contents/Developer/Platforms/iPhoneSimulator.platform/Developer/usr/bin:/Applications/Xcode.app/Contents/Developer/usr/bin:/usr/local/bin:/usr/bin:/bin:/usr/sbin:/sbin"
    /Applications/Xcode.app/Contents/Developer/Toolchains/XcodeDefault.xctoolchain/usr/bin/clang -x objective-c -arch x86_64 -fmessage-length=0 -fdiagnostics-show-note-include-stack -fmacro-backtrace-limit=0 -std=gnu99 -fobjc-arc -fmodules -gmodules -fmodules-prune-interval=86400 -fmodules-prune-after=345600 -fbuild-session-file=/var/folders/z2/31wpmyl145x1clwhjfgsrqdh0000gn/C/org.llvm.clang/ModuleCache/Session.modulevalidation -fmodules-validate-once-per-build-session -Wnon-modular-include-in-framework-module -Werror=non-modular-include-in-framework-module -Wno-trigraphs -fpascal-strings -O0 -Wno-missing-field-initializers -Wno-missing-prototypes -Werror=return-type -Wno-implicit-atomic-properties -Werror=deprecated-objc-isa-usage -Werror=objc-root-class -Wno-arc-repeated-use-of-weak -Wduplicate-method-match -Wno-missing-braces -Wparentheses -Wswitch -Wunused-function -Wno-unused-label -Wno-unused-parameter -Wunused-variable -Wunused-value -Wempty-body -Wuninitialized -Wconditional-uninitialized -Wno-unknown-pragmas -Wno-shadow -Wno-four-char-constants -Wno-conversion -Wconstant-conversion -Wint-conversion -Wbool-conversion -Wenum-conversion -Wno-float-conversion -Wno-non-literal-null-conversion -Wno-objc-literal-conversion -Wshorten-64-to-32 -Wpointer-sign -Wno-newline-eof -Wno-selector -Wno-strict-selector-match -Wundeclared-selector -Wno-deprecated-implementations -DNS_BLOCK_ASSERTIONS=1 -isysroot /Applications/Xcode.app/Contents/Developer/Platforms/iPhoneSimulator.platform/Developer/SDKs/iPhoneSimulator11.2.sdk -fasm-blocks -fstrict-aliasing -Wprotocol -Wdeprecated-declarations -mios-simulator-version-min=7.0 -fvisibility=hidden -Wno-sign-conversion -Wno-infinite-recursion -Wno-comma -Wno-block-capture-autoreleasing -Wno-strict-prototypes -fobjc-abi-version=2 -fobjc-legacy-dispatch -iquote /Users/---/Desktop/makserver/UploadedProjects/<user id>/build/B4iProject.build/Release-iphonesimulator/B4iProject.build/B4i\ Example-generated-files.hmap -I/Users/---/Desktop/makserver/UploadedProjects/<user id>/build/B4iProject.build/Release-iphonesimulator/B4iProject.build/B4i\ Example-own-target-headers.hmap -I/Users/---/Desktop/makserver/UploadedProjects/<user id>/build/B4iProject.build/Release-iphonesimulator/B4iProject.build/B4i\ Example-all-target-headers.hmap -iquote /Users/---/Desktop/makserver/UploadedProjects/<user id>/build/B4iProject.build/Release-iphonesimulator/B4iProject.build/B4i\ Example-project-headers.hmap -I/Users/---/Desktop/makserver/UploadedProjects/<user id>/Payload/include -I/Users/---/Desktop/makserver/UploadedProjects/<user id>/build/B4iProject.build/Release-iphonesimulator/B4iProject.build/DerivedSources/x86_64 -I/Users/---/Desktop/makserver/UploadedProjects/<user id>/build/B4iProject.build/Release-iphonesimulator/B4iProject.build/DerivedSources -F/Users/---/Desktop/makserver/UploadedProjects/<user id>/Payload -F../../Libs -MMD -MT dependencies -MF /Users/---/Desktop/makserver/UploadedProjects/<user id>/build/B4iProject.build/Release-iphonesimulator/B4iProject.build/Objects-normal/x86_64/main.d --serialize-diagnostics /Users/---/Desktop/makserver/UploadedProjects/<user id>/build/B4iProject.build/Release-iphonesimulator/B4iProject.build/Objects-normal/x86_64/main.dia -c /Users/---/Desktop/makserver/UploadedProjects/<user id>/B4iProject/main.m -o /Users/---/Desktop/makserver/UploadedProjects/<user id>/build/B4iProject.build/Release-iphonesimulator/B4iProject.build/Objects-normal/x86_64/main.o

Ld Payload/B4i\ Example.app/B4i\ Example normal x86_64
    cd /Users/---/Desktop/makserver/UploadedProjects/<user id>
    export IPHONEOS_DEPLOYMENT_TARGET=7.0
    export PATH="/Applications/Xcode.app/Contents/Developer/Platforms/iPhoneSimulator.platform/Developer/usr/bin:/Applications/Xcode.app/Contents/Developer/usr/bin:/usr/local/bin:/usr/bin:/bin:/usr/sbin:/sbin"
    /Applications/Xcode.app/Contents/Developer/Toolchains/XcodeDefault.xctoolchain/usr/bin/clang -arch x86_64 -isysroot /Applications/Xcode.app/Contents/Developer/Platforms/iPhoneSimulator.platform/Developer/SDKs/iPhoneSimulator11.2.sdk -L/Users/---/Desktop/makserver/UploadedProjects/<user id>/Payload -L../../Libs -F/Users/---/Desktop/makserver/UploadedProjects/<user id>/Payload -F../../Libs -filelist /Users/---/Desktop/makserver/UploadedProjects/<user id>/build/B4iProject.build/Release-iphonesimulator/B4iProject.build/Objects-normal/x86_64/B4i\ Example.LinkFileList -Xlinker -rpath -Xlinker @executable_path/Frameworks -mios-simulator-version-min=7.0 -Xlinker -object_path_lto -Xlinker /Users/---/Desktop/makserver/UploadedProjects/<user id>/build/B4iProject.build/Release-iphonesimulator/B4iProject.build/Objects-normal/x86_64/B4i\ Example_lto.o -Xlinker -no_deduplicate -Xlinker -objc_abi_version -Xlinker 2 -fobjc-arc -fobjc-link-runtime -ObjC -Xlinker -sectcreate -Xlinker __TEXT -Xlinker __entitlements -Xlinker /Users/---/Desktop/makserver/UploadedProjects/<user id>/build/B4iProject.build/Release-iphonesimulator/B4iProject.build/B4i\ Example.app.xcent -lCore -framework Foundation -framework CoreGraphics -framework UIKit -liGoogleMaps -framework AVFoundation -framework CoreData -framework CoreLocation -framework CoreBluetooth -framework Accelerate -framework CoreText -framework GLKit -framework ImageIO -lc++ -licucore -lz -framework OpenGLES -framework QuartzCore -framework SystemConfiguration -framework GoogleMaps -framework GoogleMapsBase -framework GoogleMapsCore -liDebug2 -Xlinker -dependency_info -Xlinker /Users/---/Desktop/makserver/UploadedProjects/<user id>/build/B4iProject.build/Release-iphonesimulator/B4iProject.build/Objects-normal/x86_64/B4i\ Example_dependency_info.dat -o /Users/---/Desktop/makserver/UploadedProjects/<user id>/Payload/B4i\ Example.app/B4i\ Example
ld: warning: object file (../../Libs/libiGoogleMaps.a(B4IGoogleMap.o)) was built for newer iOS version (8.0) than being linked (7.0)
ld: warning: object file (../../Libs/GoogleMapsCore.framework/GoogleMapsCore) was built for newer iOS version (8.0) than being linked (7.0)
ld: warning: object file (../../Libs/GoogleMaps.framework/GoogleMaps) was built for newer iOS version (8.0) than being linked (7.0)
ld: warning: object file (../../Libs/GoogleMapsBase.framework/GoogleMapsBase) was built for newer iOS version (8.0) than being linked (7.0)
Undefined symbols for architecture x86_64:
  "_OBJC_CLASS_$_CTTelephonyNetworkInfo", referenced from:
      objc-class-ref in GoogleMaps
ld: symbol(s) not found for architecture x86_64
clang: error: linker command failed with exit code 1 (use -v to see invocation)


Error: ** BUILD FAILED **


The following build commands failed:
    Ld Payload/B4i\ Example.app/B4i\ Example normal x86_64
(1 failure)
 

azzam223

Active Member
Licensed User
Error Fixed

the problem because i did not copy the frameworks library from the googlemaps.framework to libs Folder

the last error happens because I download last googlemaps.framework ver 2.8 from google but I delete it and copy the library from the link
 
Top