iOS Question Having Issue on Local Mac Builder

Similar threads

B4i Question can't build my app
B4i Question Merging OBJC code
B4i Question [Solved] Local Mac compilation error and iAdmob
B4i Question XCode 11 error
B4i Question Error Build Release App

Keith Yong

Active Member
Licensed User
I'm having issue on Local Mac Builder, but I no issue to run on Hosted Builder

B4X:
B4i Version: 5.51
Parsing code.    (0.10s)
Building folders structure.    (0.81s)
Compiling code.    (0.34s)
Compiling layouts code.    (0.11s)
Compiling debugger engine code.    (2.42s)
Building Xcode project    (0.43s)
Sending data to remote compiler.    Error
B4i line: 161
Log(LastException)
no visible @interface for 'B4ICommon' declares the selector 'LogImpl:::'

Out: Build settings from command line:
    ARCHS = arm64
    CODE_SIGN_IDENTITY = iPhone Distribution: Albatrozz Sdn Bhd (B6QNDRZQHF)
    CONFIGURATION_BUILD_DIR = /Users/Keith/Documents/macserver/UploadedProjects/<user id>/Payload
    OTHER_CODE_SIGN_FLAGS = --keychain <user id>
    PRODUCT_NAME = MGA NHS
    PROVISIONING_PROFILE = 782f8169-3450-434d-81f8-0b5524e354ea

note: Using new build system
note: Planning build
note: Constructing build description
CreateBuildDirectory /Users/Keith/Documents/macserver/UploadedProjects/<user id>/build (in target: B4iProject)
    cd /Users/Keith/Documents/macserver/UploadedProjects/<user id>
    builtin-create-build-directory /Users/Keith/Documents/macserver/UploadedProjects/<user id>/build

MkDir /Users/Keith/Documents/macserver/UploadedProjects/<user id>/Payload/MGA\ NHS.app (in target: B4iProject)
    cd /Users/Keith/Documents/macserver/UploadedProjects/<user id>
    /bin/mkdir -p /Users/Keith/Documents/macserver/UploadedProjects/<user id>/Payload/MGA\ NHS.app

ProcessProductPackaging /Users/Keith/Library/MobileDevice/Provisioning\ Profiles/782f8169-3450-434d-81f8-0b5524e354ea.mobileprovision /Users/Keith/Documents/macserver/UploadedProjects/<user id>/Payload/MGA\ NHS.app/embedded.mobileprovision (in target: B4iProject)
    cd /Users/Keith/Documents/macserver/UploadedProjects/<user id>
    builtin-productPackagingUtility /Users/Keith/Library/MobileDevice/Provisioning\ Profiles/782f8169-3450-434d-81f8-0b5524e354ea.mobileprovision -o /Users/Keith/Documents/macserver/UploadedProjects/<user id>/Payload/MGA\ NHS.app/embedded.mobileprovision

WriteAuxiliaryFile /Users/Keith/Documents/macserver/UploadedProjects/<user id>/build/B4iProject.build/Release-iphoneos/B4iProject.build/DerivedSources/Entitlements.plist (in target: B4iProject)
    cd /Users/Keith/Documents/macserver/UploadedProjects/<user id>
    write-file /Users/Keith/Documents/macserver/UploadedProjects/<user id>/build/B4iProject.build/Release-iphoneos/B4iProject.build/DerivedSources/Entitlements.plist

ProcessProductPackaging "" /Users/Keith/Documents/macserver/UploadedProjects/<user id>/build/B4iProject.build/Release-iphoneos/B4iProject.build/MGA\ NHS.app.xcent (in target: B4iProject)
    cd /Users/Keith/Documents/macserver/UploadedProjects/<user id>
    

Entitlements:

{
    "application-identifier" = "B6QNDRZQHF.com.b4i.acegolf";
    "com.apple.developer.team-identifier" = B6QNDRZQHF;
    "get-task-allow" = 0;
}


    builtin-productPackagingUtility -entitlements -format xml -o /Users/Keith/Documents/macserver/UploadedProjects/<user id>/build/B4iProject.build/Release-iphoneos/B4iProject.build/MGA\ NHS.app.xcent

WriteAuxiliaryFile /Users/Keith/Documents/macserver/UploadedProjects/<user id>/build/B4iProject.build/Release-iphoneos/B4iProject.build/all-product-headers.yaml (in target: B4iProject)
    cd /Users/Keith/Documents/macserver/UploadedProjects/<user id>
    write-file /Users/Keith/Documents/macserver/UploadedProjects/<user id>/build/B4iProject.build/Release-iphoneos/B4iProject.build/all-product-headers.yaml

WriteAuxiliaryFile /Users/Keith/Documents/macserver/UploadedProjects/<user id>/build/B4iProject.build/Release-iphoneos/B4iProject.build/MGA\ NHS.hmap (in target: B4iProject)
    cd /Users/Keith/Documents/macserver/UploadedProjects/<user id>
    write-file /Users/Keith/Documents/macserver/UploadedProjects/<user id>/build/B4iProject.build/Release-iphoneos/B4iProject.build/MGA\ NHS.hmap

WriteAuxiliaryFile /Users/Keith/Documents/macserver/UploadedProjects/<user id>/build/B4iProject.build/Release-iphoneos/B4iProject.build/MGA\ NHS-project-headers.hmap (in target: B4iProject)
    cd /Users/Keith/Documents/macserver/UploadedProjects/<user id>
    write-file /Users/Keith/Documents/macserver/UploadedProjects/<user id>/build/B4iProject.build/Release-iphoneos/B4iProject.build/MGA\ NHS-project-headers.hmap

WriteAuxiliaryFile /Users/Keith/Documents/macserver/UploadedProjects/<user id>/build/B4iProject.build/Release-iphoneos/B4iProject.build/MGA\ NHS-own-target-headers.hmap (in target: B4iProject)
    cd /Users/Keith/Documents/macserver/UploadedProjects/<user id>
    write-file /Users/Keith/Documents/macserver/UploadedProjects/<user id>/build/B4iProject.build/Release-iphoneos/B4iProject.build/MGA\ NHS-own-target-headers.hmap

WriteAuxiliaryFile /Users/Keith/Documents/macserver/UploadedProjects/<user id>/build/B4iProject.build/Release-iphoneos/B4iProject.build/MGA\ NHS-generated-files.hmap (in target: B4iProject)
    cd /Users/Keith/Documents/macserver/UploadedProjects/<user id>
    write-file /Users/Keith/Documents/macserver/UploadedProjects/<user id>/build/B4iProject.build/Release-iphoneos/B4iProject.build/MGA\ NHS-generated-files.hmap

WriteAuxiliaryFile /Users/Keith/Documents/macserver/UploadedProjects/<user id>/build/B4iProject.build/Release-iphoneos/B4iProject.build/MGA\ NHS-all-target-headers.hmap (in target: B4iProject)
    cd /Users/Keith/Documents/macserver/UploadedProjects/<user id>
    write-file /Users/Keith/Documents/macserver/UploadedProjects/<user id>/build/B4iProject.build/Release-iphoneos/B4iProject.build/MGA\ NHS-all-target-headers.hmap

WriteAuxiliaryFile /Users/Keith/Documents/macserver/UploadedProjects/<user id>/build/B4iProject.build/Release-iphoneos/B4iProject.build/MGA\ NHS-all-non-framework-target-headers.hmap (in target: B4iProject)
    cd /Users/Keith/Documents/macserver/UploadedProjects/<user id>
    write-file /Users/Keith/Documents/macserver/UploadedProjects/<user id>/build/B4iProject.build/Release-iphoneos/B4iProject.build/MGA\ NHS-all-non-framework-target-headers.hmap

CompileC /Users/Keith/Documents/macserver/UploadedProjects/<user id>/build/B4iProject.build/Release-iphoneos/B4iProject.build/Objects-normal/arm64/b4i_webview.o /Users/Keith/Documents/macserver/UploadedProjects/<user id>/B4iProject/b4i_webview.m normal arm64 objective-c com.apple.compilers.llvm.clang.1_0.compiler (in target: B4iProject)
    cd /Users/Keith/Documents/macserver/UploadedProjects/<user id>
    export LANG=en_US.US-ASCII
    /Applications/Xcode.app/Contents/Developer/Toolchains/XcodeDefault.xctoolchain/usr/bin/clang -x objective-c -arch arm64 -fmessage-length=0 -fdiagnostics-show-note-include-stack -fmacro-backtrace-limit=0 -std=gnu99 -fobjc-arc -fmodules -gmodules -fmodules-prune-interval=86400 -fmodules-prune-after=345600 -fbuild-session-file=/var/folders/mw/zf5ysbj56438692_3rmvwq780000gn/C/org.llvm.clang/ModuleCache.noindex/Session.modulevalidation -fmodules-validate-once-per-build-session -Wnon-modular-include-in-framework-module -Werror=non-modular-include-in-framework-module -Wno-trigraphs -fpascal-strings -O0 -Wno-missing-field-initializers -Wno-missing-prototypes -Werror=return-type -Wno-implicit-atomic-properties -Werror=deprecated-objc-isa-usage -Wno-objc-interface-ivars -Werror=objc-root-class -Wno-arc-repeated-use-of-weak -Wduplicate-method-match -Wno-missing-braces -Wparentheses -Wswitch -Wunused-function -Wno-unused-label -Wno-unused-parameter -Wunused-variable -Wunused-value -Wempty-body -Wuninitialized -Wconditional-uninitialized -Wno-unknown-pragmas -Wno-shadow -Wno-four-char-constants -Wno-conversion -Wconstant-conversion -Wint-conversion -Wbool-conversion -Wenum-conversion -Wno-float-conversion -Wno-non-literal-null-conversion -Wno-objc-literal-conversion -Wshorten-64-to-32 -Wpointer-sign -Wno-newline-eof -Wno-selector -Wno-strict-selector-match -Wundeclared-selector -Wno-deprecated-implementations -DB4I_VERSION=11 -DNS_BLOCK_ASSERTIONS=1 -DOBJC_OLD_DISPATCH_PROTOTYPES=1 -isysroot /Applications/Xcode.app/Contents/Developer/Platforms/iPhoneOS.platform/Developer/SDKs/iPhoneOS12.1.sdk -fstrict-aliasing -Wprotocol -Wdeprecated-declarations -miphoneos-version-min=8.0 -fvisibility=hidden -Wno-sign-conversion -Wno-infinite-recursion -Wno-comma -Wno-block-capture-autoreleasing -Wno-strict-prototypes -Wno-semicolon-before-method-body -iquote /Users/Keith/Documents/macserver/UploadedProjects/<user id>/build/B4iProject.build/Release-iphoneos/B4iProject.build/MGA\ NHS-generated-files.hmap -I/Users/Keith/Documents/macserver/UploadedProjects/<user id>/build/B4iProject.build/Release-iphoneos/B4iProject.build/MGA\ NHS-own-target-headers.hmap -I/Users/Keith/Documents/macserver/UploadedProjects/<user id>/build/B4iProject.build/Release-iphoneos/B4iProject.build/MGA\ NHS-all-target-headers.hmap -iquote /Users/Keith/Documents/macserver/UploadedProjects/<user id>/build/B4iProject.build/Release-iphoneos/B4iProject.build/MGA\ NHS-project-headers.hmap -I/Users/Keith/Documents/macserver/UploadedProjects/<user id>/Payload/include -I/Users/Keith/Documents/macserver/UploadedProjects/<user id>/build/B4iProject.build/Release-iphoneos/B4iProject.build/DerivedSources/arm64 -I/Users/Keith/Documents/macserver/UploadedProjects/<user id>/build/B4iProject.build/Release-iphoneos/B4iProject.build/DerivedSources -F/Users/Keith/Documents/macserver/UploadedProjects/<user id>/Payload -F../../Libs -MMD -MT dependencies -MF /Users/Keith/Documents/macserver/UploadedProjects/<user id>/build/B4iProject.build/Release-iphoneos/B4iProject.build/Objects-normal/arm64/b4i_webview.d --serialize-diagnostics /Users/Keith/Documents/macserver/UploadedProjects/<user id>/build/B4iProject.build/Release-iphoneos/B4iProject.build/Objects-normal/arm64/b4i_webview.dia -c /Users/Keith/Documents/macserver/UploadedProjects/<user id>/B4iProject/b4i_webview.m -o /Users/Keith/Documents/macserver/UploadedProjects/<user id>/build/B4iProject.build/Release-iphoneos/B4iProject.build/Objects-normal/arm64/b4i_webview.o

CompileC /Users/Keith/Documents/macserver/UploadedProjects/<user id>/build/B4iProject.build/Release-iphoneos/B4iProject.build/Objects-normal/arm64/main.o /Users/Keith/Documents/macserver/UploadedProjects/<user id>/B4iProject/main.m normal arm64 objective-c com.apple.compilers.llvm.clang.1_0.compiler (in target: B4iProject)
    cd /Users/Keith/Documents/macserver/UploadedProjects/<user id>
    export LANG=en_US.US-ASCII
    /Applications/Xcode.app/Contents/Developer/Toolchains/XcodeDefault.xctoolchain/usr/bin/clang -x objective-c -arch arm64 -fmessage-length=0 -fdiagnostics-show-note-include-stack -fmacro-backtrace-limit=0 -std=gnu99 -fobjc-arc -fmodules -gmodules -fmodules-prune-interval=86400 -fmodules-prune-after=345600 -fbuild-session-file=/var/folders/mw/zf5ysbj56438692_3rmvwq780000gn/C/org.llvm.clang/ModuleCache.noindex/Session.modulevalidation -fmodules-validate-once-per-build-session -Wnon-modular-include-in-framework-module -Werror=non-modular-include-in-framework-module -Wno-trigraphs -fpascal-strings -O0 -Wno-missing-field-initializers -Wno-missing-prototypes -Werror=return-type -Wno-implicit-atomic-properties -Werror=deprecated-objc-isa-usage -Wno-objc-interface-ivars -Werror=objc-root-class -Wno-arc-repeated-use-of-weak -Wduplicate-method-match -Wno-missing-braces -Wparentheses -Wswitch -Wunused-function -Wno-unused-label -Wno-unused-parameter -Wunused-variable -Wunused-value -Wempty-body -Wuninitialized -Wconditional-uninitialized -Wno-unknown-pragmas -Wno-shadow -Wno-four-char-constants -Wno-conversion -Wconstant-conversion -Wint-conversion -Wbool-conversion -Wenum-conversion -Wno-float-conversion -Wno-non-literal-null-conversion -Wno-objc-literal-conversion -Wshorten-64-to-32 -Wpointer-sign -Wno-newline-eof -Wno-selector -Wno-strict-selector-match -Wundeclared-selector -Wno-deprecated-implementations -DB4I_VERSION=11 -DNS_BLOCK_ASSERTIONS=1 -DOBJC_OLD_DISPATCH_PROTOTYPES=1 -isysroot /Applications/Xcode.app/Contents/Developer/Platforms/iPhoneOS.platform/Developer/SDKs/iPhoneOS12.1.sdk -fstrict-aliasing -Wprotocol -Wdeprecated-declarations -miphoneos-version-min=8.0 -fvisibility=hidden -Wno-sign-conversion -Wno-infinite-recursion -Wno-comma -Wno-block-capture-autoreleasing -Wno-strict-prototypes -Wno-semicolon-before-method-body -iquote /Users/Keith/Documents/macserver/UploadedProjects/<user id>/build/B4iProject.build/Release-iphoneos/B4iProject.build/MGA\ NHS-generated-files.hmap -I/Users/Keith/Documents/macserver/UploadedProjects/<user id>/build/B4iProject.build/Release-iphoneos/B4iProject.build/MGA\ NHS-own-target-headers.hmap -I/Users/Keith/Documents/macserver/UploadedProjects/<user id>/build/B4iProject.build/Release-iphoneos/B4iProject.build/MGA\ NHS-all-target-headers.hmap -iquote /Users/Keith/Documents/macserver/UploadedProjects/<user id>/build/B4iProject.build/Release-iphoneos/B4iProject.build/MGA\ NHS-project-headers.hmap -I/Users/Keith/Documents/macserver/UploadedProjects/<user id>/Payload/include -I/Users/Keith/Documents/macserver/UploadedProjects/<user id>/build/B4iProject.build/Release-iphoneos/B4iProject.build/DerivedSources/arm64 -I/Users/Keith/Documents/macserver/UploadedProjects/<user id>/build/B4iProject.build/Release-iphoneos/B4iProject.build/DerivedSources -F/Users/Keith/Documents/macserver/UploadedProjects/<user id>/Payload -F../../Libs -MMD -MT dependencies -MF /Users/Keith/Documents/macserver/UploadedProjects/<user id>/build/B4iProject.build/Release-iphoneos/B4iProject.build/Objects-normal/arm64/main.d --serialize-diagnostics /Users/Keith/Documents/macserver/UploadedProjects/<user id>/build/B4iProject.build/Release-iphoneos/B4iProject.build/Objects-normal/arm64/main.dia -c /Users/Keith/Documents/macserver/UploadedProjects/<user id>/B4iProject/main.m -o /Users/Keith/Documents/macserver/UploadedProjects/<user id>/build/B4iProject.build/Release-iphoneos/B4iProject.build/Objects-normal/arm64/main.o

WriteAuxiliaryFile /Users/Keith/Documents/macserver/UploadedProjects/<user id>/build/B4iProject.build/Release-iphoneos/B4iProject.build/Objects-normal/arm64/MGA\ NHS.LinkFileList (in target: B4iProject)
    cd /Users/Keith/Documents/macserver/UploadedProjects/<user id>
    write-file /Users/Keith/Documents/macserver/UploadedProjects/<user id>/build/B4iProject.build/Release-iphoneos/B4iProject.build/Objects-normal/arm64/MGA\ NHS.LinkFileList

CompileC /Users/Keith/Documents/macserver/UploadedProjects/<user id>/build/B4iProject.build/Release-iphoneos/B4iProject.build/Objects-normal/arm64/b4i_scanqr.o /Users/Keith/Documents/macserver/UploadedProjects/<user id>/B4iProject/b4i_scanqr.m normal arm64 objective-c com.apple.compilers.llvm.clang.1_0.compiler (in target: B4iProject)
    cd /Users/Keith/Documents/macserver/UploadedProjects/<user id>
    export LANG=en_US.US-ASCII
    /Applications/Xcode.app/Contents/Developer/Toolchains/XcodeDefault.xctoolchain/usr/bin/clang -x objective-c -arch arm64 -fmessage-length=0 -fdiagnostics-show-note-include-stack -fmacro-backtrace-limit=0 -std=gnu99 -fobjc-arc -fmodules -gmodules -fmodules-prune-interval=86400 -fmodules-prune-after=345600 -fbuild-session-file=/var/folders/mw/zf5ysbj56438692_3rmvwq780000gn/C/org.llvm.clang/ModuleCache.noindex/Session.modulevalidation -fmodules-validate-once-per-build-session -Wnon-modular-include-in-framework-module -Werror=non-modular-include-in-framework-module -Wno-trigraphs -fpascal-strings -O0 -Wno-missing-field-initializers -Wno-missing-prototypes -Werror=return-type -Wno-implicit-atomic-properties -Werror=deprecated-objc-isa-usage -Wno-objc-interface-ivars -Werror=objc-root-class -Wno-arc-repeated-use-of-weak -Wduplicate-method-match -Wno-missing-braces -Wparentheses -Wswitch -Wunused-function -Wno-unused-label -Wno-unused-parameter -Wunused-variable -Wunused-value -Wempty-body -Wuninitialized -Wconditional-uninitialized -Wno-unknown-pragmas -Wno-shadow -Wno-four-char-constants -Wno-conversion -Wconstant-conversion -Wint-conversion -Wbool-conversion -Wenum-conversion -Wno-float-conversion -Wno-non-literal-null-conversion -Wno-objc-literal-conversion -Wshorten-64-to-32 -Wpointer-sign -Wno-newline-eof -Wno-selector -Wno-strict-selector-match -Wundeclared-selector -Wno-deprecated-implementations -DB4I_VERSION=11 -DNS_BLOCK_ASSERTIONS=1 -DOBJC_OLD_DISPATCH_PROTOTYPES=1 -isysroot /Applications/Xcode.app/Contents/Developer/Platforms/iPhoneOS.platform/Developer/SDKs/iPhoneOS12.1.sdk -fstrict-aliasing -Wprotocol -Wdeprecated-declarations -miphoneos-version-min=8.0 -fvisibility=hidden -Wno-sign-conversion -Wno-infinite-recursion -Wno-comma -Wno-block-capture-autoreleasing -Wno-strict-prototypes -Wno-semicolon-before-method-body -iquote /Users/Keith/Documents/macserver/UploadedProjects/<user id>/build/B4iProject.build/Release-iphoneos/B4iProject.build/MGA\ NHS-generated-files.hmap -I/Users/Keith/Documents/macserver/UploadedProjects/<user id>/build/B4iProject.build/Release-iphoneos/B4iProject.build/MGA\ NHS-own-target-headers.hmap -I/Users/Keith/Documents/macserver/UploadedProjects/<user id>/build/B4iProject.build/Release-iphoneos/B4iProject.build/MGA\ NHS-all-target-headers.hmap -iquote /Users/Keith/Documents/macserver/UploadedProjects/<user id>/build/B4iProject.build/Release-iphoneos/B4iProject.build/MGA\ NHS-project-headers.hmap -I/Users/Keith/Documents/macserver/UploadedProjects/<user id>/Payload/include -I/Users/Keith/Documents/macserver/UploadedProjects/<user id>/build/B4iProject.build/Release-iphoneos/B4iProject.build/DerivedSources/arm64 -I/Users/Keith/Documents/macserver/UploadedProjects/<user id>/build/B4iProject.build/Release-iphoneos/B4iProject.build/DerivedSources -F/Users/Keith/Documents/macserver/UploadedProjects/<user id>/Payload -F../../Libs -MMD -MT dependencies -MF /Users/Keith/Documents/macserver/UploadedProjects/<user id>/build/B4iProject.build/Release-iphoneos/B4iProject.build/Objects-normal/arm64/b4i_scanqr.d --serialize-diagnostics /Users/Keith/Documents/macserver/UploadedProjects/<user id>/build/B4iProject.build/Release-iphoneos/B4iProject.build/Objects-normal/arm64/b4i_scanqr.dia -c /Users/Keith/Documents/macserver/UploadedProjects/<user id>/B4iProject/b4i_scanqr.m -o /Users/Keith/Documents/macserver/UploadedProjects/<user id>/build/B4iProject.build/Release-iphoneos/B4iProject.build/Objects-normal/arm64/b4i_scanqr.o
/Users/Keith/Documents/macserver/UploadedProjects/<user id>/B4iProject/b4i_scanqr.m:268:13: error: no visible @interface for 'B4ICommon' declares the selector 'LogImpl:::'
[self->___c LogImpl:@"35111840" :[self.bi ObjectToString:[self->___c LastException]] :0];
 ~~~~~~~~~~ ^~~~~~~~~~~~~~~~~~~~~~~~~~~~~~~~~~~~~~~~~~~~~~~~~~~~~~~~~~~~~~~~~~~~~~~~~~
1 error generated.

CompileC /Users/Keith/Documents/macserver/UploadedProjects/<user id>/build/B4iProject.build/Release-iphoneos/B4iProject.build/Objects-normal/arm64/b4i_registerstep2.o /Users/Keith/Documents/macserver/UploadedProjects/<user id>/B4iProject/b4i_registerstep2.m normal arm64 objective-c com.apple.compilers.llvm.clang.1_0.compiler (in target: B4iProject)
    cd /Users/Keith/Documents/macserver/UploadedProjects/<user id>
    export LANG=en_US.US-ASCII
    /Applications/Xcode.app/Contents/Developer/Toolchains/XcodeDefault.xctoolchain/usr/bin/clang -x objective-c -arch arm64 -fmessage-length=0 -fdiagnostics-show-note-include-stack -fmacro-backtrace-limit=0 -std=gnu99 -fobjc-arc -fmodules -gmodules -fmodules-prune-interval=86400 -fmodules-prune-after=345600 -fbuild-session-file=/var/folders/mw/zf5ysbj56438692_3rmvwq780000gn/C/org.llvm.clang/ModuleCache.noindex/Session.modulevalidation -fmodules-validate-once-per-build-session -Wnon-modular-include-in-framework-module -Werror=non-modular-include-in-framework-module -Wno-trigraphs -fpascal-strings -O0 -Wno-missing-field-initializers -Wno-missing-prototypes -Werror=return-type -Wno-implicit-atomic-properties -Werror=deprecated-objc-isa-usage -Wno-objc-interface-ivars -Werror=objc-root-class -Wno-arc-repeated-use-of-weak -Wduplicate-method-match -Wno-missing-braces -Wparentheses -Wswitch -Wunused-function -Wno-unused-label -Wno-unused-parameter -Wunused-variable -Wunused-value -Wempty-body -Wuninitialized -Wconditional-uninitialized -Wno-unknown-pragmas -Wno-shadow -Wno-four-char-constants -Wno-conversion -Wconstant-conversion -Wint-conversion -Wbool-conversion -Wenum-conversion -Wno-float-conversion -Wno-non-literal-null-conversion -Wno-objc-literal-conversion -Wshorten-64-to-32 -Wpointer-sign -Wno-newline-eof -Wno-selector -Wno-strict-selector-match -Wundeclared-selector -Wno-deprecated-implementations -DB4I_VERSION=11 -DNS_BLOCK_ASSERTIONS=1 -DOBJC_OLD_DISPATCH_PROTOTYPES=1 -isysroot /Applications/Xcode.app/Contents/Developer/Platforms/iPhoneOS.platform/Developer/SDKs/iPhoneOS12.1.sdk -fstrict-aliasing -Wprotocol -Wdeprecated-declarations -miphoneos-version-min=8.0 -fvisibility=hidden -Wno-sign-conversion -Wno-infinite-recursion -Wno-comma -Wno-block-capture-autoreleasing -Wno-strict-prototypes -Wno-semicolon-before-method-body -iquote /Users/Keith/Documents/macserver/UploadedProjects/<user id>/build/B4iProject.build/Release-iphoneos/B4iProject.build/MGA\ NHS-generated-files.hmap -I/Users/Keith/Documents/macserver/UploadedProjects/<user id>/build/B4iProject.build/Release-iphoneos/B4iProject.build/MGA\ NHS-own-target-headers.hmap -I/Users/Keith/Documents/macserver/UploadedProjects/<user id>/build/B4iProject.build/Release-iphoneos/B4iProject.build/MGA\ NHS-all-target-headers.hmap -iquote /Users/Keith/Documents/macserver/UploadedProjects/<user id>/build/B4iProject.build/Release-iphoneos/B4iProject.build/MGA\ NHS-project-headers.hmap -I/Users/Keith/Documents/macserver/UploadedProjects/<user id>/Payload/include -I/Users/Keith/Documents/macserver/UploadedProjects/<user id>/build/B4iProject.build/Release-iphoneos/B4iProject.build/DerivedSources/arm64 -I/Users/Keith/Documents/macserver/UploadedProjects/<user id>/build/B4iProject.build/Release-iphoneos/B4iProject.build/DerivedSources -F/Users/Keith/Documents/macserver/UploadedProjects/<user id>/Payload -F../../Libs -MMD -MT dependencies -MF /Users/Keith/Documents/macserver/UploadedProjects/<user id>/build/B4iProject.build/Release-iphoneos/B4iProject.build/Objects-normal/arm64/b4i_registerstep2.d --serialize-diagnostics /Users/Keith/Documents/macserver/UploadedProjects/<user id>/build/B4iProject.build/Release-iphoneos/B4iProject.build/Objects-normal/arm64/b4i_registerstep2.dia -c /Users/Keith/Documents/macserver/UploadedProjects/<user id>/B4iProject/b4i_registerstep2.m -o /Users/Keith/Documents/macserver/UploadedProjects/<user id>/build/B4iProject.build/Release-iphoneos/B4iProject.build/Objects-normal/arm64/b4i_registerstep2.o
/Users/Keith/Documents/macserver/UploadedProjects/<user id>/B4iProject/b4i_registerstep2.m:287:13: error: no visible @interface for 'B4ICommon' declares the selector 'LogImpl:::'
[self->___c LogImpl:@"38192024" :[self.bi ObjectToString:[self->___c LastException]] :0];
 ~~~~~~~~~~ ^~~~~~~~~~~~~~~~~~~~~~~~~~~~~~~~~~~~~~~~~~~~~~~~~~~~~~~~~~~~~~~~~~~~~~~~~~
1 error generated.


Error: 2019-03-25 13:30:40.950 xcodebuild[12411:1484325]  DVTProvisioningProfileManager: Failed to load profile "/Users/Keith/Library/MobileDevice/Provisioning Profiles/a2d9b1b6-6421-4e08-ac0f-27620c47d3df" (Error Domain=DVTProvisioningProfileSourceErrorDomain Code=0 "No provisioning profile provider found for profile "/Users/Keith/Library/MobileDevice/Provisioning Profiles/a2d9b1b6-6421-4e08-ac0f-27620c47d3df"." UserInfo={NSLocalizedDescription=No provisioning profile provider found for profile "/Users/Keith/Library/MobileDevice/Provisioning Profiles/a2d9b1b6-6421-4e08-ac0f-27620c47d3df".})
2019-03-25 13:30:40.950 xcodebuild[12411:1484325]  DVTProvisioningProfileManager: Failed to load profile "/Users/Keith/Library/MobileDevice/Provisioning Profiles/2188c0eb-54d0-4976-8f5f-4a41c7a9da76" (Error Domain=DVTProvisioningProfileSourceErrorDomain Code=0 "No provisioning profile provider found for profile "/Users/Keith/Library/MobileDevice/Provisioning Profiles/2188c0eb-54d0-4976-8f5f-4a41c7a9da76"." UserInfo={NSLocalizedDescription=No provisioning profile provider found for profile "/Users/Keith/Library/MobileDevice/Provisioning Profiles/2188c0eb-54d0-4976-8f5f-4a41c7a9da76".})
2019-03-25 13:30:40.951 xcodebuild[12411:1484248]  DVTProvisioningProfileManager: Failed to load profile "/Users/Keith/Library/MobileDevice/Provisioning Profiles/8b5d586c-5bb9-4f12-a05a-e264825a60e6" (Error Domain=DVTProvisioningProfileSourceErrorDomain Code=0 "No provisioning profile provider found for profile "/Users/Keith/Library/MobileDevice/Provisioning Profiles/8b5d586c-5bb9-4f12-a05a-e264825a60e6"." UserInfo={NSLocalizedDescription=No provisioning profile provider found for profile "/Users/Keith/Library/MobileDevice/Provisioning Profiles/8b5d586c-5bb9-4f12-a05a-e264825a60e6".})
2019-03-25 13:30:40.951 xcodebuild[12411:1484248]  DVTProvisioningProfileManager: Failed to load profile "/Users/Keith/Library/MobileDevice/Provisioning Profiles/93d62b0a-82ea-4dcf-a4e5-657f191be85d" (Error Domain=DVTProvisioningProfileSourceErrorDomain Code=0 "No provisioning profile provider found for profile "/Users/Keith/Library/MobileDevice/Provisioning Profiles/93d62b0a-82ea-4dcf-a4e5-657f191be85d"." UserInfo={NSLocalizedDescription=No provisioning profile provider found for profile "/Users/Keith/Library/MobileDevice/Provisioning Profiles/93d62b0a-82ea-4dcf-a4e5-657f191be85d".})
2019-03-25 13:30:40.951 xcodebuild[12411:1484248]  DVTProvisioningProfileManager: Failed to load profile "/Users/Keith/Library/MobileDevice/Provisioning Profiles/b09b5f91-960b-4d7c-a837-c675c41d875d" (Error Domain=DVTProvisioningProfileSourceErrorDomain Code=0 "No provisioning profile provider found for profile "/Users/Keith/Library/MobileDevice/Provisioning Profiles/b09b5f91-960b-4d7c-a837-c675c41d875d"." UserInfo={NSLocalizedDescription=No provisioning profile provider found for profile "/Users/Keith/Library/MobileDevice/Provisioning Profiles/b09b5f91-960b-4d7c-a837-c675c41d875d".})
2019-03-25 13:30:40.951 xcodebuild[12411:1484248]  DVTProvisioningProfileManager: Failed to load profile "/Users/Keith/Library/MobileDevice/Provisioning Profiles/dda3c8ba-62c2-4987-9f31-dba1799ceb5b" (Error Domain=DVTProvisioningProfileSourceErrorDomain Code=0 "No provisioning profile provider found for profile "/Users/Keith/Library/MobileDevice/Provisioning Profiles/dda3c8ba-62c2-4987-9f31-dba1799ceb5b"." UserInfo={NSLocalizedDescription=No provisioning profile provider found for profile "/Users/Keith/Library/MobileDevice/Provisioning Profiles/dda3c8ba-62c2-4987-9f31-dba1799ceb5b".})
2019-03-25 13:30:40.951 xcodebuild[12411:1484248]  DVTProvisioningProfileManager: Failed to load profile "/Users/Keith/Library/MobileDevice/Provisioning Profiles/cae88279-7125-469f-b503-29cdf40e51dd" (Error Domain=DVTProvisioningProfileSourceErrorDomain Code=0 "No provisioning profile provider found for profile "/Users/Keith/Library/MobileDevice/Provisioning Profiles/cae88279-7125-469f-b503-29cdf40e51dd"." UserInfo={NSLocalizedDescription=No provisioning profile provider found for profile "/Users/Keith/Library/MobileDevice/Provisioning Profiles/cae88279-7125-469f-b503-29cdf40e51dd".})
2019-03-25 13:30:40.951 xcodebuild[12411:1484316]  DVTProvisioningProfileManager: Failed to load profile "/Users/Keith/Library/MobileDevice/Provisioning Profiles/ad24541d-0ecc-4a29-a771-ad3d3df7e226" (Error Domain=DVTProvisioningProfileSourceErrorDomain Code=0 "No provisioning profile provider found for profile "/Users/Keith/Library/MobileDevice/Provisioning Profiles/ad24541d-0ecc-4a29-a771-ad3d3df7e226"." UserInfo={NSLocalizedDescription=No provisioning profile provider found for profile "/Users/Keith/Library/MobileDevice/Provisioning Profiles/ad24541d-0ecc-4a29-a771-ad3d3df7e226".})
2019-03-25 13:30:40.951 xcodebuild[12411:1484316]  DVTProvisioningProfileManager: Failed to load profile "/Users/Keith/Library/MobileDevice/Provisioning Profiles/4d0ef2a6-c689-4753-88d0-4e36c8205f5b" (Error Domain=DVTProvisioningProfileSourceErrorDomain Code=0 "No provisioning profile provider found for profile "/Users/Keith/Library/MobileDevice/Provisioning Profiles/4d0ef2a6-c689-4753-88d0-4e36c8205f5b"." UserInfo={NSLocalizedDescription=No provisioning profile provider found for profile "/Users/Keith/Library/MobileDevice/Provisioning Profiles/4d0ef2a6-c689-4753-88d0-4e36c8205f5b".})
2019-03-25 13:30:40.951 xcodebuild[12411:1484316]  DVTProvisioningProfileManager: Failed to load profile "/Users/Keith/Library/MobileDevice/Provisioning Profiles/ba91f5aa-56b1-4334-809a-ef6deb02edab" (Error Domain=DVTProvisioningProfileSourceErrorDomain Code=0 "No provisioning profile provider found for profile "/Users/Keith/Library/MobileDevice/Provisioning Profiles/ba91f5aa-56b1-4334-809a-ef6deb02edab"." UserInfo={NSLocalizedDescription=No provisioning profile provider found for profile "/Users/Keith/Library/MobileDevice/Provisioning Profiles/ba91f5aa-56b1-4334-809a-ef6deb02edab".})
2019-03-25 13:30:40.951 xcodebuild[12411:1484316]  DVTProvisioningProfileManager: Failed to load profile "/Users/Keith/Library/MobileDevice/Provisioning Profiles/2782f43a-7150-4400-8793-86d151e46b0a" (Error Domain=DVTProvisioningProfileSourceErrorDomain Code=0 "No provisioning profile provider found for profile "/Users/Keith/Library/MobileDevice/Provisioning Profiles/2782f43a-7150-4400-8793-86d151e46b0a"." UserInfo={NSLocalizedDescription=No provisioning profile provider found for profile "/Users/Keith/Library/MobileDevice/Provisioning Profiles/2782f43a-7150-4400-8793-86d151e46b0a".})
2019-03-25 13:30:40.959 xcodebuild[12411:1484248]  DVTProvisioningProfileManager: Failed to load profile "/Users/Keith/Library/MobileDevice/Provisioning Profiles/c5801b64-b8f3-4c39-b02c-76e46ee5b3d3" (Error Domain=DVTProvisioningProfileSourceErrorDomain Code=0 "No provisioning profile provider found for profile "/Users/Keith/Library/MobileDevice/Provisioning Profiles/c5801b64-b8f3-4c39-b02c-76e46ee5b3d3"." UserInfo={NSLocalizedDescription=No provisioning profile provider found for profile "/Users/Keith/Library/MobileDevice/Provisioning Profiles/c5801b64-b8f3-4c39-b02c-76e46ee5b3d3".})
2019-03-25 13:30:40.959 xcodebuild[12411:1484248]  DVTProvisioningProfileManager: Failed to load profile "/Users/Keith/Library/MobileDevice/Provisioning Profiles/c646a0fd-b252-42c6-b3be-baf9d63ad10b" (Error Domain=DVTProvisioningProfileSourceErrorDomain Code=0 "No provisioning profile provider found for profile "/Users/Keith/Library/MobileDevice/Provisioning Profiles/c646a0fd-b252-42c6-b3be-baf9d63ad10b"." UserInfo={NSLocalizedDescription=No provisioning profile provider found for profile "/Users/Keith/Library/MobileDevice/Provisioning Profiles/c646a0fd-b252-42c6-b3be-baf9d63ad10b".})
2019-03-25 13:30:40.961 xcodebuild[12411:1484325]  DVTProvisioningProfileManager: Failed to load profile "/Users/Keith/Library/MobileDevice/Provisioning Profiles/fe7c552e-a128-409f-b776-b636a39904ae" (Error Domain=DVTProvisioningProfileSourceErrorDomain Code=0 "No provisioning profile provider found for profile "/Users/Keith/Library/MobileDevice/Provisioning Profiles/fe7c552e-a128-409f-b776-b636a39904ae"." UserInfo={NSLocalizedDescription=No provisioning profile provider found for profile "/Users/Keith/Library/MobileDevice/Provisioning Profiles/fe7c552e-a128-409f-b776-b636a39904ae".})
2019-03-25 13:30:40.961 xcodebuild[12411:1484325]  DVTProvisioningProfileManager: Failed to load profile "/Users/Keith/Library/MobileDevice/Provisioning Profiles/4af00ab7-ee2e-458b-859b-f4b82a7966ae" (Error Domain=DVTProvisioningProfileSourceErrorDomain Code=0 "No provisioning profile provider found for profile "/Users/Keith/Library/MobileDevice/Provisioning Profiles/4af00ab7-ee2e-458b-859b-f4b82a7966ae"." UserInfo={NSLocalizedDescription=No provisioning profile provider found for profile "/Users/Keith/Library/MobileDevice/Provisioning Profiles/4af00ab7-ee2e-458b-859b-f4b82a7966ae".})
2019-03-25 13:30:40.962 xcodebuild[12411:1484248]  DVTProvisioningProfileManager: Failed to load profile "/Users/Keith/Library/MobileDevice/Provisioning Profiles/351da7a8-b8ef-4d46-9e47-30c6ee3a0b53" (Error Domain=DVTProvisioningProfileSourceErrorDomain Code=0 "No provisioning profile provider found for profile "/Users/Keith/Library/MobileDevice/Provisioning Profiles/351da7a8-b8ef-4d46-9e47-30c6ee3a0b53"." UserInfo={NSLocalizedDescription=No provisioning profile provider found for profile "/Users/Keith/Library/MobileDevice/Provisioning Profiles/351da7a8-b8ef-4d46-9e47-30c6ee3a0b53".})
2019-03-25 13:30:40.962 xcodebuild[12411:1484248]  DVTProvisioningProfileManager: Failed to load profile "/Users/Keith/Library/MobileDevice/Provisioning Profiles/6c9fb6e2-0972-47cb-9fc3-635326a89919" (Error Domain=DVTProvisioningProfileSourceErrorDomain Code=0 "No provisioning profile provider found for profile "/Users/Keith/Library/MobileDevice/Provisioning Profiles/6c9fb6e2-0972-47cb-9fc3-635326a89919"." UserInfo={NSLocalizedDescription=No provisioning profile provider found for profile "/Users/Keith/Library/MobileDevice/Provisioning Profiles/6c9fb6e2-0972-47cb-9fc3-635326a89919".})
2019-03-25 13:30:40.962 xcodebuild[12411:1484248]  DVTProvisioningProfileManager: Failed to load profile "/Users/Keith/Library/MobileDevice/Provisioning Profiles/1f712a33-110a-4d53-af7c-c49a2173f1ed" (Error Domain=DVTProvisioningProfileSourceErrorDomain Code=0 "No provisioning profile provider found for profile "/Users/Keith/Library/MobileDevice/Provisioning Profiles/1f712a33-110a-4d53-af7c-c49a2173f1ed"." UserInfo={NSLocalizedDescription=No provisioning profile provider found for profile "/Users/Keith/Library/MobileDevice/Provisioning Profiles/1f712a33-110a-4d53-af7c-c49a2173f1ed".})
2019-03-25 13:30:40.962 xcodebuild[12411:1484248]  DVTProvisioningProfileManager: Failed to load profile "/Users/Keith/Library/MobileDevice/Provisioning Profiles/235b6597-218a-4011-9dc2-1cafeb4e1916" (Error Domain=DVTProvisioningProfileSourceErrorDomain Code=0 "No provisioning profile provider found for profile "/Users/Keith/Library/MobileDevice/Provisioning Profiles/235b6597-218a-4011-9dc2-1cafeb4e1916"." UserInfo={NSLocalizedDescription=No provisioning profile provider found for profile "/Users/Keith/Library/MobileDevice/Provisioning Profiles/235b6597-218a-4011-9dc2-1cafeb4e1916".})
2019-03-25 13:30:40.962 xcodebuild[12411:1484248]  DVTProvisioningProfileManager: Failed to load profile "/Users/Keith/Library/MobileDevice/Provisioning Profiles/352f033a-455b-4b56-a341-9ae936255ab1" (Error Domain=DVTProvisioningProfileSourceErrorDomain Code=0 "No provisioning profile provider found for profile "/Users/Keith/Library/MobileDevice/Provisioning Profiles/352f033a-455b-4b56-a341-9ae936255ab1"." UserInfo={NSLocalizedDescription=No provisioning profile provider found for profile "/Users/Keith/Library/MobileDevice/Provisioning Profiles/352f033a-455b-4b56-a341-9ae936255ab1".})
2019-03-25 13:30:40.962 xcodebuild[12411:1484248]  DVTProvisioningProfileManager: Failed to load profile "/Users/Keith/Library/MobileDevice/Provisioning Profiles/1c019bea-052b-4724-9443-15362a48d202" (Error Domain=DVTProvisioningProfileSourceErrorDomain Code=0 "No provisioning profile provider found for profile "/Users/Keith/Library/MobileDevice/Provisioning Profiles/1c019bea-052b-4724-9443-15362a48d202"." UserInfo={NSLocalizedDescription=No provisioning profile provider found for profile "/Users/Keith/Library/MobileDevice/Provisioning Profiles/1c019bea-052b-4724-9443-15362a48d202".})
2019-03-25 13:30:40.962 xcodebuild[12411:1484248]  DVTProvisioningProfileManager: Failed to load profile "/Users/Keith/Library/MobileDevice/Provisioning Profiles/2df58b95-9642-4569-a69c-45aa42346e49" (Error Domain=DVTProvisioningProfileSourceErrorDomain Code=0 "No provisioning profile provider found for profile "/Users/Keith/Library/MobileDevice/Provisioning Profiles/2df58b95-9642-4569-a69c-45aa42346e49"." UserInfo={NSLocalizedDescription=No provisioning profile provider found for profile "/Users/Keith/Library/MobileDevice/Provisioning Profiles/2df58b95-9642-4569-a69c-45aa42346e49".})
2019-03-25 13:30:40.963 xcodebuild[12411:1484248]  DVTProvisioningProfileManager: Failed to load profile "/Users/Keith/Library/MobileDevice/Provisioning Profiles/b726a7a1-7a55-41da-b145-8e744d305068" (Error Domain=DVTProvisioningProfileSourceErrorDomain Code=0 "No provisioning profile provider found for profile "/Users/Keith/Library/MobileDevice/Provisioning Profiles/b726a7a1-7a55-41da-b145-8e744d305068"." UserInfo={NSLocalizedDescription=No provisioning profile provider found for profile "/Users/Keith/Library/MobileDevice/Provisioning Profiles/b726a7a1-7a55-41da-b145-8e744d305068".})
2019-03-25 13:30:40.963 xcodebuild[12411:1484248]  DVTProvisioningProfileManager: Failed to load profile "/Users/Keith/Library/MobileDevice/Provisioning Profiles/29688856-12f9-4e85-bf96-306b81efbe98" (Error Domain=DVTProvisioningProfileSourceErrorDomain Code=0 "No provisioning profile provider found for profile "/Users/Keith/Library/MobileDevice/Provisioning Profiles/29688856-12f9-4e85-bf96-306b81efbe98"." UserInfo={NSLocalizedDescription=No provisioning profile provider found for profile "/Users/Keith/Library/MobileDevice/Provisioning Profiles/29688856-12f9-4e85-bf96-306b81efbe98".})
2019-03-25 13:30:40.963 xcodebuild[12411:1484248]  DVTProvisioningProfileManager: Failed to load profile "/Users/Keith/Library/MobileDevice/Provisioning Profiles/7ca59eae-817d-4c54-ab14-f0851378eaee" (Error Domain=DVTProvisioningProfileSourceErrorDomain Code=0 "No provisioning profile provider found for profile "/Users/Keith/Library/MobileDevice/Provisioning Profiles/7ca59eae-817d-4c54-ab14-f0851378eaee"." UserInfo={NSLocalizedDescription=No provisioning profile provider found for profile "/Users/Keith/Library/MobileDevice/Provisioning Profiles/7ca59eae-817d-4c54-ab14-f0851378eaee".})
2019-03-25 13:30:40.964 xcodebuild[12411:1484248]  DVTProvisioningProfileManager: Failed to load profile "/Users/Keith/Library/MobileDevice/Provisioning Profiles/4fa8c2b3-3e7b-4ec7-b83f-029e3d02cdac" (Error Domain=DVTProvisioningProfileSourceErrorDomain Code=0 "No provisioning profile provider found for profile "/Users/Keith/Library/MobileDevice/Provisioning Profiles/4fa8c2b3-3e7b-4ec7-b83f-029e3d02cdac"." UserInfo={NSLocalizedDescription=No provisioning profile provider found for profile "/Users/Keith/Library/MobileDevice/Provisioning Profiles/4fa8c2b3-3e7b-4ec7-b83f-029e3d02cdac".})
2019-03-25 13:30:40.964 xcodebuild[12411:1484248]  DVTProvisioningProfileManager: Failed to load profile "/Users/Keith/Library/MobileDevice/Provisioning Profiles/df224f49-6c7d-49d2-864f-da7bf0682771" (Error Domain=DVTProvisioningProfileSourceErrorDomain Code=0 "No provisioning profile provider found for profile "/Users/Keith/Library/MobileDevice/Provisioning Profiles/df224f49-6c7d-49d2-864f-da7bf0682771"." UserInfo={NSLocalizedDescription=No provisioning profile provider found for profile "/Users/Keith/Library/MobileDevice/Provisioning Profiles/df224f49-6c7d-49d2-864f-da7bf0682771".})
2019-03-25 13:30:40.964 xcodebuild[12411:1484248]  DVTProvisioningProfileManager: Failed to load profile "/Users/Keith/Library/MobileDevice/Provisioning Profiles/725768e6-cbef-4738-a2f7-38284995b9af" (Error Domain=DVTProvisioningProfileSourceErrorDomain Code=0 "No provisioning profile provider found for profile "/Users/Keith/Library/MobileDevice/Provisioning Profiles/725768e6-cbef-4738-a2f7-38284995b9af"." UserInfo={NSLocalizedDescription=No provisioning profile provider found for profile "/Users/Keith/Library/MobileDevice/Provisioning Profiles/725768e6-cbef-4738-a2f7-38284995b9af".})
2019-03-25 13:30:40.964 xcodebuild[12411:1484248]  DVTProvisioningProfileManager: Failed to load profile "/Users/Keith/Library/MobileDevice/Provisioning Profiles/cf382951-205c-474f-a049-f4d7c943ee14" (Error Domain=DVTProvisioningProfileSourceErrorDomain Code=0 "No provisioning profile provider found for profile "/Users/Keith/Library/MobileDevice/Provisioning Profiles/cf382951-205c-474f-a049-f4d7c943ee14"." UserInfo={NSLocalizedDescription=No provisioning profile provider found for profile "/Users/Keith/Library/MobileDevice/Provisioning Profiles/cf382951-205c-474f-a049-f4d7c943ee14".})
2019-03-25 13:30:40.964 xcodebuild[12411:1484248]  DVTProvisioningProfileManager: Failed to load profile "/Users/Keith/Library/MobileDevice/Provisioning Profiles/e7b09a9a-8213-4c2a-bdd3-2ef0a3c04ec3" (Error Domain=DVTProvisioningProfileSourceErrorDomain Code=0 "No provisioning profile provider found for profile "/Users/Keith/Library/MobileDevice/Provisioning Profiles/e7b09a9a-8213-4c2a-bdd3-2ef0a3c04ec3"." UserInfo={NSLocalizedDescription=No provisioning profile provider found for profile "/Users/Keith/Library/MobileDevice/Provisioning Profiles/e7b09a9a-8213-4c2a-bdd3-2ef0a3c04ec3".})
2019-03-25 13:30:40.964 xcodebuild[12411:1484248]  DVTProvisioningProfileManager: Failed to load profile "/Users/Keith/Library/MobileDevice/Provisioning Profiles/6e6f48d0-2d9e-4b77-97ef-1a8505b99af5" (Error Domain=DVTProvisioningProfileSourceErrorDomain Code=0 "No provisioning profile provider found for profile "/Users/Keith/Library/MobileDevice/Provisioning Profiles/6e6f48d0-2d9e-4b77-97ef-1a8505b99af5"." UserInfo={NSLocalizedDescription=No provisioning profile provider found for profile "/Users/Keith/Library/MobileDevice/Provisioning Profiles/6e6f48d0-2d9e-4b77-97ef-1a8505b99af5".})
2019-03-25 13:30:40.964 xcodebuild[12411:1484325]  DVTProvisioningProfileManager: Failed to load profile "/Users/Keith/Library/MobileDevice/Provisioning Profiles/b99dfdf2-2ff3-4c44-879e-fe72ce3dfc6e" (Error Domain=DVTProvisioningProfileSourceErrorDomain Code=0 "No provisioning profile provider found for profile "/Users/Keith/Library/MobileDevice/Provisioning Profiles/b99dfdf2-2ff3-4c44-879e-fe72ce3dfc6e"." UserInfo={NSLocalizedDescription=No provisioning profile provider found for profile "/Users/Keith/Library/MobileDevice/Provisioning Profiles/b99dfdf2-2ff3-4c44-879e-fe72ce3dfc6e".})
** BUILD FAILED **


The following build commands failed:
    CompileC /Users/Keith/Documents/macserver/UploadedProjects/<user id>/build/B4iProject.build/Release-iphoneos/B4iProject.build/Objects-normal/arm64/b4i_scanqr.o /Users/Keith/Documents/macserver/UploadedProjects/<user id>/B4iProject/b4i_scanqr.m normal arm64 objective-c com.apple.compilers.llvm.clang.1_0.compiler
    CompileC /Users/Keith/Documents/macserver/UploadedProjects/<user id>/build/B4iProject.build/Release-iphoneos/B4iProject.build/Objects-normal/arm64/b4i_registerstep2.o /Users/Keith/Documents/macserver/UploadedProjects/<user id>/B4iProject/b4i_registerstep2.m normal arm64 objective-c com.apple.compilers.llvm.clang.1_0.compiler
(2 failures)
 
Top