iOS Question new compile error

marcick

Well-Known Member
Licensed User
I'm no longer able to compile my app (hosted builder).
What can you understand in this log ?

B4X:
B4i Version: 6.30
Parsing code.    (0.15s)
Building folders structure.    (0.01s)
Compiling code.    (0.68s)
Compiling layouts code.    (0.05s)
Compiling debugger engine code.    (3.79s)
Building Xcode project    (0.38s)
Sending data to remote compiler.    Error
Out: Build settings from command line:
    ARCHS = arm64
    CODE_SIGN_IDENTITY = iPhone Distribution: Marco Blancato (....)
    CONFIGURATION_BUILD_DIR = /Users/administrator/Documents/UploadedProjects/<user id>/Payload
    OTHER_CODE_SIGN_FLAGS = --keychain <user id>
    PRODUCT_NAME = Bmap4E
    PROVISIONING_PROFILE = ........

note: Using new build system
note: Planning build
note: Constructing build description
warning: Skipping duplicate build file in Copy Bundle Resources build phase: /Users/administrator/Documents/UploadedProjects/<user id>/it.lproj/InfoPlist.strings (in target 'B4iProject' from project 'B4iProject')
CreateBuildDirectory /Users/administrator/Documents/UploadedProjects/<user id>/build (in target 'B4iProject' from project 'B4iProject')
    cd /Users/administrator/Documents/UploadedProjects/<user id>
    builtin-create-build-directory /Users/administrator/Documents/UploadedProjects/<user id>/build

MkDir /Users/administrator/Documents/UploadedProjects/<user id>/Payload/Bmap4E.app (in target 'B4iProject' from project 'B4iProject')
    cd /Users/administrator/Documents/UploadedProjects/<user id>
    /bin/mkdir -p /Users/administrator/Documents/UploadedProjects/<user id>/Payload/Bmap4E.app

ProcessProductPackaging /Users/administrator/Library/MobileDevice/Provisioning\ Profiles/26a1a664-41a9-4d04-b17c-3c1d942f3969.mobileprovision /Users/administrator/Documents/UploadedProjects/<user id>/Payload/Bmap4E.app/embedded.mobileprovision (in target 'B4iProject' from project 'B4iProject')
    cd /Users/administrator/Documents/UploadedProjects/<user id>
    builtin-productPackagingUtility /Users/administrator/Library/MobileDevice/Provisioning\ Profiles/26a1a664-41a9-4d04-b17c-3c1d942f3969.mobileprovision -o /Users/administrator/Documents/UploadedProjects/<user id>/Payload/Bmap4E.app/embedded.mobileprovision

WriteAuxiliaryFile /Users/administrator/Documents/UploadedProjects/<user id>/build/B4iProject.build/Release-iphoneos/B4iProject.build/DerivedSources/Entitlements.plist (in target 'B4iProject' from project 'B4iProject')
    cd /Users/administrator/Documents/UploadedProjects/<user id>
    write-file /Users/administrator/Documents/UploadedProjects/<user id>/build/B4iProject.build/Release-iphoneos/B4iProject.build/DerivedSources/Entitlements.plist

ProcessProductPackaging "" /Users/administrator/Documents/UploadedProjects/<user id>/build/B4iProject.build/Release-iphoneos/B4iProject.build/Bmap4E.app.xcent (in target 'B4iProject' from project 'B4iProject')
    cd /Users/administrator/Documents/UploadedProjects/<user id>
    

Entitlements:

{
    "application-identifier" = "......it.elettronicablancato.Bmap4E";
    "aps-environment" = production;
    "com.apple.developer.team-identifier" = .....;
    "get-task-allow" = 0;
}


    builtin-productPackagingUtility -entitlements -format xml -o /Users/administrator/Documents/UploadedProjects/<user id>/build/B4iProject.build/Release-iphoneos/B4iProject.build/Bmap4E.app.xcent

WriteAuxiliaryFile /Users/administrator/Documents/UploadedProjects/<user id>/build/B4iProject.build/Release-iphoneos/B4iProject.build/Bmap4E.hmap (in target 'B4iProject' from project 'B4iProject')
    cd /Users/administrator/Documents/UploadedProjects/<user id>
    write-file /Users/administrator/Documents/UploadedProjects/<user id>/build/B4iProject.build/Release-iphoneos/B4iProject.build/Bmap4E.hmap

WriteAuxiliaryFile /Users/administrator/Documents/UploadedProjects/<user id>/build/B4iProject.build/Release-iphoneos/B4iProject.build/Bmap4E-project-headers.hmap (in target 'B4iProject' from project 'B4iProject')
    cd /Users/administrator/Documents/UploadedProjects/<user id>
    write-file /Users/administrator/Documents/UploadedProjects/<user id>/build/B4iProject.build/Release-iphoneos/B4iProject.build/Bmap4E-project-headers.hmap

WriteAuxiliaryFile /Users/administrator/Documents/UploadedProjects/<user id>/build/B4iProject.build/Release-iphoneos/B4iProject.build/Bmap4E-own-target-headers.hmap (in target 'B4iProject' from project 'B4iProject')
    cd /Users/administrator/Documents/UploadedProjects/<user id>
    write-file /Users/administrator/Documents/UploadedProjects/<user id>/build/B4iProject.build/Release-iphoneos/B4iProject.build/Bmap4E-own-target-headers.hmap

WriteAuxiliaryFile /Users/administrator/Documents/UploadedProjects/<user id>/build/B4iProject.build/Release-iphoneos/B4iProject.build/Bmap4E-all-target-headers.hmap (in target 'B4iProject' from project 'B4iProject')
    cd /Users/administrator/Documents/UploadedProjects/<user id>
    write-file /Users/administrator/Documents/UploadedProjects/<user id>/build/B4iProject.build/Release-iphoneos/B4iProject.build/Bmap4E-all-target-headers.hmap

WriteAuxiliaryFile /Users/administrator/Documents/UploadedProjects/<user id>/build/B4iProject.build/Release-iphoneos/B4iProject.build/all-product-headers.yaml (in target 'B4iProject' from project 'B4iProject')
    cd /Users/administrator/Documents/UploadedProjects/<user id>
    write-file /Users/administrator/Documents/UploadedProjects/<user id>/build/B4iProject.build/Release-iphoneos/B4iProject.build/all-product-headers.yaml

WriteAuxiliaryFile /Users/administrator/Documents/UploadedProjects/<user id>/build/B4iProject.build/Release-iphoneos/B4iProject.build/Bmap4E-generated-files.hmap (in target 'B4iProject' from project 'B4iProject')
    cd /Users/administrator/Documents/UploadedProjects/<user id>
    write-file /Users/administrator/Documents/UploadedProjects/<user id>/build/B4iProject.build/Release-iphoneos/B4iProject.build/Bmap4E-generated-files.hmap

WriteAuxiliaryFile /Users/administrator/Documents/UploadedProjects/<user id>/build/B4iProject.build/Release-iphoneos/B4iProject.build/Bmap4E-all-non-framework-target-headers.hmap (in target 'B4iProject' from project 'B4iProject')
    cd /Users/administrator/Documents/UploadedProjects/<user id>
    write-file /Users/administrator/Documents/UploadedProjects/<user id>/build/B4iProject.build/Release-iphoneos/B4iProject.build/Bmap4E-all-non-framework-target-headers.hmap

CompileC /Users/administrator/Documents/UploadedProjects/<user id>/build/B4iProject.build/Release-iphoneos/B4iProject.build/Objects-normal/arm64/b4i_storicimodule.o /Users/administrator/Documents/UploadedProjects/<user id>/B4iProject/b4i_storicimodule.m normal arm64 objective-c com.apple.compilers.llvm.clang.1_0.compiler (in target 'B4iProject' from project 'B4iProject')
    cd /Users/administrator/Documents/UploadedProjects/<user id>
    export LANG=en_US.US-ASCII
    /Applications/Xcode.app/Contents/Developer/Toolchains/XcodeDefault.xctoolchain/usr/bin/clang -x objective-c -target arm64-apple-ios9.3 -fmessage-length=0 -fdiagnostics-show-note-include-stack -fmacro-backtrace-limit=0 -std=gnu99 -fobjc-arc -fmodules -gmodules -fmodules-prune-interval=86400 -fmodules-prune-after=345600 -fbuild-session-file=/var/folders/lj/wrbzzxds6b53f88_rx3x7c800000gn/C/org.llvm.clang/ModuleCache.noindex/Session.modulevalidation -fmodules-validate-once-per-build-session -Wnon-modular-include-in-framework-module -Werror=non-modular-include-in-framework-module -Wno-trigraphs -fpascal-strings -O0 -Wno-missing-field-initializers -Wno-missing-prototypes -Werror=return-type -Wno-implicit-atomic-properties -Werror=deprecated-objc-isa-usage -Wno-objc-interface-ivars -Werror=objc-root-class -Wno-arc-repeated-use-of-weak -Wduplicate-method-match -Wno-missing-braces -Wparentheses -Wswitch -Wunused-function -Wno-unused-label -Wno-unused-parameter -Wunused-variable -Wunused-value -Wempty-body -Wuninitialized -Wconditional-uninitialized -Wno-unknown-pragmas -Wno-shadow -Wno-four-char-constants -Wno-conversion -Wconstant-conversion -Wint-conversion -Wbool-conversion -Wenum-conversion -Wno-float-conversion -Wno-non-literal-null-conversion -Wno-objc-literal-conversion -Wshorten-64-to-32 -Wpointer-sign -Wno-newline-eof -Wno-selector -Wno-strict-selector-match -Wundeclared-selector -Wno-deprecated-implementations -DB4I_VERSION=11 -DNS_BLOCK_ASSERTIONS=1 -DOBJC_OLD_DISPATCH_PROTOTYPES=1 -isysroot /Applications/Xcode.app/Contents/Developer/Platforms/iPhoneOS.platform/Developer/SDKs/iPhoneOS13.2.sdk -fstrict-aliasing -Wprotocol -Wdeprecated-declarations -fvisibility=hidden -Wno-sign-conversion -Wno-infinite-recursion -Wno-comma -Wno-block-capture-autoreleasing -Wno-strict-prototypes -Wno-semicolon-before-method-body -iquote /Users/administrator/Documents/UploadedProjects/<user id>/build/B4iProject.build/Release-iphoneos/B4iProject.build/Bmap4E-generated-files.hmap -I/Users/administrator/Documents/UploadedProjects/<user id>/build/B4iProject.build/Release-iphoneos/B4iProject.build/Bmap4E-own-target-headers.hmap -I/Users/administrator/Documents/UploadedProjects/<user id>/build/B4iProject.build/Release-iphoneos/B4iProject.build/Bmap4E-all-target-headers.hmap -iquote /Users/administrator/Documents/UploadedProjects/<user id>/build/B4iProject.build/Release-iphoneos/B4iProject.build/Bmap4E-project-headers.hmap -I/Users/administrator/Documents/UploadedProjects/<user id>/Payload/include -I/Users/administrator/Documents/UploadedProjects/<user id>/build/B4iProject.build/Release-iphoneos/B4iProject.build/DerivedSources-normal/arm64 -I/Users/administrator/Documents/UploadedProjects/<user id>/build/B4iProject.build/Release-iphoneos/B4iProject.build/DerivedSources/arm64 -I/Users/administrator/Documents/UploadedProjects/<user id>/build/B4iProject.build/Release-iphoneos/B4iProject.build/DerivedSources -F/Users/administrator/Documents/UploadedProjects/<user id>/Payload -F../../Libs -MMD -MT dependencies -MF /Users/administrator/Documents/UploadedProjects/<user id>/build/B4iProject.build/Release-iphoneos/B4iProject.build/Objects-normal/arm64/b4i_storicimodule.d --serialize-diagnostics /Users/administrator/Documents/UploadedProjects/<user id>/build/B4iProject.build/Release-iphoneos/B4iProject.build/Objects-normal/arm64/b4i_storicimodule.dia -c /Users/administrator/Documents/UploadedProjects/<user id>/B4iProject/b4i_storicimodule.m -o /Users/administrator/Documents/UploadedProjects/<user id>/build/B4iProject.build/Release-iphoneos/B4iProject.build/Objects-normal/arm64/b4i_storicimodule.o
In file included from /Users/administrator/Documents/UploadedProjects/<user id>/B4iProject/b4i_storicimodule.m:3:
/Users/administrator/Documents/UploadedProjects/<user id>/B4iProject/b4i_main.h:362:13: error: compile with '-ffixed-point' to enable fixed point types
@public int _Sat;
            ^
/Users/administrator/Documents/UploadedProjects/<user id>/B4iProject/b4i_main.h:362:9: warning: declaration does not declare anything [-Wmissing-declarations]
@public int _Sat;
        ^~~~~~~~

CompileC /Users/administrator/Documents/UploadedProjects/<user id>/build/B4iProject.build/Release-iphoneos/B4iProject.build/Objects-normal/arm64/b4i_scrollinglabel.o /Users/administrator/Documents/UploadedProjects/<user id>/B4iProject/b4i_scrollinglabel.m normal arm64 objective-c com.apple.compilers.llvm.clang.1_0.compiler (in target 'B4iProject' from project 'B4iProject')
    cd /Users/administrator/Documents/UploadedProjects/<user id>
    export LANG=en_US.US-ASCII
    /Applications/Xcode.app/Contents/Developer/Toolchains/XcodeDefault.xctoolchain/usr/bin/clang -x objective-c -target arm64-apple-ios9.3 -fmessage-length=0 -fdiagnostics-show-note-include-stack -fmacro-backtrace-limit=0 -std=gnu99 -fobjc-arc -fmodules -gmodules -fmodules-prune-interval=86400 -fmodules-prune-after=345600 -fbuild-session-file=/var/folders/lj/wrbzzxds6b53f88_rx3x7c800000gn/C/org.llvm.clang/ModuleCache.noindex/Session.modulevalidation -fmodules-validate-once-per-build-session -Wnon-modular-include-in-framework-module -Werror=non-modular-include-in-framework-module -Wno-trigraphs -fpascal-strings -O0 -Wno-missing-field-initializers -Wno-missing-prototypes -Werror=return-type -Wno-implicit-atomic-properties -Werror=deprecated-objc-isa-usage -Wno-objc-interface-ivars -Werror=objc-root-class -Wno-arc-repeated-use-of-weak -Wduplicate-method-match -Wno-missing-braces -Wparentheses -Wswitch -Wunused-function -Wno-unused-label -Wno-unused-parameter -Wunused-variable -Wunused-value -Wempty-body -Wuninitialized -Wconditional-uninitialized -Wno-unknown-pragmas -Wno-shadow -Wno-four-char-constants -Wno-conversion -Wconstant-conversion -Wint-conversion -Wbool-conversion -Wenum-conversion -Wno-float-conversion -Wno-non-literal-null-conversion -Wno-objc-literal-conversion -Wshorten-64-to-32 -Wpointer-sign -Wno-newline-eof -Wno-selector -Wno-strict-selector-match -Wundeclared-selector -Wno-deprecated-implementations -DB4I_VERSION=11 -DNS_BLOCK_ASSERTIONS=1 -DOBJC_OLD_DISPATCH_PROTOTYPES=1 -isysroot /Applications/Xcode.app/Contents/Developer/Platforms/iPhoneOS.platform/Developer/SDKs/iPhoneOS13.2.sdk -fstrict-aliasing -Wprotocol -Wdeprecated-declarations -fvisibility=hidden -Wno-sign-conversion -Wno-infinite-recursion -Wno-comma -Wno-block-capture-autoreleasing -Wno-strict-prototypes -Wno-semicolon-before-method-body -iquote /Users/administrator/Documents/UploadedProjects/<user id>/build/B4iProject.build/Release-iphoneos/B4iProject.build/Bmap4E-generated-files.hmap -I/Users/administrator/Documents/UploadedProjects/<user id>/build/B4iProject.build/Release-iphoneos/B4iProject.build/Bmap4E-own-target-headers.hmap -I/Users/administrator/Documents/UploadedProjects/<user id>/build/B4iProject.build/Release-iphoneos/B4iProject.build/Bmap4E-all-target-headers.hmap -iquote /Users/administrator/Documents/UploadedProjects/<user id>/build/B4iProject.build/Release-iphoneos/B4iProject.build/Bmap4E-project-headers.hmap -I/Users/administrator/Documents/UploadedProjects/<user id>/Payload/include -I/Users/administrator/Documents/UploadedProjects/<user id>/build/B4iProject.build/Release-iphoneos/B4iProject.build/DerivedSources-normal/arm64 -I/Users/administrator/Documents/UploadedProjects/<user id>/build/B4iProject.build/Release-iphoneos/B4iProject.build/DerivedSources/arm64 -I/Users/administrator/Documents/UploadedProjects/<user id>/build/B4iProject.build/Release-iphoneos/B4iProject.build/DerivedSources -F/Users/administrator/Documents/UploadedProjects/<user id>/Payload -F../../Libs -MMD -MT dependencies -MF /Users/administrator/Documents/UploadedProjects/<user id>/build/B4iProject.build/Release-iphoneos/B4iProject.build/Objects-normal/arm64/b4i_scrollinglabel.d --serialize-diagnostics /Users/administrator/Documents/UploadedProjects/<user id>/build/B4iProject.build/Release-iphoneos/B4iProject.build/Objects-normal/arm64/b4i_scrollinglabel.dia -c /Users/administrator/Documents/UploadedProjects/<user id>/B4iProject/b4i_scrollinglabel.m -o /Users/administrator/Documents/UploadedProjects/<user id>/build/B4iProject.build/Release-iphoneos/B4iProject.build/Objects-normal/arm64/b4i_scrollinglabel.o
In file included from /Users/administrator/Documents/UploadedProjects/<user id>/B4iProject/b4i_scrollinglabel.m:3:
/Users/administrator/Documents/UploadedProjects/<user id>/B4iProject/b4i_main.h:362:13: error: compile with '-ffixed-point' to enable fixed point types
@public int _Sat;
            ^
/Users/administrator/Documents/UploadedProjects/<user id>/B4iProject/b4i_main.h:362:9: warning: declaration does not declare anything [-Wmissing-declarations]
@public int _Sat;
        ^~~~~~~~
1 warning and 1 error generated.

CompileC /Users/administrator/Documents/UploadedProjects/<user id>/build/B4iProject.build/Release-iphoneos/B4iProject.build/Objects-normal/arm64/b4i_register.o /Users/administrator/Documents/UploadedProjects/<user id>/B4iProject/b4i_register.m normal arm64 objective-c com.apple.compilers.llvm.clang.1_0.compiler (in target 'B4iProject' from project 'B4iProject')
    cd /Users/administrator/Documents/UploadedProjects/<user id>
    export LANG=en_US.US-ASCII
    /Applications/Xcode.app/Contents/Developer/Toolchains/XcodeDefault.xctoolchain/usr/bin/clang -x objective-c -target arm64-apple-ios9.3 -fmessage-length=0 -fdiagnostics-show-note-include-stack -fmacro-backtrace-limit=0 -std=gnu99 -fobjc-arc -fmodules -gmodules -fmodules-prune-interval=86400 -fmodules-prune-after=345600 -fbuild-session-file=/var/folders/lj/wrbzzxds6b53f88_rx3x7c800000gn/C/org.llvm.clang/ModuleCache.noindex/Session.modulevalidation -fmodules-validate-once-per-build-session -Wnon-modular-include-in-framework-module -Werror=non-modular-include-in-framework-module -Wno-trigraphs -fpascal-strings -O0 -Wno-missing-field-initializers -Wno-missing-prototypes -Werror=return-type -Wno-implicit-atomic-properties -Werror=deprecated-objc-isa-usage -Wno-objc-interface-ivars -Werror=objc-root-class -Wno-arc-repeated-use-of-weak -Wduplicate-method-match -Wno-missing-braces -Wparentheses -Wswitch -Wunused-function -Wno-unused-label -Wno-unused-parameter -Wunused-variable -Wunused-value -Wempty-body -Wuninitialized -Wconditional-uninitialized -Wno-unknown-pragmas -Wno-shadow -Wno-four-char-constants -Wno-conversion -Wconstant-conversion -Wint-conversion -Wbool-conversion -Wenum-conversion -Wno-float-conversion -Wno-non-literal-null-conversion -Wno-objc-literal-conversion -Wshorten-64-to-32 -Wpointer-sign -Wno-newline-eof -Wno-selector -Wno-strict-selector-match -Wundeclared-selector -Wno-deprecated-implementations -DB4I_VERSION=11 -DNS_BLOCK_ASSERTIONS=1 -DOBJC_OLD_DISPATCH_PROTOTYPES=1 -isysroot /Applications/Xcode.app/Contents/Developer/Platforms/iPhoneOS.platform/Developer/SDKs/iPhoneOS13.2.sdk -fstrict-aliasing -Wprotocol -Wdeprecated-declarations -fvisibility=hidden -Wno-sign-conversion -Wno-infinite-recursion -Wno-comma -Wno-block-capture-autoreleasing -Wno-strict-prototypes -Wno-semicolon-before-method-body -iquote /Users/administrator/Documents/UploadedProjects/<user id>/build/B4iProject.build/Release-iphoneos/B4iProject.build/Bmap4E-generated-files.hmap -I/Users/administrator/Documents/UploadedProjects/<user id>/build/B4iProject.build/Release-iphoneos/B4iProject.build/Bmap4E-own-target-headers.hmap -I/Users/administrator/Documents/UploadedProjects/<user id>/build/B4iProject.build/Release-iphoneos/B4iProject.build/Bmap4E-all-target-headers.hmap -iquote /Users/administrator/Documents/UploadedProjects/<user id>/build/B4iProject.build/Release-iphoneos/B4iProject.build/Bmap4E-project-headers.hmap -I/Users/administrator/Documents/UploadedProjects/<user id>/Payload/include -I/Users/administrator/Documents/UploadedProjects/<user id>/build/B4iProject.build/Release-iphoneos/B4iProject.build/DerivedSources-normal/arm64 -I/Users/administrator/Documents/UploadedProjects/<user id>/build/B4iProject.build/Release-iphoneos/B4iProject.build/DerivedSources/arm64 -I/Users/administrator/Documents/UploadedProjects/<user id>/build/B4iProject.build/Release-iphoneos/B4iProject.build/DerivedSources -F/Users/administrator/Documents/UploadedProjects/<user id>/Payload -F../../Libs -MMD -MT dependencies -MF /Users/administrator/Documents/UploadedProjects/<user id>/build/B4iProject.build/Release-iphoneos/B4iProject.build/Objects-normal/arm64/b4i_register.d --serialize-diagnostics /Users/administrator/Documents/UploadedProjects/<user id>/build/B4iProject.build/Release-iphoneos/B4iProject.build/Objects-normal/arm64/b4i_register.dia -c /Users/administrator/Documents/UploadedProjects/<user id>/B4iProject/b4i_register.m -o /Users/administrator/Documents/UploadedProjects/<user id>/build/B4iProject.build/Release-iphoneos/B4iProject.build/Objects-normal/arm64/b4i_register.o
In file included from /Users/administrator/Documents/UploadedProjects/<user id>/B4iProject/b4i_register.m:3:
/Users/administrator/Documents/UploadedProjects/<user id>/B4iProject/b4i_main.h:362:13: error: compile with '-ffixed-point' to enable fixed point types
@public int _Sat;
            ^
/Users/administrator/Documents/UploadedProjects/<user id>/B4iProject/b4i_main.h:362:9: warning: declaration does not declare anything [-Wmissing-declarations]
@public int _Sat;
        ^~~~~~~~

CompileC /Users/administrator/Documents/UploadedProjects/<user id>/build/B4iProject.build/Release-iphoneos/B4iProject.build/Objects-normal/arm64/b4i_websockethandler.o /Users/administrator/Documents/UploadedProjects/<user id>/B4iProject/b4i_websockethandler.m normal arm64 objective-c com.apple.compilers.llvm.clang.1_0.compiler (in target 'B4iProject' from project 'B4iProject')
    cd /Users/administrator/Documents/UploadedProjects/<user id>
    export LANG=en_US.US-ASCII
    /Applications/Xcode.app/Contents/Developer/Toolchains/XcodeDefault.xctoolchain/usr/bin/clang -x objective-c -target arm64-apple-ios9.3 -fmessage-length=0 -fdiagnostics-show-note-include-stack -fmacro-backtrace-limit=0 -std=gnu99 -fobjc-arc -fmodules -gmodules -fmodules-prune-interval=86400 -fmodules-prune-after=345600 -fbuild-session-file=/var/folders/lj/wrbzzxds6b53f88_rx3x7c800000gn/C/org.llvm.clang/ModuleCache.noindex/Session.modulevalidation -fmodules-validate-once-per-build-session -Wnon-modular-include-in-framework-module -Werror=non-modular-include-in-framework-module -Wno-trigraphs -fpascal-strings -O0 -Wno-missing-field-initializers -Wno-missing-prototypes -Werror=return-type -Wno-implicit-atomic-properties -Werror=deprecated-objc-isa-usage -Wno-objc-interface-ivars -Werror=objc-root-class -Wno-arc-repeated-use-of-weak -Wduplicate-method-match -Wno-missing-braces -Wparentheses -Wswitch -Wunused-function -Wno-unused-label -Wno-unused-parameter -Wunused-variable -Wunused-value -Wempty-body -Wuninitialized -Wconditional-uninitialized -Wno-unknown-pragmas -Wno-shadow -Wno-four-char-constants -Wno-conversion -Wconstant-conversion -Wint-conversion -Wbool-conversion -Wenum-conversion -Wno-float-conversion -Wno-non-literal-null-conversion -Wno-objc-literal-conversion -Wshorten-64-to-32 -Wpointer-sign -Wno-newline-eof -Wno-selector -Wno-strict-selector-match -Wundeclared-selector -Wno-deprecated-implementations -DB4I_VERSION=11 -DNS_BLOCK_ASSERTIONS=1 -DOBJC_OLD_DISPATCH_PROTOTYPES=1 -isysroot /Applications/Xcode.app/Contents/Developer/Platforms/iPhoneOS.platform/Developer/SDKs/iPhoneOS13.2.sdk -fstrict-aliasing -Wprotocol -Wdeprecated-declarations -fvisibility=hidden -Wno-sign-conversion -Wno-infinite-recursion -Wno-comma -Wno-block-capture-autoreleasing -Wno-strict-prototypes -Wno-semicolon-before-method-body -iquote /Users/administrator/Documents/UploadedProjects/<user id>/build/B4iProject.build/Release-iphoneos/B4iProject.build/Bmap4E-generated-files.hmap -I/Users/administrator/Documents/UploadedProjects/<user id>/build/B4iProject.build/Release-iphoneos/B4iProject.build/Bmap4E-own-target-headers.hmap -I/Users/administrator/Documents/UploadedProjects/<user id>/build/B4iProject.build/Release-iphoneos/B4iProject.build/Bmap4E-all-target-headers.hmap -iquote /Users/administrator/Documents/UploadedProjects/<user id>/build/B4iProject.build/Release-iphoneos/B4iProject.build/Bmap4E-project-headers.hmap -I/Users/administrator/Documents/UploadedProjects/<user id>/Payload/include -I/Users/administrator/Documents/UploadedProjects/<user id>/build/B4iProject.build/Release-iphoneos/B4iProject.build/DerivedSources-normal/arm64 -I/Users/administrator/Documents/UploadedProjects/<user id>/build/B4iProject.build/Release-iphoneos/B4iProject.build/DerivedSources/arm64 -I/Users/administrator/Documents/UploadedProjects/<user id>/build/B4iProject.build/Release-iphoneos/B4iProject.build/DerivedSources -F/Users/administrator/Documents/UploadedProjects/<user id>/Payload -F../../Libs -MMD -MT dependencies -MF /Users/administrator/Documents/UploadedProjects/<user id>/build/B4iProject.build/Release-iphoneos/B4iProject.build/Objects-normal/arm64/b4i_websockethandler.d --serialize-diagnostics /Users/administrator/Documents/UploadedProjects/<user id>/build/B4iProject.build/Release-iphoneos/B4iProject.build/Objects-normal/arm64/b4i_websockethandler.dia -c /Users/administrator/Documents/UploadedProjects/<user id>/B4iProject/b4i_websockethandler.m -o /Users/administrator/Documents/UploadedProjects/<user id>/build/B4iProject.build/Release-iphoneos/B4iProject.build/Objects-normal/arm64/b4i_websockethandler.o
In file included from /Users/administrator/Documents/UploadedProjects/<user id>/B4iProject/b4i_websockethandler.m:3:
/Users/administrator/Documents/UploadedProjects/<user id>/B4iProject/b4i_main.h:362:13: error: compile with '-ffixed-point' to enable fixed point types
@public int _Sat;
            ^
/Users/administrator/Documents/UploadedProjects/<user id>/B4iProject/b4i_main.h:362:9: warning: declaration does not declare anything [-Wmissing-declarations]
@public int _Sat;
        ^~~~~~~~
1 warning and 1 error generated.

CompileC /Users/administrator/Documents/UploadedProjects/<user id>/build/B4iProject.build/Release-iphoneos/B4iProject.build/Objects-normal/arm64/b4i_pushpinmodule.o /Users/administrator/Documents/UploadedProjects/<user id>/B4iProject/b4i_pushpinmodule.m normal arm64 objective-c com.apple.compilers.llvm.clang.1_0.compiler (in target 'B4iProject' from project 'B4iProject')
    cd /Users/administrator/Documents/UploadedProjects/<user id>
    export LANG=en_US.US-ASCII
    /Applications/Xcode.app/Contents/Developer/Toolchains/XcodeDefault.xctoolchain/usr/bin/clang -x objective-c -target arm64-apple-ios9.3 -fmessage-length=0 -fdiagnostics-show-note-include-stack -fmacro-backtrace-limit=0 -std=gnu99 -fobjc-arc -fmodules -gmodules -fmodules-prune-interval=86400 -fmodules-prune-after=345600 -fbuild-session-file=/var/folders/lj/wrbzzxds6b53f88_rx3x7c800000gn/C/org.llvm.clang/ModuleCache.noindex/Session.modulevalidation -fmodules-validate-once-per-build-session -Wnon-modular-include-in-framework-module -Werror=non-modular-include-in-framework-module -Wno-trigraphs -fpascal-strings -O0 -Wno-missing-field-initializers -Wno-missing-prototypes -Werror=return-type -Wno-implicit-atomic-properties -Werror=deprecated-objc-isa-usage -Wno-objc-interface-ivars -Werror=objc-root-class -Wno-arc-repeated-use-of-weak -Wduplicate-method-match -Wno-missing-braces -Wparentheses -Wswitch -Wunused-function -Wno-unused-label -Wno-unused-parameter -Wunused-variable -Wunused-value -Wempty-body -Wuninitialized -Wconditional-uninitialized -Wno-unknown-pragmas -Wno-shadow -Wno-four-char-constants -Wno-conversion -Wconstant-conversion -Wint-conversion -Wbool-conversion -Wenum-conversion -Wno-float-conversion -Wno-non-literal-null-conversion -Wno-objc-literal-conversion -Wshorten-64-to-32 -Wpointer-sign -Wno-newline-eof -Wno-selector -Wno-strict-selector-match -Wundeclared-selector -Wno-deprecated-implementations -DB4I_VERSION=11 -DNS_BLOCK_ASSERTIONS=1 -DOBJC_OLD_DISPATCH_PROTOTYPES=1 -isysroot /Applications/Xcode.app/Contents/Developer/Platforms/iPhoneOS.platform/Developer/SDKs/iPhoneOS13.2.sdk -fstrict-aliasing -Wprotocol -Wdeprecated-declarations -fvisibility=hidden -Wno-sign-conversion -Wno-infinite-recursion -Wno-comma -Wno-block-capture-autoreleasing -Wno-strict-prototypes -Wno-semicolon-before-method-body -iquote /Users/administrator/Documents/UploadedProjects/<user id>/build/B4iProject.build/Release-iphoneos/B4iProject.build/Bmap4E-generated-files.hmap -I/Users/administrator/Documents/UploadedProjects/<user id>/build/B4iProject.build/Release-iphoneos/B4iProject.build/Bmap4E-own-target-headers.hmap -I/Users/administrator/Documents/UploadedProjects/<user id>/build/B4iProject.build/Release-iphoneos/B4iProject.build/Bmap4E-all-target-headers.hmap -iquote /Users/administrator/Documents/UploadedProjects/<user id>/build/B4iProject.build/Release-iphoneos/B4iProject.build/Bmap4E-project-headers.hmap -I/Users/administrator/Documents/UploadedProjects/<user id>/Payload/include -I/Users/administrator/Documents/UploadedProjects/<user id>/build/B4iProject.build/Release-iphoneos/B4iProject.build/DerivedSources-normal/arm64 -I/Users/administrator/Documents/UploadedProjects/<user id>/build/B4iProject.build/Release-iphoneos/B4iProject.build/DerivedSources/arm64 -I/Users/administrator/Documents/UploadedProjects/<user id>/build/B4iProject.build/Release-iphoneos/B4iProject.build/DerivedSources -F/Users/administrator/Documents/UploadedProjects/<user id>/Payload -F../../Libs -MMD -MT dependencies -MF /Users/administrator/Documents/UploadedProjects/<user id>/build/B4iProject.build/Release-iphoneos/B4iProject.build/Objects-normal/arm64/b4i_pushpinmodule.d --serialize-diagnostics /Users/administrator/Documents/UploadedProjects/<user id>/build/B4iProject.build/Release-iphoneos/B4iProject.build/Objects-normal/arm64/b4i_pushpinmodule.dia -c /Users/administrator/Documents/UploadedProjects/<user id>/B4iProject/b4i_pushpinmodule.m -o /Users/administrator/Documents/UploadedProjects/<user id>/build/B4iProject.build/Release-iphoneos/B4iProject.build/Objects-normal/arm64/b4i_pushpinmodule.o
In file included from /Users/administrator/Documents/UploadedProjects/<user id>/B4iProject/b4i_pushpinmodule.m:3:
/Users/administrator/Documents/UploadedProjects/<user id>/B4iProject/b4i_main.h:362:13: error: compile with '-ffixed-point' to enable fixed point types
@public int _Sat;
            ^
/Users/administrator/Documents/UploadedProjects/<user id>/B4iProject/b4i_main.h:362:9: warning: declaration does not declare anything [-Wmissing-declarations]
@public int _Sat;
        ^~~~~~~~

CompileC /Users/administrator/Documents/UploadedProjects/<user id>/build/B4iProject.build/Release-iphoneos/B4iProject.build/Objects-normal/arm64/b4i_websyncmodule.o /Users/administrator/Documents/UploadedProjects/<user id>/B4iProject/b4i_websyncmodule.m normal arm64 objective-c com.apple.compilers.llvm.clang.1_0.compiler (in target 'B4iProject' from project 'B4iProject')
    cd /Users/administrator/Documents/UploadedProjects/<user id>
    export LANG=en_US.US-ASCII
    /Applications/Xcode.app/Contents/Developer/Toolchains/XcodeDefault.xctoolchain/usr/bin/clang -x objective-c -target arm64-apple-ios9.3 -fmessage-length=0 -fdiagnostics-show-note-include-stack -fmacro-backtrace-limit=0 -std=gnu99 -fobjc-arc -fmodules -gmodules -fmodules-prune-interval=86400 -fmodules-prune-after=345600 -fbuild-session-file=/var/folders/lj/wrbzzxds6b53f88_rx3x7c800000gn/C/org.llvm.clang/ModuleCache.noindex/Session.modulevalidation -fmodules-validate-once-per-build-session -Wnon-modular-include-in-framework-module -Werror=non-modular-include-in-framework-module -Wno-trigraphs -fpascal-strings -O0 -Wno-missing-field-initializers -Wno-missing-prototypes -Werror=return-type -Wno-implicit-atomic-properties -Werror=deprecated-objc-isa-usage -Wno-objc-interface-ivars -Werror=objc-root-class -Wno-arc-repeated-use-of-weak -Wduplicate-method-match -Wno-missing-braces -Wparentheses -Wswitch -Wunused-function -Wno-unused-label -Wno-unused-parameter -Wunused-variable -Wunused-value -Wempty-body -Wuninitialized -Wconditional-uninitialized -Wno-unknown-pragmas -Wno-shadow -Wno-four-char-constants -Wno-conversion -Wconstant-conversion -Wint-conversion -Wbool-conversion -Wenum-conversion -Wno-float-conversion -Wno-non-literal-null-conversion -Wno-objc-literal-conversion -Wshorten-64-to-32 -Wpointer-sign -Wno-newline-eof -Wno-selector -Wno-strict-selector-match -Wundeclared-selector -Wno-deprecated-implementations -DB4I_VERSION=11 -DNS_BLOCK_ASSERTIONS=1 -DOBJC_OLD_DISPATCH_PROTOTYPES=1 -isysroot /Applications/Xcode.app/Contents/Developer/Platforms/iPhoneOS.platform/Developer/SDKs/iPhoneOS13.2.sdk -fstrict-aliasing -Wprotocol -Wdeprecated-declarations -fvisibility=hidden -Wno-sign-conversion -Wno-infinite-recursion -Wno-comma -Wno-block-capture-autoreleasing -Wno-strict-prototypes -Wno-semicolon-before-method-body -iquote /Users/administrator/Documents/UploadedProjects/<user id>/build/B4iProject.build/Release-iphoneos/B4iProject.build/Bmap4E-generated-files.hmap -I/Users/administrator/Documents/UploadedProjects/<user id>/build/B4iProject.build/Release-iphoneos/B4iProject.build/Bmap4E-own-target-headers.hmap -I/Users/administrator/Documents/UploadedProjects/<user id>/build/B4iProject.build/Release-iphoneos/B4iProject.build/Bmap4E-all-target-headers.hmap -iquote /Users/administrator/Documents/UploadedProjects/<user id>/build/B4iProject.build/Release-iphoneos/B4iProject.build/Bmap4E-project-headers.hmap -I/Users/administrator/Documents/UploadedProjects/<user id>/Payload/include -I/Users/administrator/Documents/UploadedProjects/<user id>/build/B4iProject.build/Release-iphoneos/B4iProject.build/DerivedSources-normal/arm64 -I/Users/administrator/Documents/UploadedProjects/<user id>/build/B4iProject.build/Release-iphoneos/B4iProject.build/DerivedSources/arm64 -I/Users/administrator/Documents/UploadedProjects/<user id>/build/B4iProject.build/Release-iphoneos/B4iProject.build/DerivedSources -F/Users/administrator/Documents/UploadedProjects/<user id>/Payload -F../../Libs -MMD -MT dependencies -MF /Users/administrator/Documents/UploadedProjects/<user id>/build/B4iProject.build/Release-iphoneos/B4iProject.build/Objects-normal/arm64/b4i_websyncmodule.d --serialize-diagnostics /Users/administrator/Documents/UploadedProjects/<user id>/build/B4iProject.build/Release-iphoneos/B4iProject.build/Objects-normal/arm64/b4i_websyncmodule.dia -c /Users/administrator/Documents/UploadedProjects/<user id>/B4iProject/b4i_websyncmodule.m -o /Users/administrator/Documents/UploadedProjects/<user id>/build/B4iProject.build/Release-iphoneos/B4iProject.build/Objects-normal/arm64/b4i_websyncmodule.o
In file included from /Users/administrator/Documents/UploadedProjects/<user id>/B4iProject/b4i_websyncmodule.m:3:
/Users/administrator/Documents/UploadedProjects/<user id>/B4iProject/b4i_main.h:362:13: error: compile with '-ffixed-point' to enable fixed point types
@public int _Sat;
            ^
/Users/administrator/Documents/UploadedProjects/<user id>/B4iProject/b4i_main.h:362:9: warning: declaration does not declare anything [-Wmissing-declarations]
@public int _Sat;
        ^~~~~~~~

CompileC /Users/administrator/Documents/UploadedProjects/<user id>/build/B4iProject.build/Release-iphoneos/B4iProject.build/Objects-normal/arm64/main.o /Users/administrator/Documents/UploadedProjects/<user id>/B4iProject/main.m normal arm64 objective-c com.apple.compilers.llvm.clang.1_0.compiler (in target 'B4iProject' from project 'B4iProject')
    cd /Users/administrator/Documents/UploadedProjects/<user id>
    export LANG=en_US.US-ASCII
    /Applications/Xcode.app/Contents/Developer/Toolchains/XcodeDefault.xctoolchain/usr/bin/clang -x objective-c -target arm64-apple-ios9.3 -fmessage-length=0 -fdiagnostics-show-note-include-stack -fmacro-backtrace-limit=0 -std=gnu99 -fobjc-arc -fmodules -gmodules -fmodules-prune-interval=86400 -fmodules-prune-after=345600 -fbuild-session-file=/var/folders/lj/wrbzzxds6b53f88_rx3x7c800000gn/C/org.llvm.clang/ModuleCache.noindex/Session.modulevalidation -fmodules-validate-once-per-build-session -Wnon-modular-include-in-framework-module -Werror=non-modular-include-in-framework-module -Wno-trigraphs -fpascal-strings -O0 -Wno-missing-field-initializers -Wno-missing-prototypes -Werror=return-type -Wno-implicit-atomic-properties -Werror=deprecated-objc-isa-usage -Wno-objc-interface-ivars -Werror=objc-root-class -Wno-arc-repeated-use-of-weak -Wduplicate-method-match -Wno-missing-braces -Wparentheses -Wswitch -Wunused-function -Wno-unused-label -Wno-unused-parameter -Wunused-variable -Wunused-value -Wempty-body -Wuninitialized -Wconditional-uninitialized -Wno-unknown-pragmas -Wno-shadow -Wno-four-char-constants -Wno-conversion -Wconstant-conversion -Wint-conversion -Wbool-conversion -Wenum-conversion -Wno-float-conversion -Wno-non-literal-null-conversion -Wno-objc-literal-conversion -Wshorten-64-to-32 -Wpointer-sign -Wno-newline-eof -Wno-selector -Wno-strict-selector-match -Wundeclared-selector -Wno-deprecated-implementations -DB4I_VERSION=11 -DNS_BLOCK_ASSERTIONS=1 -DOBJC_OLD_DISPATCH_PROTOTYPES=1 -isysroot /Applications/Xcode.app/Contents/Developer/Platforms/iPhoneOS.platform/Developer/SDKs/iPhoneOS13.2.sdk -fstrict-aliasing -Wprotocol -Wdeprecated-declarations -fvisibility=hidden -Wno-sign-conversion -Wno-infinite-recursion -Wno-comma -Wno-block-capture-autoreleasing -Wno-strict-prototypes -Wno-semicolon-before-method-body -iquote /Users/administrator/Documents/UploadedProjects/<user id>/build/B4iProject.build/Release-iphoneos/B4iProject.build/Bmap4E-generated-files.hmap -I/Users/administrator/Documents/UploadedProjects/<user id>/build/B4iProject.build/Release-iphoneos/B4iProject.build/Bmap4E-own-target-headers.hmap -I/Users/administrator/Documents/UploadedProjects/<user id>/build/B4iProject.build/Release-iphoneos/B4iProject.build/Bmap4E-all-target-headers.hmap -iquote /Users/administrator/Documents/UploadedProjects/<user id>/build/B4iProject.build/Release-iphoneos/B4iProject.build/Bmap4E-project-headers.hmap -I/Users/administrator/Documents/UploadedProjects/<user id>/Payload/include -I/Users/administrator/Documents/UploadedProjects/<user id>/build/B4iProject.build/Release-iphoneos/B4iProject.build/DerivedSources-normal/arm64 -I/Users/administrator/Documents/UploadedProjects/<user id>/build/B4iProject.build/Release-iphoneos/B4iProject.build/DerivedSources/arm64 -I/Users/administrator/Documents/UploadedProjects/<user id>/build/B4iProject.build/Release-iphoneos/B4iProject.build/DerivedSources -F/Users/administrator/Documents/UploadedProjects/<user id>/Payload -F../../Libs -MMD -MT dependencies -MF /Users/administrator/Documents/UploadedProjects/<user id>/build/B4iProject.build/Release-iphoneos/B4iProject.build/Objects-normal/arm64/main.d --serialize-diagnostics /Users/administrator/Documents/UploadedProjects/<user id>/build/B4iProject.build/Release-iphoneos/B4iProject.build/Objects-normal/arm64/main.dia -c /Users/administrator/Documents/UploadedProjects/<user id>/B4iProject/main.m -o /Users/administrator/Documents/UploadedProjects/<user id>/build/B4iProject.build/Release-iphoneos/B4iProject.build/Objects-normal/arm64/main.o

CompileC /Users/administrator/Documents/UploadedProjects/<user id>/build/B4iProject.build/Release-iphoneos/B4iProject.build/Objects-normal/arm64/b4i_payoptionsmodule.o /Users/administrator/Documents/UploadedProjects/<user id>/B4iProject/b4i_payoptionsmodule.m normal arm64 objective-c com.apple.compilers.llvm.clang.1_0.compiler (in target 'B4iProject' from project 'B4iProject')
    cd /Users/administrator/Documents/UploadedProjects/<user id>
    export LANG=en_US.US-ASCII
    /Applications/Xcode.app/Contents/Developer/Toolchains/XcodeDefault.xctoolchain/usr/bin/clang -x objective-c -target arm64-apple-ios9.3 -fmessage-length=0 -fdiagnostics-show-note-include-stack -fmacro-backtrace-limit=0 -std=gnu99 -fobjc-arc -fmodules -gmodules -fmodules-prune-interval=86400 -fmodules-prune-after=345600 -fbuild-session-file=/var/folders/lj/wrbzzxds6b53f88_rx3x7c800000gn/C/org.llvm.clang/ModuleCache.noindex/Session.modulevalidation -fmodules-validate-once-per-build-session -Wnon-modular-include-in-framework-module -Werror=non-modular-include-in-framework-module -Wno-trigraphs -fpascal-strings -O0 -Wno-missing-field-initializers -Wno-missing-prototypes -Werror=return-type -Wno-implicit-atomic-properties -Werror=deprecated-objc-isa-usage -Wno-objc-interface-ivars -Werror=objc-root-class -Wno-arc-repeated-use-of-weak -Wduplicate-method-match -Wno-missing-braces -Wparentheses -Wswitch -Wunused-function -Wno-unused-label -Wno-unused-parameter -Wunused-variable -Wunused-value -Wempty-body -Wuninitialized -Wconditional-uninitialized -Wno-unknown-pragmas -Wno-shadow -Wno-four-char-constants -Wno-conversion -Wconstant-conversion -Wint-conversion -Wbool-conversion -Wenum-conversion -Wno-float-conversion -Wno-non-literal-null-conversion -Wno-objc-literal-conversion -Wshorten-64-to-32 -Wpointer-sign -Wno-newline-eof -Wno-selector -Wno-strict-selector-match -Wundeclared-selector -Wno-deprecated-implementations -DB4I_VERSION=11 -DNS_BLOCK_ASSERTIONS=1 -DOBJC_OLD_DISPATCH_PROTOTYPES=1 -isysroot /Applications/Xcode.app/Contents/Developer/Platforms/iPhoneOS.platform/Developer/SDKs/iPhoneOS13.2.sdk -fstrict-aliasing -Wprotocol -Wdeprecated-declarations -fvisibility=hidden -Wno-sign-conversion -Wno-infinite-recursion -Wno-comma -Wno-block-capture-autoreleasing -Wno-strict-prototypes -Wno-semicolon-before-method-body -iquote /Users/administrator/Documents/UploadedProjects/<user id>/build/B4iProject.build/Release-iphoneos/B4iProject.build/Bmap4E-generated-files.hmap -I/Users/administrator/Documents/UploadedProjects/<user id>/build/B4iProject.build/Release-iphoneos/B4iProject.build/Bmap4E-own-target-headers.hmap -I/Users/administrator/Documents/UploadedProjects/<user id>/build/B4iProject.build/Release-iphoneos/B4iProject.build/Bmap4E-all-target-headers.hmap -iquote /Users/administrator/Documents/UploadedProjects/<user id>/build/B4iProject.build/Release-iphoneos/B4iProject.build/Bmap4E-project-headers.hmap -I/Users/administrator/Documents/UploadedProjects/<user id>/Payload/include -I/Users/administrator/Documents/UploadedProjects/<user id>/build/B4iProject.build/Release-iphoneos/B4iProject.build/DerivedSources-normal/arm64 -I/Users/administrator/Documents/UploadedProjects/<user id>/build/B4iProject.build/Release-iphoneos/B4iProject.build/DerivedSources/arm64 -I/Users/administrator/Documents/UploadedProjects/<user id>/build/B4iProject.build/Release-iphoneos/B4iProject.build/DerivedSources -F/Users/administrator/Documents/UploadedProjects/<user id>/Payload -F../../Libs -MMD -MT dependencies -MF /Users/administrator/Documents/UploadedProjects/<user id>/build/B4iProject.build/Release-iphoneos/B4iProject.build/Objects-normal/arm64/b4i_payoptionsmodule.d --serialize-diagnostics /Users/administrator/Documents/UploadedProjects/<user id>/build/B4iProject.build/Release-iphoneos/B4iProject.build/Objects-normal/arm64/b4i_payoptionsmodule.dia -c /Users/administrator/Documents/UploadedProjects/<user id>/B4iProject/b4i_payoptionsmodule.m -o /Users/administrator/Documents/UploadedProjects/<user id>/build/B4iProject.build/Release-iphoneos/B4iProject.build/Objects-normal/arm64/b4i_payoptionsmodule.o
In file included from /Users/administrator/Documents/UploadedProjects/<user id>/B4iProject/b4i_payoptionsmodule.m:3:
/Users/administrator/Documents/UploadedProjects/<user id>/B4iProject/b4i_main.h:362:13: error: compile with '-ffixed-point' to enable fixed point types
@public int _Sat;
            ^
/Users/administrator/Documents/UploadedProjects/<user id>/B4iProject/b4i_main.h:362:9: warning: declaration does not declare anything [-Wmissing-declarations]
@public int _Sat;
        ^~~~~~~~

WriteAuxiliaryFile /Users/administrator/Documents/UploadedProjects/<user id>/build/B4iProject.build/Release-iphoneos/B4iProject.build/Objects-normal/arm64/Bmap4E.LinkFileList (in target 'B4iProject' from project 'B4iProject')
    cd /Users/administrator/Documents/UploadedProjects/<user id>
    write-file /Users/administrator/Documents/UploadedProjects/<user id>/build/B4iProject.build/Release-iphoneos/B4iProject.build/Objects-normal/arm64/Bmap4E.LinkFileList

CompileC /Users/administrator/Documents/UploadedProjects/<user id>/build/B4iProject.build/Release-iphoneos/B4iProject.build/Objects-normal/arm64/b4i_optionsmodule.o /Users/administrator/Documents/UploadedProjects/<user id>/B4iProject/b4i_optionsmodule.m normal arm64 objective-c com.apple.compilers.llvm.clang.1_0.compiler (in target 'B4iProject' from project 'B4iProject')
    cd /Users/administrator/Documents/UploadedProjects/<user id>
    export LANG=en_US.US-ASCII
    /Applications/Xcode.app/Contents/Developer/Toolchains/XcodeDefault.xctoolchain/usr/bin/clang -x objective-c -target arm64-apple-ios9.3 -fmessage-length=0 -fdiagnostics-show-note-include-stack -fmacro-backtrace-limit=0 -std=gnu99 -fobjc-arc -fmodules -gmodules -fmodules-prune-interval=86400 -fmodules-prune-after=345600 -fbuild-session-file=/var/folders/lj/wrbzzxds6b53f88_rx3x7c800000gn/C/org.llvm.clang/ModuleCache.noindex/Session.modulevalidation -fmodules-validate-once-per-build-session -Wnon-modular-include-in-framework-module -Werror=non-modular-include-in-framework-module -Wno-trigraphs -fpascal-strings -O0 -Wno-missing-field-initializers -Wno-missing-prototypes -Werror=return-type -Wno-implicit-atomic-properties -Werror=deprecated-objc-isa-usage -Wno-objc-interface-ivars -Werror=objc-root-class -Wno-arc-repeated-use-of-weak -Wduplicate-method-match -Wno-missing-braces -Wparentheses -Wswitch -Wunused-function -Wno-unused-label -Wno-unused-parameter -Wunused-variable -Wunused-value -Wempty-body -Wuninitialized -Wconditional-uninitialized -Wno-unknown-pragmas -Wno-shadow -Wno-four-char-constants -Wno-conversion -Wconstant-conversion -Wint-conversion -Wbool-conversion -Wenum-conversion -Wno-float-conversion -Wno-non-literal-null-conversion -Wno-objc-literal-conversion -Wshorten-64-to-32 -Wpointer-sign -Wno-newline-eof -Wno-selector -Wno-strict-selector-match -Wundeclared-selector -Wno-deprecated-implementations -DB4I_VERSION=11 -DNS_BLOCK_ASSERTIONS=1 -DOBJC_OLD_DISPATCH_PROTOTYPES=1 -isysroot /Applications/Xcode.app/Contents/Developer/Platforms/iPhoneOS.platform/Developer/SDKs/iPhoneOS13.2.sdk -fstrict-aliasing -Wprotocol -Wdeprecated-declarations -fvisibility=hidden -Wno-sign-conversion -Wno-infinite-recursion -Wno-comma -Wno-block-capture-autoreleasing -Wno-strict-prototypes -Wno-semicolon-before-method-body -iquote /Users/administrator/Documents/UploadedProjects/<user id>/build/B4iProject.build/Release-iphoneos/B4iProject.build/Bmap4E-generated-files.hmap -I/Users/administrator/Documents/UploadedProjects/<user id>/build/B4iProject.build/Release-iphoneos/B4iProject.build/Bmap4E-own-target-headers.hmap -I/Users/administrator/Documents/UploadedProjects/<user id>/build/B4iProject.build/Release-iphoneos/B4iProject.build/Bmap4E-all-target-headers.hmap -iquote /Users/administrator/Documents/UploadedProjects/<user id>/build/B4iProject.build/Release-iphoneos/B4iProject.build/Bmap4E-project-headers.hmap -I/Users/administrator/Documents/UploadedProjects/<user id>/Payload/include -I/Users/administrator/Documents/UploadedProjects/<user id>/build/B4iProject.build/Release-iphoneos/B4iProject.build/DerivedSources-normal/arm64 -I/Users/administrator/Documents/UploadedProjects/<user id>/build/B4iProject.build/Release-iphoneos/B4iProject.build/DerivedSources/arm64 -I/Users/administrator/Documents/UploadedProjects/<user id>/build/B4iProject.build/Release-iphoneos/B4iProject.build/DerivedSources -F/Users/administrator/Documents/UploadedProjects/<user id>/Payload -F../../Libs -MMD -MT dependencies -MF /Users/administrator/Documents/UploadedProjects/<user id>/build/B4iProject.build/Release-iphoneos/B4iProject.build/Objects-normal/arm64/b4i_optionsmodule.d --serialize-diagnostics /Users/administrator/Documents/UploadedProjects/<user id>/build/B4iProject.build/Release-iphoneos/B4iProject.build/Objects-normal/arm64/b4i_optionsmodule.dia -c /Users/administrator/Documents/UploadedProjects/<user id>/B4iProject/b4i_optionsmodule.m -o /Users/administrator/Documents/UploadedProjects/<user id>/build/B4iProject.build/Release-iphoneos/B4iProject.build/Objects-normal/arm64/b4i_optionsmodule.o


Error: ** BUILD FAILED **


The following build commands failed:
    CompileC /Users/administrator/Documents/UploadedProjects/<user id>/build/B4iProject.build/Release-iphoneos/B4iProject.build/Objects-normal/arm64/b4i_websockethandler.o /Users/administrator/Documents/UploadedProjects/<user id>/B4iProject/b4i_websockethandler.m normal arm64 objective-c com.apple.compilers.llvm.clang.1_0.compiler
(1 failure)
 

Semen Matusovskiy

Well-Known Member
Licensed User
In file included from /Users/administrator/Documents/UploadedProjects/<user id>/B4iProject/b4i_storicimodule.m:3:
/Users/administrator/Documents/UploadedProjects/<user id>/B4iProject/b4i_main.h:362:13: error: compile with '-ffixed-point' to enable fixed point types
Theoretically you should look line 362 in b4i_main.h inside <App folder>\Objects\src\B4iProject.

But doubt that this helps. Looks like something wrong with global variable Sat.
 

marcick

Well-Known Member
Licensed User
I had a look there but I can't understand.

B4X:
@public BOOL _IsInitialized;
@public int _ID;
@public NSString* _V_Id;
@public NSString* _MS;
@public NSString* _GpsDate;
@public int _Lat;
@public int _Lon;
@public int _Vel;
@public int _Sat;                -->>> this is line 362
@public int _Course;
@public int _Credit;
@public NSString* _BatType;
@public NSString* _Bat;
@public NSString* _Fix;
@public NSString* _Datevalid;
@public NSString* _StoName;
@public NSString* _RealTime;
@public NSString* _Address;
@public NSString* _CellID;
this code should be related to a Type declaration that I have in Main

B4X:
    Type DBRec (ID As Int, V_Id As String, MS As String, GpsDate As String, Lat As Int, Lon As Int, Vel As Int, Sat As Int, Course As Int, Credit As Int _
    , BatType As String, Bat As String, Fix As String, Datevalid As String, StoName As String, RealTime As String, Address As String, CellID As String)
but, but but ....
it is a working app since two years. I'm opening it now to make some update, I don't know what can be changed since last november (last time I have compiled it).
 

Semen Matusovskiy

Well-Known Member
Licensed User
The problem is in Type statement. You expect classic structure. Meanwhile B4I creates a set of variables
For example, create a new B4I project and add following:

B4X:
Sub Process_Globals
    Type DBRec (ID As Int, Sat As Int)       
    Public myUDT As DBRec   
    Public Sat As Int   
End Sub
You will get the same error like in your post.
Simply rename Sat (in Type or separate variable)
 

marcick

Well-Known Member
Licensed User
Thank you for the hint, but I can't follow ... I don't have any "Public Sat As Int" declaration in my code.....
The word "Sat" exists only in the type declaration.
And also here (does it have some relation ?)

B4X:
        SQL_Bls1.ExecNonQuery("CREATE TABLE records (ID INTEGER PRIMARY KEY, V_ID TEXT, MS TEXT, GpsDate TEXT, Lat INTEGER, Lon INTEGER, Vel INTEGER, Sat INTEGER, Course INTEGER, Credit INTEGER, BatType TEXT, Bat INTEGER, Fix TEXT, DateValid TEXT, StoName TEXT, RealTime INTEGER, Address TEXT, CellID TEXT)")
 

marcick

Well-Known Member
Licensed User
It works !!
Looks like "Sat" has recently become a reserved word somewhere
Thank you very much :)
 

Computersmith64

Well-Known Member
Licensed User
_Sat is a fixed point type in the GNU Compiler - which is what Xcode uses.

- Colin.
 

marcick

Well-Known Member
Licensed User
Thank you. Must be a recent change, because I was compiling ok since about 3 years.
 
Top