iOS Question [solved] "Build failed" fatal error: 'ByteConverter.h' file not found

fredo

Well-Known Member
Licensed User
When trying to extend a B4A project to B4i, the following message appears during compilation:

B4i Version: 6.80
Parsing code. (0.18s)
Building folders structure. (0.05s)
Running custom action. (0.09s)
Running custom action. (0.08s)
Compiling code. (0.41s)
Compiling layouts code. (0.03s)
Compiling debugger engine code. (4.25s)
Building Xcode project (0.32s)
Sending data to remote compiler. Error
Error: security: SecKeychainDelete: The specified keychain could not be found.

Out: Build settings from command line:
ARCHS = arm64
CODE_SIGN_IDENTITY = iPhone Distribution: yyyyyyyyyy (yyyyyy)
CONFIGURATION_BUILD_DIR = /Users/administrator/Documents/UploadedProjects/<user id>/Payload
OTHER_CODE_SIGN_FLAGS = --keychain <user id>
PRODUCT_NAME = SeZa Navigator
PROVISIONING_PROFILE = yyyyyyyyyyyyyyyyyyyyyy

note: Using new build system
note: Planning build
note: Constructing build description
CreateBuildDirectory /Users/administrator/Documents/UploadedProjects/<user id>/build (in target 'B4iProject' from project 'B4iProject')
cd /Users/administrator/Documents/UploadedProjects/<user id>
builtin-create-build-directory /Users/administrator/Documents/UploadedProjects/<user id>/build

MkDir /Users/administrator/Documents/UploadedProjects/<user id>/Payload/SeZa\ Navigator.app (in target 'B4iProject' from project 'B4iProject')
cd /Users/administrator/Documents/UploadedProjects/<user id>
/bin/mkdir -p /Users/administrator/Documents/UploadedProjects/<user id>/Payload/SeZa\ Navigator.app

ProcessProductPackaging /Users/administrator/Library/MobileDevice/Provisioning\ Profiles/aa1ff771-50f4-4a3b-ac2c-c8219b805671.mobileprovision /Users/administrator/Documents/UploadedProjects/<user id>/Payload/SeZa\ Navigator.app/embedded.mobileprovision (in target 'B4iProject' from project 'B4iProject')
cd /Users/administrator/Documents/UploadedProjects/<user id>
builtin-productPackagingUtility /Users/administrator/Library/MobileDevice/Provisioning\ Profiles/aa1ff771-50f4-4a3b-ac2c-c8219b805671.mobileprovision -o /Users/administrator/Documents/UploadedProjects/<user id>/Payload/SeZa\ Navigator.app/embedded.mobileprovision

WriteAuxiliaryFile /Users/administrator/Documents/UploadedProjects/<user id>/build/B4iProject.build/Release-iphoneos/B4iProject.build/DerivedSources/Entitlements.plist (in target 'B4iProject' from project 'B4iProject')
cd /Users/administrator/Documents/UploadedProjects/<user id>
write-file /Users/administrator/Documents/UploadedProjects/<user id>/build/B4iProject.build/Release-iphoneos/B4iProject.build/DerivedSources/Entitlements.plist

ProcessProductPackaging "" /Users/administrator/Documents/UploadedProjects/<user id>/build/B4iProject.build/Release-iphoneos/B4iProject.build/SeZa\ Navigator.app.xcent (in target 'B4iProject' from project 'B4iProject')
cd /Users/administrator/Documents/UploadedProjects/<user id>


Entitlements:

{
"application-identifier" = "yyyyyy.b4i.yyyyyyyyyyy";
"com.apple.developer.team-identifier" = yyyyyy;
"get-task-allow" = 0;
}


builtin-productPackagingUtility -entitlements -format xml -o /Users/administrator/Documents/UploadedProjects/<user id>/build/B4iProject.build/Release-iphoneos/B4iProject.build/SeZa\ Navigator.app.xcent

WriteAuxiliaryFile /Users/administrator/Documents/UploadedProjects/<user id>/build/B4iProject.build/Release-iphoneos/B4iProject.build/all-product-headers.yaml (in target 'B4iProject' from project 'B4iProject')
cd /Users/administrator/Documents/UploadedProjects/<user id>
write-file /Users/administrator/Documents/UploadedProjects/<user id>/build/B4iProject.build/Release-iphoneos/B4iProject.build/all-product-headers.yaml

WriteAuxiliaryFile /Users/administrator/Documents/UploadedProjects/<user id>/build/B4iProject.build/Release-iphoneos/B4iProject.build/SeZa\ Navigator.hmap (in target 'B4iProject' from project 'B4iProject')
cd /Users/administrator/Documents/UploadedProjects/<user id>
write-file /Users/administrator/Documents/UploadedProjects/<user id>/build/B4iProject.build/Release-iphoneos/B4iProject.build/SeZa\ Navigator.hmap

WriteAuxiliaryFile /Users/administrator/Documents/UploadedProjects/<user id>/build/B4iProject.build/Release-iphoneos/B4iProject.build/SeZa\ Navigator-project-headers.hmap (in target 'B4iProject' from project 'B4iProject')
cd /Users/administrator/Documents/UploadedProjects/<user id>
write-file /Users/administrator/Documents/UploadedProjects/<user id>/build/B4iProject.build/Release-iphoneos/B4iProject.build/SeZa\ Navigator-project-headers.hmap

WriteAuxiliaryFile /Users/administrator/Documents/UploadedProjects/<user id>/build/B4iProject.build/Release-iphoneos/B4iProject.build/SeZa\ Navigator-own-target-headers.hmap (in target 'B4iProject' from project 'B4iProject')
cd /Users/administrator/Documents/UploadedProjects/<user id>
write-file /Users/administrator/Documents/UploadedProjects/<user id>/build/B4iProject.build/Release-iphoneos/B4iProject.build/SeZa\ Navigator-own-target-headers.hmap

WriteAuxiliaryFile /Users/administrator/Documents/UploadedProjects/<user id>/build/B4iProject.build/Release-iphoneos/B4iProject.build/SeZa\ Navigator-all-target-headers.hmap (in target 'B4iProject' from project 'B4iProject')
cd /Users/administrator/Documents/UploadedProjects/<user id>
write-file /Users/administrator/Documents/UploadedProjects/<user id>/build/B4iProject.build/Release-iphoneos/B4iProject.build/SeZa\ Navigator-all-target-headers.hmap

WriteAuxiliaryFile /Users/administrator/Documents/UploadedProjects/<user id>/build/B4iProject.build/Release-iphoneos/B4iProject.build/SeZa\ Navigator-generated-files.hmap (in target 'B4iProject' from project 'B4iProject')
cd /Users/administrator/Documents/UploadedProjects/<user id>
write-file /Users/administrator/Documents/UploadedProjects/<user id>/build/B4iProject.build/Release-iphoneos/B4iProject.build/SeZa\ Navigator-generated-files.hmap

WriteAuxiliaryFile /Users/administrator/Documents/UploadedProjects/<user id>/build/B4iProject.build/Release-iphoneos/B4iProject.build/SeZa\ Navigator-all-non-framework-target-headers.hmap (in target 'B4iProject' from project 'B4iProject')
cd /Users/administrator/Documents/UploadedProjects/<user id>
write-file /Users/administrator/Documents/UploadedProjects/<user id>/build/B4iProject.build/Release-iphoneos/B4iProject.build/SeZa\ Navigator-all-non-framework-target-headers.hmap

CompileC /Users/administrator/Documents/UploadedProjects/<user id>/build/B4iProject.build/Release-iphoneos/B4iProject.build/Objects-normal/arm64/main.o /Users/administrator/Documents/UploadedProjects/<user id>/B4iProject/main.m normal arm64 objective-c com.apple.compilers.llvm.clang.1_0.compiler (in target 'B4iProject' from project 'B4iProject')
cd /Users/administrator/Documents/UploadedProjects/<user id>
export LANG=en_US.US-ASCII
/Applications/Xcode.app/Contents/Developer/Toolchains/XcodeDefault.xctoolchain/usr/bin/clang -x objective-c -target arm64-apple-ios8.0 -fmessage-length=0 -fdiagnostics-show-note-include-stack -fmacro-backtrace-limit=0 -std=gnu99 -fobjc-arc -fmodules -gmodules -fmodules-prune-interval=86400 -fmodules-prune-after=345600 -fbuild-session-file=/var/folders/lj/wrbzzxds6b53f88_rx3x7c800000gn/C/org.llvm.clang/ModuleCache.noindex/Session.modulevalidation -fmodules-validate-once-per-build-session -Wnon-modular-include-in-framework-module -Werror=non-modular-include-in-framework-module -Wno-trigraphs -fpascal-strings -O0 -Wno-missing-field-initializers -Wno-missing-prototypes -Werror=return-type -Wno-implicit-atomic-properties -Werror=deprecated-objc-isa-usage -Wno-objc-interface-ivars -Werror=objc-root-class -Wno-arc-repeated-use-of-weak -Wduplicate-method-match -Wno-missing-braces -Wparentheses -Wswitch -Wunused-function -Wno-unused-label -Wno-unused-parameter -Wunused-variable -Wunused-value -Wempty-body -Wuninitialized -Wconditional-uninitialized -Wno-unknown-pragmas -Wno-shadow -Wno-four-char-constants -Wno-conversion -Wconstant-conversion -Wint-conversion -Wbool-conversion -Wenum-conversion -Wno-float-conversion -Wno-non-literal-null-conversion -Wno-objc-literal-conversion -Wshorten-64-to-32 -Wpointer-sign -Wno-newline-eof -Wno-selector -Wno-strict-selector-match -Wundeclared-selector -Wno-deprecated-implementations -DB4I_VERSION=12 -DNS_BLOCK_ASSERTIONS=1 -DOBJC_OLD_DISPATCH_PROTOTYPES=1 -isysroot /Applications/Xcode.app/Contents/Developer/Platforms/iPhoneOS.platform/Developer/SDKs/iPhoneOS13.2.sdk -fstrict-aliasing -Wprotocol -Wdeprecated-declarations -fvisibility=hidden -Wno-sign-conversion -Wno-infinite-recursion -Wno-comma -Wno-block-capture-autoreleasing -Wno-strict-prototypes -Wno-semicolon-before-method-body -iquote /Users/administrator/Documents/UploadedProjects/<user id>/build/B4iProject.build/Release-iphoneos/B4iProject.build/SeZa\ Navigator-generated-files.hmap -I/Users/administrator/Documents/UploadedProjects/<user id>/build/B4iProject.build/Release-iphoneos/B4iProject.build/SeZa\ Navigator-own-target-headers.hmap -I/Users/administrator/Documents/UploadedProjects/<user id>/build/B4iProject.build/Release-iphoneos/B4iProject.build/SeZa\ Navigator-all-target-headers.hmap -iquote /Users/administrator/Documents/UploadedProjects/<user id>/build/B4iProject.build/Release-iphoneos/B4iProject.build/SeZa\ Navigator-project-headers.hmap -I/Users/administrator/Documents/UploadedProjects/<user id>/Payload/include -I/Users/administrator/Documents/UploadedProjects/<user id>/build/B4iProject.build/Release-iphoneos/B4iProject.build/DerivedSources-normal/arm64 -I/Users/administrator/Documents/UploadedProjects/<user id>/build/B4iProject.build/Release-iphoneos/B4iProject.build/DerivedSources/arm64 -I/Users/administrator/Documents/UploadedProjects/<user id>/build/B4iProject.build/Release-iphoneos/B4iProject.build/DerivedSources -F/Users/administrator/Documents/UploadedProjects/<user id>/Payload -F../../Libs -MMD -MT dependencies -MF /Users/administrator/Documents/UploadedProjects/<user id>/build/B4iProject.build/Release-iphoneos/B4iProject.build/Objects-normal/arm64/main.d --serialize-diagnostics /Users/administrator/Documents/UploadedProjects/<user id>/build/B4iProject.build/Release-iphoneos/B4iProject.build/Objects-normal/arm64/main.dia -c /Users/administrator/Documents/UploadedProjects/<user id>/B4iProject/main.m -o /Users/administrator/Documents/UploadedProjects/<user id>/build/B4iProject.build/Release-iphoneos/B4iProject.build/Objects-normal/arm64/main.o

CompileC /Users/administrator/Documents/UploadedProjects/<user id>/build/B4iProject.build/Release-iphoneos/B4iProject.build/Objects-normal/arm64/b4i_roundslider.o /Users/administrator/Documents/UploadedProjects/<user id>/B4iProject/b4i_roundslider.m normal arm64 objective-c com.apple.compilers.llvm.clang.1_0.compiler (in target 'B4iProject' from project 'B4iProject')
cd /Users/administrator/Documents/UploadedProjects/<user id>
export LANG=en_US.US-ASCII
/Applications/Xcode.app/Contents/Developer/Toolchains/XcodeDefault.xctoolchain/usr/bin/clang -x objective-c -target arm64-apple-ios8.0 -fmessage-length=0 -fdiagnostics-show-note-include-stack -fmacro-backtrace-limit=0 -std=gnu99 -fobjc-arc -fmodules -gmodules -fmodules-prune-interval=86400 -fmodules-prune-after=345600 -fbuild-session-file=/var/folders/lj/wrbzzxds6b53f88_rx3x7c800000gn/C/org.llvm.clang/ModuleCache.noindex/Session.modulevalidation -fmodules-validate-once-per-build-session -Wnon-modular-include-in-framework-module -Werror=non-modular-include-in-framework-module -Wno-trigraphs -fpascal-strings -O0 -Wno-missing-field-initializers -Wno-missing-prototypes -Werror=return-type -Wno-implicit-atomic-properties -Werror=deprecated-objc-isa-usage -Wno-objc-interface-ivars -Werror=objc-root-class -Wno-arc-repeated-use-of-weak -Wduplicate-method-match -Wno-missing-braces -Wparentheses -Wswitch -Wunused-function -Wno-unused-label -Wno-unused-parameter -Wunused-variable -Wunused-value -Wempty-body -Wuninitialized -Wconditional-uninitialized -Wno-unknown-pragmas -Wno-shadow -Wno-four-char-constants -Wno-conversion -Wconstant-conversion -Wint-conversion -Wbool-conversion -Wenum-conversion -Wno-float-conversion -Wno-non-literal-null-conversion -Wno-objc-literal-conversion -Wshorten-64-to-32 -Wpointer-sign -Wno-newline-eof -Wno-selector -Wno-strict-selector-match -Wundeclared-selector -Wno-deprecated-implementations -DB4I_VERSION=12 -DNS_BLOCK_ASSERTIONS=1 -DOBJC_OLD_DISPATCH_PROTOTYPES=1 -isysroot /Applications/Xcode.app/Contents/Developer/Platforms/iPhoneOS.platform/Developer/SDKs/iPhoneOS13.2.sdk -fstrict-aliasing -Wprotocol -Wdeprecated-declarations -fvisibility=hidden -Wno-sign-conversion -Wno-infinite-recursion -Wno-comma -Wno-block-capture-autoreleasing -Wno-strict-prototypes -Wno-semicolon-before-method-body -iquote /Users/administrator/Documents/UploadedProjects/<user id>/build/B4iProject.build/Release-iphoneos/B4iProject.build/SeZa\ Navigator-generated-files.hmap -I/Users/administrator/Documents/UploadedProjects/<user id>/build/B4iProject.build/Release-iphoneos/B4iProject.build/SeZa\ Navigator-own-target-headers.hmap -I/Users/administrator/Documents/UploadedProjects/<user id>/build/B4iProject.build/Release-iphoneos/B4iProject.build/SeZa\ Navigator-all-target-headers.hmap -iquote /Users/administrator/Documents/UploadedProjects/<user id>/build/B4iProject.build/Release-iphoneos/B4iProject.build/SeZa\ Navigator-project-headers.hmap -I/Users/administrator/Documents/UploadedProjects/<user id>/Payload/include -I/Users/administrator/Documents/UploadedProjects/<user id>/build/B4iProject.build/Release-iphoneos/B4iProject.build/DerivedSources-normal/arm64 -I/Users/administrator/Documents/UploadedProjects/<user id>/build/B4iProject.build/Release-iphoneos/B4iProject.build/DerivedSources/arm64 -I/Users/administrator/Documents/UploadedProjects/<user id>/build/B4iProject.build/Release-iphoneos/B4iProject.build/DerivedSources -F/Users/administrator/Documents/UploadedProjects/<user id>/Payload -F../../Libs -MMD -MT dependencies -MF /Users/administrator/Documents/UploadedProjects/<user id>/build/B4iProject.build/Release-iphoneos/B4iProject.build/Objects-normal/arm64/b4i_roundslider.d --serialize-diagnostics /Users/administrator/Documents/UploadedProjects/<user id>/build/B4iProject.build/Release-iphoneos/B4iProject.build/Objects-normal/arm64/b4i_roundslider.dia -c /Users/administrator/Documents/UploadedProjects/<user id>/B4iProject/b4i_roundslider.m -o /Users/administrator/Documents/UploadedProjects/<user id>/build/B4iProject.build/Release-iphoneos/B4iProject.build/Objects-normal/arm64/b4i_roundslider.o
In file included from /Users/administrator/Documents/UploadedProjects/<user id>/B4iProject/b4i_roundslider.m:2:
/Users/administrator/Documents/UploadedProjects/<user id>/B4iProject/b4i_roundslider.h:2:9: fatal error: 'ByteConverter.h' file not found
#import "ByteConverter.h"
^~~~~~~~~~~~~~~~~

CompileC /Users/administrator/Documents/UploadedProjects/<user id>/build/B4iProject.build/Release-iphoneos/B4iProject.build/Objects-normal/arm64/b4i_myhelper.o /Users/administrator/Documents/UploadedProjects/<user id>/B4iProject/b4i_myhelper.m normal arm64 objective-c com.apple.compilers.llvm.clang.1_0.compiler (in target 'B4iProject' from project 'B4iProject')
cd /Users/administrator/Documents/UploadedProjects/<user id>
export LANG=en_US.US-ASCII
/Applications/Xcode.app/Contents/Developer/Toolchains/XcodeDefault.xctoolchain/usr/bin/clang -x objective-c -target arm64-apple-ios8.0 -fmessage-length=0 -fdiagnostics-show-note-include-stack -fmacro-backtrace-limit=0 -std=gnu99 -fobjc-arc -fmodules -gmodules -fmodules-prune-interval=86400 -fmodules-prune-after=345600 -fbuild-session-file=/var/folders/lj/wrbzzxds6b53f88_rx3x7c800000gn/C/org.llvm.clang/ModuleCache.noindex/Session.modulevalidation -fmodules-validate-once-per-build-session -Wnon-modular-include-in-framework-module -Werror=non-modular-include-in-framework-module -Wno-trigraphs -fpascal-strings -O0 -Wno-missing-field-initializers -Wno-missing-prototypes -Werror=return-type -Wno-implicit-atomic-properties -Werror=deprecated-objc-isa-usage -Wno-objc-interface-ivars -Werror=objc-root-class -Wno-arc-repeated-use-of-weak -Wduplicate-method-match -Wno-missing-braces -Wparentheses -Wswitch -Wunused-function -Wno-unused-label -Wno-unused-parameter -Wunused-variable -Wunused-value -Wempty-body -Wuninitialized -Wconditional-uninitialized -Wno-unknown-pragmas -Wno-shadow -Wno-four-char-constants -Wno-conversion -Wconstant-conversion -Wint-conversion -Wbool-conversion -Wenum-conversion -Wno-float-conversion -Wno-non-literal-null-conversion -Wno-objc-literal-conversion -Wshorten-64-to-32 -Wpointer-sign -Wno-newline-eof -Wno-selector -Wno-strict-selector-match -Wundeclared-selector -Wno-deprecated-implementations -DB4I_VERSION=12 -DNS_BLOCK_ASSERTIONS=1 -DOBJC_OLD_DISPATCH_PROTOTYPES=1 -isysroot /Applications/Xcode.app/Contents/Developer/Platforms/iPhoneOS.platform/Developer/SDKs/iPhoneOS13.2.sdk -fstrict-aliasing -Wprotocol -Wdeprecated-declarations -fvisibility=hidden -Wno-sign-conversion -Wno-infinite-recursion -Wno-comma -Wno-block-capture-autoreleasing -Wno-strict-prototypes -Wno-semicolon-before-method-body -iquote /Users/administrator/Documents/UploadedProjects/<user id>/build/B4iProject.build/Release-iphoneos/B4iProject.build/SeZa\ Navigator-generated-files.hmap -I/Users/administrator/Documents/UploadedProjects/<user id>/build/B4iProject.build/Release-iphoneos/B4iProject.build/SeZa\ Navigator-own-target-headers.hmap -I/Users/administrator/Documents/UploadedProjects/<user id>/build/B4iProject.build/Release-iphoneos/B4iProject.build/SeZa\ Navigator-all-target-headers.hmap -iquote /Users/administrator/Documents/UploadedProjects/<user id>/build/B4iProject.build/Release-iphoneos/B4iProject.build/SeZa\ Navigator-project-headers.hmap -I/Users/administrator/Documents/UploadedProjects/<user id>/Payload/include -I/Users/administrator/Documents/UploadedProjects/<user id>/build/B4iProject.build/Release-iphoneos/B4iProject.build/DerivedSources-normal/arm64 -I/Users/administrator/Documents/UploadedProjects/<user id>/build/B4iProject.build/Release-iphoneos/B4iProject.build/DerivedSources/arm64 -I/Users/administrator/Documents/UploadedProjects/<user id>/build/B4iProject.build/Release-iphoneos/B4iProject.build/DerivedSources -F/Users/administrator/Documents/UploadedProjects/<user id>/Payload -F../../Libs -MMD -MT dependencies -MF /Users/administrator/Documents/UploadedProjects/<user id>/build/B4iProject.build/Release-iphoneos/B4iProject.build/Objects-normal/arm64/b4i_myhelper.d --serialize-diagnostics /Users/administrator/Documents/UploadedProjects/<user id>/build/B4iProject.build/Release-iphoneos/B4iProject.build/Objects-normal/arm64/b4i_myhelper.dia -c /Users/administrator/Documents/UploadedProjects/<user id>/B4iProject/b4i_myhelper.m -o /Users/administrator/Documents/UploadedProjects/<user id>/build/B4iProject.build/Release-iphoneos/B4iProject.build/Objects-normal/arm64/b4i_myhelper.o
In file included from /Users/administrator/Documents/UploadedProjects/<user id>/B4iProject/b4i_myhelper.m:2:
/Users/administrator/Documents/UploadedProjects/<user id>/B4iProject/b4i_myhelper.h:2:9: fatal error: 'ByteConverter.h' file not found
#import "ByteConverter.h"
^~~~~~~~~~~~~~~~~

CompileC /Users/administrator/Documents/UploadedProjects/<user id>/build/B4iProject.build/Release-iphoneos/B4iProject.build/Objects-normal/arm64/b4i_scrollinglabel.o /Users/administrator/Documents/UploadedProjects/<user id>/B4iProject/b4i_scrollinglabel.m normal arm64 objective-c com.apple.compilers.llvm.clang.1_0.compiler (in target 'B4iProject' from project 'B4iProject')
cd /Users/administrator/Documents/UploadedProjects/<user id>
export LANG=en_US.US-ASCII
/Applications/Xcode.app/Contents/Developer/Toolchains/XcodeDefault.xctoolchain/usr/bin/clang -x objective-c -target arm64-apple-ios8.0 -fmessage-length=0 -fdiagnostics-show-note-include-stack -fmacro-backtrace-limit=0 -std=gnu99 -fobjc-arc -fmodules -gmodules -fmodules-prune-interval=86400 -fmodules-prune-after=345600 -fbuild-session-file=/var/folders/lj/wrbzzxds6b53f88_rx3x7c800000gn/C/org.llvm.clang/ModuleCache.noindex/Session.modulevalidation -fmodules-validate-once-per-build-session -Wnon-modular-include-in-framework-module -Werror=non-modular-include-in-framework-module -Wno-trigraphs -fpascal-strings -O0 -Wno-missing-field-initializers -Wno-missing-prototypes -Werror=return-type -Wno-implicit-atomic-properties -Werror=deprecated-objc-isa-usage -Wno-objc-interface-ivars -Werror=objc-root-class -Wno-arc-repeated-use-of-weak -Wduplicate-method-match -Wno-missing-braces -Wparentheses -Wswitch -Wunused-function -Wno-unused-label -Wno-unused-parameter -Wunused-variable -Wunused-value -Wempty-body -Wuninitialized -Wconditional-uninitialized -Wno-unknown-pragmas -Wno-shadow -Wno-four-char-constants -Wno-conversion -Wconstant-conversion -Wint-conversion -Wbool-conversion -Wenum-conversion -Wno-float-conversion -Wno-non-literal-null-conversion -Wno-objc-literal-conversion -Wshorten-64-to-32 -Wpointer-sign -Wno-newline-eof -Wno-selector -Wno-strict-selector-match -Wundeclared-selector -Wno-deprecated-implementations -DB4I_VERSION=12 -DNS_BLOCK_ASSERTIONS=1 -DOBJC_OLD_DISPATCH_PROTOTYPES=1 -isysroot /Applications/Xcode.app/Contents/Developer/Platforms/iPhoneOS.platform/Developer/SDKs/iPhoneOS13.2.sdk -fstrict-aliasing -Wprotocol -Wdeprecated-declarations -fvisibility=hidden -Wno-sign-conversion -Wno-infinite-recursion -Wno-comma -Wno-block-capture-autoreleasing -Wno-strict-prototypes -Wno-semicolon-before-method-body -iquote /Users/administrator/Documents/UploadedProjects/<user id>/build/B4iProject.build/Release-iphoneos/B4iProject.build/SeZa\ Navigator-generated-files.hmap -I/Users/administrator/Documents/UploadedProjects/<user id>/build/B4iProject.build/Release-iphoneos/B4iProject.build/SeZa\ Navigator-own-target-headers.hmap -I/Users/administrator/Documents/UploadedProjects/<user id>/build/B4iProject.build/Release-iphoneos/B4iProject.build/SeZa\ Navigator-all-target-headers.hmap -iquote /Users/administrator/Documents/UploadedProjects/<user id>/build/B4iProject.build/Release-iphoneos/B4iProject.build/SeZa\ Navigator-project-headers.hmap -I/Users/administrator/Documents/UploadedProjects/<user id>/Payload/include -I/Users/administrator/Documents/UploadedProjects/<user id>/build/B4iProject.build/Release-iphoneos/B4iProject.build/DerivedSources-normal/arm64 -I/Users/administrator/Documents/UploadedProjects/<user id>/build/B4iProject.build/Release-iphoneos/B4iProject.build/DerivedSources/arm64 -I/Users/administrator/Documents/UploadedProjects/<user id>/build/B4iProject.build/Release-iphoneos/B4iProject.build/DerivedSources -F/Users/administrator/Documents/UploadedProjects/<user id>/Payload -F../../Libs -MMD -MT dependencies -MF /Users/administrator/Documents/UploadedProjects/<user id>/build/B4iProject.build/Release-iphoneos/B4iProject.build/Objects-normal/arm64/b4i_scrollinglabel.d --serialize-diagnostics /Users/administrator/Documents/UploadedProjects/<user id>/build/B4iProject.build/Release-iphoneos/B4iProject.build/Objects-normal/arm64/b4i_scrollinglabel.dia -c /Users/administrator/Documents/UploadedProjects/<user id>/B4iProject/b4i_scrollinglabel.m -o /Users/administrator/Documents/UploadedProjects/<user id>/build/B4iProject.build/Release-iphoneos/B4iProject.build/Objects-normal/arm64/b4i_scrollinglabel.o
In file included from /Users/administrator/Documents/UploadedProjects/<user id>/B4iProject/b4i_scrollinglabel.m:2:
/Users/administrator/Documents/UploadedProjects/<user id>/B4iProject/b4i_scrollinglabel.h:2:9: fatal error: 'ByteConverter.h' file not found
#import "ByteConverter.h"
^~~~~~~~~~~~~~~~~

CompileC /Users/administrator/Documents/UploadedProjects/<user id>/build/B4iProject.build/Release-iphoneos/B4iProject.build/Objects-normal/arm64/b4i_swiftbutton.o /Users/administrator/Documents/UploadedProjects/<user id>/B4iProject/b4i_swiftbutton.m normal arm64 objective-c com.apple.compilers.llvm.clang.1_0.compiler (in target 'B4iProject' from project 'B4iProject')
cd /Users/administrator/Documents/UploadedProjects/<user id>
export LANG=en_US.US-ASCII
/Applications/Xcode.app/Contents/Developer/Toolchains/XcodeDefault.xctoolchain/usr/bin/clang -x objective-c -target arm64-apple-ios8.0 -fmessage-length=0 -fdiagnostics-show-note-include-stack -fmacro-backtrace-limit=0 -std=gnu99 -fobjc-arc -fmodules -gmodules -fmodules-prune-interval=86400 -fmodules-prune-after=345600 -fbuild-session-file=/var/folders/lj/wrbzzxds6b53f88_rx3x7c800000gn/C/org.llvm.clang/ModuleCache.noindex/Session.modulevalidation -fmodules-validate-once-per-build-session -Wnon-modular-include-in-framework-module -Werror=non-modular-include-in-framework-module -Wno-trigraphs -fpascal-strings -O0 -Wno-missing-field-initializers -Wno-missing-prototypes -Werror=return-type -Wno-implicit-atomic-properties -Werror=deprecated-objc-isa-usage -Wno-objc-interface-ivars -Werror=objc-root-class -Wno-arc-repeated-use-of-weak -Wduplicate-method-match -Wno-missing-braces -Wparentheses -Wswitch -Wunused-function -Wno-unused-label -Wno-unused-parameter -Wunused-variable -Wunused-value -Wempty-body -Wuninitialized -Wconditional-uninitialized -Wno-unknown-pragmas -Wno-shadow -Wno-four-char-constants -Wno-conversion -Wconstant-conversion -Wint-conversion -Wbool-conversion -Wenum-conversion -Wno-float-conversion -Wno-non-literal-null-conversion -Wno-objc-literal-conversion -Wshorten-64-to-32 -Wpointer-sign -Wno-newline-eof -Wno-selector -Wno-strict-selector-match -Wundeclared-selector -Wno-deprecated-implementations -DB4I_VERSION=12 -DNS_BLOCK_ASSERTIONS=1 -DOBJC_OLD_DISPATCH_PROTOTYPES=1 -isysroot /Applications/Xcode.app/Contents/Developer/Platforms/iPhoneOS.platform/Developer/SDKs/iPhoneOS13.2.sdk -fstrict-aliasing -Wprotocol -Wdeprecated-declarations -fvisibility=hidden -Wno-sign-conversion -Wno-infinite-recursion -Wno-comma -Wno-block-capture-autoreleasing -Wno-strict-prototypes -Wno-semicolon-before-method-body -iquote /Users/administrator/Documents/UploadedProjects/<user id>/build/B4iProject.build/Release-iphoneos/B4iProject.build/SeZa\ Navigator-generated-files.hmap -I/Users/administrator/Documents/UploadedProjects/<user id>/build/B4iProject.build/Release-iphoneos/B4iProject.build/SeZa\ Navigator-own-target-headers.hmap -I/Users/administrator/Documents/UploadedProjects/<user id>/build/B4iProject.build/Release-iphoneos/B4iProject.build/SeZa\ Navigator-all-target-headers.hmap -iquote /Users/administrator/Documents/UploadedProjects/<user id>/build/B4iProject.build/Release-iphoneos/B4iProject.build/SeZa\ Navigator-project-headers.hmap -I/Users/administrator/Documents/UploadedProjects/<user id>/Payload/include -I/Users/administrator/Documents/UploadedProjects/<user id>/build/B4iProject.build/Release-iphoneos/B4iProject.build/DerivedSources-normal/arm64 -I/Users/administrator/Documents/UploadedProjects/<user id>/build/B4iProject.build/Release-iphoneos/B4iProject.build/DerivedSources/arm64 -I/Users/administrator/Documents/UploadedProjects/<user id>/build/B4iProject.build/Release-iphoneos/B4iProject.build/DerivedSources -F/Users/administrator/Documents/UploadedProjects/<user id>/Payload -F../../Libs -MMD -MT dependencies -MF /Users/administrator/Documents/UploadedProjects/<user id>/build/B4iProject.build/Release-iphoneos/B4iProject.build/Objects-normal/arm64/b4i_swiftbutton.d --serialize-diagnostics /Users/administrator/Documents/UploadedProjects/<user id>/build/B4iProject.build/Release-iphoneos/B4iProject.build/Objects-normal/arm64/b4i_swiftbutton.dia -c /Users/administrator/Documents/UploadedProjects/<user id>/B4iProject/b4i_swiftbutton.m -o /Users/administrator/Documents/UploadedProjects/<user id>/build/B4iProject.build/Release-iphoneos/B4iProject.build/Objects-normal/arm64/b4i_swiftbutton.o
In file included from /Users/administrator/Documents/UploadedProjects/<user id>/B4iProject/b4i_swiftbutton.m:2:
/Users/administrator/Documents/UploadedProjects/<user id>/B4iProject/b4i_swiftbutton.h:2:9: fatal error: 'ByteConverter.h' file not found
#import "ByteConverter.h"
^~~~~~~~~~~~~~~~~

CompileC /Users/administrator/Documents/UploadedProjects/<user id>/build/B4iProject.build/Release-iphoneos/B4iProject.build/Objects-normal/arm64/b4i_main.o /Users/administrator/Documents/UploadedProjects/<user id>/B4iProject/b4i_main.m normal arm64 objective-c com.apple.compilers.llvm.clang.1_0.compiler (in target 'B4iProject' from project 'B4iProject')
cd /Users/administrator/Documents/UploadedProjects/<user id>
export LANG=en_US.US-ASCII
/Applications/Xcode.app/Contents/Developer/Toolchains/XcodeDefault.xctoolchain/usr/bin/clang -x objective-c -target arm64-apple-ios8.0 -fmessage-length=0 -fdiagnostics-show-note-include-stack -fmacro-backtrace-limit=0 -std=gnu99 -fobjc-arc -fmodules -gmodules -fmodules-prune-interval=86400 -fmodules-prune-after=345600 -fbuild-session-file=/var/folders/lj/wrbzzxds6b53f88_rx3x7c800000gn/C/org.llvm.clang/ModuleCache.noindex/Session.modulevalidation -fmodules-validate-once-per-build-session -Wnon-modular-include-in-framework-module -Werror=non-modular-include-in-framework-module -Wno-trigraphs -fpascal-strings -O0 -Wno-missing-field-initializers -Wno-missing-prototypes -Werror=return-type -Wno-implicit-atomic-properties -Werror=deprecated-objc-isa-usage -Wno-objc-interface-ivars -Werror=objc-root-class -Wno-arc-repeated-use-of-weak -Wduplicate-method-match -Wno-missing-braces -Wparentheses -Wswitch -Wunused-function -Wno-unused-label -Wno-unused-parameter -Wunused-variable -Wunused-value -Wempty-body -Wuninitialized -Wconditional-uninitialized -Wno-unknown-pragmas -Wno-shadow -Wno-four-char-constants -Wno-conversion -Wconstant-conversion -Wint-conversion -Wbool-conversion -Wenum-conversion -Wno-float-conversion -Wno-non-literal-null-conversion -Wno-objc-literal-conversion -Wshorten-64-to-32 -Wpointer-sign -Wno-newline-eof -Wno-selector -Wno-strict-selector-match -Wundeclared-selector -Wno-deprecated-implementations -DB4I_VERSION=12 -DNS_BLOCK_ASSERTIONS=1 -DOBJC_OLD_DISPATCH_PROTOTYPES=1 -isysroot /Applications/Xcode.app/Contents/Developer/Platforms/iPhoneOS.platform/Developer/SDKs/iPhoneOS13.2.sdk -fstrict-aliasing -Wprotocol -Wdeprecated-declarations -fvisibility=hidden -Wno-sign-conversion -Wno-infinite-recursion -Wno-comma -Wno-block-capture-autoreleasing -Wno-strict-prototypes -Wno-semicolon-before-method-body -iquote /Users/administrator/Documents/UploadedProjects/<user id>/build/B4iProject.build/Release-iphoneos/B4iProject.build/SeZa\ Navigator-generated-files.hmap -I/Users/administrator/Documents/UploadedProjects/<user id>/build/B4iProject.build/Release-iphoneos/B4iProject.build/SeZa\ Navigator-own-target-headers.hmap -I/Users/administrator/Documents/UploadedProjects/<user id>/build/B4iProject.build/Release-iphoneos/B4iProject.build/SeZa\ Navigator-all-target-headers.hmap -iquote /Users/administrator/Documents/UploadedProjects/<user id>/build/B4iProject.build/Release-iphoneos/B4iProject.build/SeZa\ Navigator-project-headers.hmap -I/Users/administrator/Documents/UploadedProjects/<user id>/Payload/include -I/Users/administrator/Documents/UploadedProjects/<user id>/build/B4iProject.build/Release-iphoneos/B4iProject.build/DerivedSources-normal/arm64 -I/Users/administrator/Documents/UploadedProjects/<user id>/build/B4iProject.build/Release-iphoneos/B4iProject.build/DerivedSources/arm64 -I/Users/administrator/Documents/UploadedProjects/<user id>/build/B4iProject.build/Release-iphoneos/B4iProject.build/DerivedSources -F/Users/administrator/Documents/UploadedProjects/<user id>/Payload -F../../Libs -MMD -MT dependencies -MF /Users/administrator/Documents/UploadedProjects/<user id>/build/B4iProject.build/Release-iphoneos/B4iProject.build/Objects-normal/arm64/b4i_main.d --serialize-diagnostics /Users/administrator/Documents/UploadedProjects/<user id>/build/B4iProject.build/Release-iphoneos/B4iProject.build/Objects-normal/arm64/b4i_main.dia -c /Users/administrator/Documents/UploadedProjects/<user id>/B4iProject/b4i_main.m -o /Users/administrator/Documents/UploadedProjects/<user id>/build/B4iProject.build/Release-iphoneos/B4iProject.build/Objects-normal/arm64/b4i_main.o
In file included from /Users/administrator/Documents/UploadedProjects/<user id>/B4iProject/b4i_main.m:2:
/Users/administrator/Documents/UploadedProjects/<user id>/B4iProject/b4i_main.h:2:9: fatal error: 'ByteConverter.h' file not found
#import "ByteConverter.h"
^~~~~~~~~~~~~~~~~
1 error generated.

CompileC /Users/administrator/Documents/UploadedProjects/<user id>/build/B4iProject.build/Release-iphoneos/B4iProject.build/Objects-normal/arm64/b4i_madewithlove.o /Users/administrator/Documents/UploadedProjects/<user id>/B4iProject/b4i_madewithlove.m normal arm64 objective-c com.apple.compilers.llvm.clang.1_0.compiler (in target 'B4iProject' from project 'B4iProject')
cd /Users/administrator/Documents/UploadedProjects/<user id>
export LANG=en_US.US-ASCII
/Applications/Xcode.app/Contents/Developer/Toolchains/XcodeDefault.xctoolchain/usr/bin/clang -x objective-c -target arm64-apple-ios8.0 -fmessage-length=0 -fdiagnostics-show-note-include-stack -fmacro-backtrace-limit=0 -std=gnu99 -fobjc-arc -fmodules -gmodules -fmodules-prune-interval=86400 -fmodules-prune-after=345600 -fbuild-session-file=/var/folders/lj/wrbzzxds6b53f88_rx3x7c800000gn/C/org.llvm.clang/ModuleCache.noindex/Session.modulevalidation -fmodules-validate-once-per-build-session -Wnon-modular-include-in-framework-module -Werror=non-modular-include-in-framework-module -Wno-trigraphs -fpascal-strings -O0 -Wno-missing-field-initializers -Wno-missing-prototypes -Werror=return-type -Wno-implicit-atomic-properties -Werror=deprecated-objc-isa-usage -Wno-objc-interface-ivars -Werror=objc-root-class -Wno-arc-repeated-use-of-weak -Wduplicate-method-match -Wno-missing-braces -Wparentheses -Wswitch -Wunused-function -Wno-unused-label -Wno-unused-parameter -Wunused-variable -Wunused-value -Wempty-body -Wuninitialized -Wconditional-uninitialized -Wno-unknown-pragmas -Wno-shadow -Wno-four-char-constants -Wno-conversion -Wconstant-conversion -Wint-conversion -Wbool-conversion -Wenum-conversion -Wno-float-conversion -Wno-non-literal-null-conversion -Wno-objc-literal-conversion -Wshorten-64-to-32 -Wpointer-sign -Wno-newline-eof -Wno-selector -Wno-strict-selector-match -Wundeclared-selector -Wno-deprecated-implementations -DB4I_VERSION=12 -DNS_BLOCK_ASSERTIONS=1 -DOBJC_OLD_DISPATCH_PROTOTYPES=1 -isysroot /Applications/Xcode.app/Contents/Developer/Platforms/iPhoneOS.platform/Developer/SDKs/iPhoneOS13.2.sdk -fstrict-aliasing -Wprotocol -Wdeprecated-declarations -fvisibility=hidden -Wno-sign-conversion -Wno-infinite-recursion -Wno-comma -Wno-block-capture-autoreleasing -Wno-strict-prototypes -Wno-semicolon-before-method-body -iquote /Users/administrator/Documents/UploadedProjects/<user id>/build/B4iProject.build/Release-iphoneos/B4iProject.build/SeZa\ Navigator-generated-files.hmap -I/Users/administrator/Documents/UploadedProjects/<user id>/build/B4iProject.build/Release-iphoneos/B4iProject.build/SeZa\ Navigator-own-target-headers.hmap -I/Users/administrator/Documents/UploadedProjects/<user id>/build/B4iProject.build/Release-iphoneos/B4iProject.build/SeZa\ Navigator-all-target-headers.hmap -iquote /Users/administrator/Documents/UploadedProjects/<user id>/build/B4iProject.build/Release-iphoneos/B4iProject.build/SeZa\ Navigator-project-headers.hmap -I/Users/administrator/Documents/UploadedProjects/<user id>/Payload/include -I/Users/administrator/Documents/UploadedProjects/<user id>/build/B4iProject.build/Release-iphoneos/B4iProject.build/DerivedSources-normal/arm64 -I/Users/administrator/Documents/UploadedProjects/<user id>/build/B4iProject.build/Release-iphoneos/B4iProject.build/DerivedSources/arm64 -I/Users/administrator/Documents/UploadedProjects/<user id>/build/B4iProject.build/Release-iphoneos/B4iProject.build/DerivedSources -F/Users/administrator/Documents/UploadedProjects/<user id>/Payload -F../../Libs -MMD -MT dependencies -MF /Users/administrator/Documents/UploadedProjects/<user id>/build/B4iProject.build/Release-iphoneos/B4iProject.build/Objects-normal/arm64/b4i_madewithlove.d --serialize-diagnostics /Users/administrator/Documents/UploadedProjects/<user id>/build/B4iProject.build/Release-iphoneos/B4iProject.build/Objects-normal/arm64/b4i_madewithlove.dia -c /Users/administrator/Documents/UploadedProjects/<user id>/B4iProject/b4i_madewithlove.m -o /Users/administrator/Documents/UploadedProjects/<user id>/build/B4iProject.build/Release-iphoneos/B4iProject.build/Objects-normal/arm64/b4i_madewithlove.o
In file included from /Users/administrator/Documents/UploadedProjects/<user id>/B4iProject/b4i_madewithlove.m:2:
/Users/administrator/Documents/UploadedProjects/<user id>/B4iProject/b4i_madewithlove.h:2:9: fatal error: 'ByteConverter.h' file not found
#import "ByteConverter.h"
^~~~~~~~~~~~~~~~~

CompileC /Users/administrator/Documents/UploadedProjects/<user id>/build/B4iProject.build/Release-iphoneos/B4iProject.build/Objects-normal/arm64/b4i_localizator.o /Users/administrator/Documents/UploadedProjects/<user id>/B4iProject/b4i_localizator.m normal arm64 objective-c com.apple.compilers.llvm.clang.1_0.compiler (in target 'B4iProject' from project 'B4iProject')
cd /Users/administrator/Documents/UploadedProjects/<user id>
export LANG=en_US.US-ASCII
/Applications/Xcode.app/Contents/Developer/Toolchains/XcodeDefault.xctoolchain/usr/bin/clang -x objective-c -target arm64-apple-ios8.0 -fmessage-length=0 -fdiagnostics-show-note-include-stack -fmacro-backtrace-limit=0 -std=gnu99 -fobjc-arc -fmodules -gmodules -fmodules-prune-interval=86400 -fmodules-prune-after=345600 -fbuild-session-file=/var/folders/lj/wrbzzxds6b53f88_rx3x7c800000gn/C/org.llvm.clang/ModuleCache.noindex/Session.modulevalidation -fmodules-validate-once-per-build-session -Wnon-modular-include-in-framework-module -Werror=non-modular-include-in-framework-module -Wno-trigraphs -fpascal-strings -O0 -Wno-missing-field-initializers -Wno-missing-prototypes -Werror=return-type -Wno-implicit-atomic-properties -Werror=deprecated-objc-isa-usage -Wno-objc-interface-ivars -Werror=objc-root-class -Wno-arc-repeated-use-of-weak -Wduplicate-method-match -Wno-missing-braces -Wparentheses -Wswitch -Wunused-function -Wno-unused-label -Wno-unused-parameter -Wunused-variable -Wunused-value -Wempty-body -Wuninitialized -Wconditional-uninitialized -Wno-unknown-pragmas -Wno-shadow -Wno-four-char-constants -Wno-conversion -Wconstant-conversion -Wint-conversion -Wbool-conversion -Wenum-conversion -Wno-float-conversion -Wno-non-literal-null-conversion -Wno-objc-literal-conversion -Wshorten-64-to-32 -Wpointer-sign -Wno-newline-eof -Wno-selector -Wno-strict-selector-match -Wundeclared-selector -Wno-deprecated-implementations -DB4I_VERSION=12 -DNS_BLOCK_ASSERTIONS=1 -DOBJC_OLD_DISPATCH_PROTOTYPES=1 -isysroot /Applications/Xcode.app/Contents/Developer/Platforms/iPhoneOS.platform/Developer/SDKs/iPhoneOS13.2.sdk -fstrict-aliasing -Wprotocol -Wdeprecated-declarations -fvisibility=hidden -Wno-sign-conversion -Wno-infinite-recursion -Wno-comma -Wno-block-capture-autoreleasing -Wno-strict-prototypes -Wno-semicolon-before-method-body -iquote /Users/administrator/Documents/UploadedProjects/<user id>/build/B4iProject.build/Release-iphoneos/B4iProject.build/SeZa\ Navigator-generated-files.hmap -I/Users/administrator/Documents/UploadedProjects/<user id>/build/B4iProject.build/Release-iphoneos/B4iProject.build/SeZa\ Navigator-own-target-headers.hmap -I/Users/administrator/Documents/UploadedProjects/<user id>/build/B4iProject.build/Release-iphoneos/B4iProject.build/SeZa\ Navigator-all-target-headers.hmap -iquote /Users/administrator/Documents/UploadedProjects/<user id>/build/B4iProject.build/Release-iphoneos/B4iProject.build/SeZa\ Navigator-project-headers.hmap -I/Users/administrator/Documents/UploadedProjects/<user id>/Payload/include -I/Users/administrator/Documents/UploadedProjects/<user id>/build/B4iProject.build/Release-iphoneos/B4iProject.build/DerivedSources-normal/arm64 -I/Users/administrator/Documents/UploadedProjects/<user id>/build/B4iProject.build/Release-iphoneos/B4iProject.build/DerivedSources/arm64 -I/Users/administrator/Documents/UploadedProjects/<user id>/build/B4iProject.build/Release-iphoneos/B4iProject.build/DerivedSources -F/Users/administrator/Documents/UploadedProjects/<user id>/Payload -F../../Libs -MMD -MT dependencies -MF /Users/administrator/Documents/UploadedProjects/<user id>/build/B4iProject.build/Release-iphoneos/B4iProject.build/Objects-normal/arm64/b4i_localizator.d --serialize-diagnostics /Users/administrator/Documents/UploadedProjects/<user id>/build/B4iProject.build/Release-iphoneos/B4iProject.build/Objects-normal/arm64/b4i_localizator.dia -c /Users/administrator/Documents/UploadedProjects/<user id>/B4iProject/b4i_localizator.m -o /Users/administrator/Documents/UploadedProjects/<user id>/build/B4iProject.build/Release-iphoneos/B4iProject.build/Objects-normal/arm64/b4i_localizator.o
In file included from /Users/administrator/Documents/UploadedProjects/<user id>/B4iProject/b4i_localizator.m:2:
/Users/administrator/Documents/UploadedProjects/<user id>/B4iProject/b4i_localizator.h:2:9: fatal error: 'ByteConverter.h' file not found
#import "ByteConverter.h"
^~~~~~~~~~~~~~~~~
1

WriteAuxiliaryFile /Users/administrator/Documents/UploadedProjects/<user id>/build/B4iProject.build/Release-iphoneos/B4iProject.build/Objects-normal/arm64/SeZa\ Navigator.LinkFileList (in target 'B4iProject' from project 'B4iProject')
cd /Users/administrator/Documents/UploadedProjects/<user id>
write-file /Users/administrator/Documents/UploadedProjects/<user id>/build/B4iProject.build/Release-iphoneos/B4iProject.build/Objects-normal/arm64/SeZa\ Navigator.LinkFileList

CompileC /Users/administrator/Documents/UploadedProjects/<user id>/build/B4iProject.build/Release-iphoneos/B4iProject.build/Objects-normal/arm64/b4i_keyvaluestore2.o /Users/administrator/Documents/UploadedProjects/<user id>/B4iProject/b4i_keyvaluestore2.m normal arm64 objective-c com.apple.compilers.llvm.clang.1_0.compiler (in target 'B4iProject' from project 'B4iProject')
cd /Users/administrator/Documents/UploadedProjects/<user id>
export LANG=en_US.US-ASCII
/Applications/Xcode.app/Contents/Developer/Toolchains/XcodeDefault.xctoolchain/usr/bin/clang -x objective-c -target arm64-apple-ios8.0 -fmessage-length=0 -fdiagnostics-show-note-include-stack -fmacro-backtrace-limit=0 -std=gnu99 -fobjc-arc -fmodules -gmodules -fmodules-prune-interval=86400 -fmodules-prune-after=345600 -fbuild-session-file=/var/folders/lj/wrbzzxds6b53f88_rx3x7c800000gn/C/org.llvm.clang/ModuleCache.noindex/Session.modulevalidation -fmodules-validate-once-per-build-session -Wnon-modular-include-in-framework-module -Werror=non-modular-include-in-framework-module -Wno-trigraphs -fpascal-strings -O0 -Wno-missing-field-initializers -Wno-missing-prototypes -Werror=return-type -Wno-implicit-atomic-properties -Werror=deprecated-objc-isa-usage -Wno-objc-interface-ivars -Werror=objc-root-class -Wno-arc-repeated-use-of-weak -Wduplicate-method-match -Wno-missing-braces -Wparentheses -Wswitch -Wunused-function -Wno-unused-label -Wno-unused-parameter -Wunused-variable -Wunused-value -Wempty-body -Wuninitialized -Wconditional-uninitialized -Wno-unknown-pragmas -Wno-shadow -Wno-four-char-constants -Wno-conversion -Wconstant-conversion -Wint-conversion -Wbool-conversion -Wenum-conversion -Wno-float-conversion -Wno-non-literal-null-conversion -Wno-objc-literal-conversion -Wshorten-64-to-32 -Wpointer-sign -Wno-newline-eof -Wno-selector -Wno-strict-selector-match -Wundeclared-selector -Wno-deprecated-implementations -DB4I_VERSION=12 -DNS_BLOCK_ASSERTIONS=1 -DOBJC_OLD_DISPATCH_PROTOTYPES=1 -isysroot /Applications/Xcode.app/Contents/Developer/Platforms/iPhoneOS.platform/Developer/SDKs/iPhoneOS13.2.sdk -fstrict-aliasing -Wprotocol -Wdeprecated-declarations -fvisibility=hidden -Wno-sign-conversion -Wno-infinite-recursion -Wno-comma -Wno-block-capture-autoreleasing -Wno-strict-prototypes -Wno-semicolon-before-method-body -iquote /Users/administrator/Documents/UploadedProjects/<user id>/build/B4iProject.build/Release-iphoneos/B4iProject.build/SeZa\ Navigator-generated-files.hmap -I/Users/administrator/Documents/UploadedProjects/<user id>/build/B4iProject.build/Release-iphoneos/B4iProject.build/SeZa\ Navigator-own-target-headers.hmap -I/Users/administrator/Documents/UploadedProjects/<user id>/build/B4iProject.build/Release-iphoneos/B4iProject.build/SeZa\ Navigator-all-target-headers.hmap -iquote /Users/administrator/Documents/UploadedProjects/<user id>/build/B4iProject.build/Release-iphoneos/B4iProject.build/SeZa\ Navigator-project-headers.hmap -I/Users/administrator/Documents/UploadedProjects/<user id>/Payload/include -I/Users/administrator/Documents/UploadedProjects/<user id>/build/B4iProject.build/Release-iphoneos/B4iProject.build/DerivedSources-normal/arm64 -I/Users/administrator/Documents/UploadedProjects/<user id>/build/B4iProject.build/Release-iphoneos/B4iProject.build/DerivedSources/arm64 -I/Users/administrator/Documents/UploadedProjects/<user id>/build/B4iProject.build/Release-iphoneos/B4iProject.build/DerivedSources -F/Users/administrator/Documents/UploadedProjects/<user id>/Payload -F../../Libs -MMD -MT dependencies -MF /Users/administrator/Documents/UploadedProjects/<user id>/build/B4iProject.build/Release-iphoneos/B4iProject.build/Objects-normal/arm64/b4i_keyvaluestore2.d --serialize-diagnostics /Users/administrator/Documents/UploadedProjects/<user id>/build/B4iProject.build/Release-iphoneos/B4iProject.build/Objects-normal/arm64/b4i_keyvaluestore2.dia -c /Users/administrator/Documents/UploadedProjects/<user id>/B4iProject/b4i_keyvaluestore2.m -o /Users/administrator/Documents/UploadedProjects/<user id>/build/B4iProject.build/Release-iphoneos/B4iProject.build/Objects-normal/arm64/b4i_keyvaluestore2.o


Error: ** BUILD FAILED **


The following build commands failed:
CompileC /Users/administrator/Documents/UploadedProjects/<user id>/build/B4iProject.build/Release-iphoneos/B4iProject.build/Objects-normal/arm64/b4i_main.o /Users/administrator/Documents/UploadedProjects/<user id>/B4iProject/b4i_main.m normal arm64 objective-c com.apple.compilers.llvm.clang.1_0.compiler
(1 failure)

Extracted errors:
Line 93: /Users/administrator/Documents/UploadedProjects/<user id>/B4iProject/b4i_roundslider.h:2:9: fatal error: 'ByteConverter.h' file not found
Line 102: /Users/administrator/Documents/UploadedProjects/<user id>/B4iProject/b4i_myhelper.h:2:9: fatal error: 'ByteConverter.h' file not found
Line 111: /Users/administrator/Documents/UploadedProjects/<user id>/B4iProject/b4i_scrollinglabel.h:2:9: fatal error: 'ByteConverter.h' file not found
Line 120: /Users/administrator/Documents/UploadedProjects/<user id>/B4iProject/b4i_swiftbutton.h:2:9: fatal error: 'ByteConverter.h' file not found
Line 129: /Users/administrator/Documents/UploadedProjects/<user id>/B4iProject/b4i_main.h:2:9: fatal error: 'ByteConverter.h' file not found
Line 139: /Users/administrator/Documents/UploadedProjects/<user id>/B4iProject/b4i_madewithlove.h:2:9: fatal error: 'ByteConverter.h' file not found
Line 148: /Users/administrator/Documents/UploadedProjects/<user id>/B4iProject/b4i_localizator.h:2:9: fatal error: 'ByteConverter.h' file not found

I tried this recommendation without success: https://www.b4x.com/android/forum/threads/fatal-error-byteconverter-h-file-not-found.50625/
The library is installed: 2020-12-28_12-15-21.png

Since I installed B4i only recently, it is possible that the cause is the state of my installation (although the usual beginner test projects could be successfully compiled and started - I currently use the hosted builder).

The original project was created in B4A (B4xpages) and has been running flawlessly in production for several weeks.

Does anyone have experience with extending a B4A project to B4i?

Are there any typical error causes I could look for first?

______

Edit: Note - this test project with the iRandomAccessFile library runs fine: https://www.b4x.com/android/forum/t...eator-pixels-drawings-and-more.92050/#content
 
Last edited:
Top