J john234 Member Sep 14, 2024 #1 B4A Version: 13.00 Parsing code. (0.00s) Java Version: 19 Building folders structure. (0.01s) Compiling code. (0.04s) Compiling layouts code. (0.03s) Organizing libraries. (0.02s) (AndroidX SDK) Compiling resources (0.14s) Linking resources (0.45s) build tools: 34.0.0, android jar: android-34 Compiling debugger engine code. (1.12s) Compiling generated Java code. (1.25s) Finding libraries that need to be dexed. (0.00s) Dex code Error Error in example\exampl1\Objects\dexed: java.nio.file.NoSuchFileException: example\exampl1\Objects\dexed Error in example\exampl1\Objects\bin\classes\b4a\example\main$1.class: java.nio.file.NoSuchFileException: example\exampl1\Objects\bin\classes\b4a\example\main$1.class Error in example\exampl1\Objects\bin\classes\b4a\example\main$B4AMenuItemsClickListener.class: java.nio.file.NoSuchFileException: example\exampl1\Objects\bin\classes\b4a\example\main$B4AMenuItemsClickListener.class Error in example\exampl1\Objects\bin\classes\b4a\example\main$HandleKeyDelayed.class: java.nio.file.NoSuchFileException: example\exampl1\Objects\bin\classes\b4a\example\main$HandleKeyDelayed.class Error in example\exampl1\Objects\bin\classes\b4a\example\main$ResumeMessage.class: java.nio.file.NoSuchFileException: example\exampl1\Objects\bin\classes\b4a\example\main$ResumeMessage.class Error in example\exampl1\Objects\bin\classes\b4a\example\main$WaitForLayout.class: java.nio.file.NoSuchFileException: example\exampl1\Objects\bin\classes\b4a\example\main$WaitForLayout.class Error in example\exampl1\Objects\bin\classes\b4a\example\main.class: java.nio.file.NoSuchFileException: example\exampl1\Objects\bin\classes\b4a\example\main.class Error in example\exampl1\Objects\bin\classes\b4a\example\R$drawable.class: java.nio.file.NoSuchFileException: example\exampl1\Objects\bin\classes\b4a\example\R$drawable.class Error in example\exampl1\Objects\bin\classes\b4a\example\R$style.class: java.nio.file.NoSuchFileException: example\exampl1\Objects\bin\classes\b4a\example\R$style.class Error in example\exampl1\Objects\bin\classes\b4a\example\R.class: java.nio.file.NoSuchFileException: example\exampl1\Objects\bin\classes\b4a\example\R.class Error in example\exampl1\Objects\bin\classes\b4a\example\starter$1.class: java.nio.file.NoSuchFileException: example\exampl1\Objects\bin\classes\b4a\example\starter$1.class Error in example\exampl1\Objects\bin\classes\b4a\example\starter$2.class: java.nio.file.NoSuchFileException: example\exampl1\Objects\bin\classes\b4a\example\starter$2.class Error in example\exampl1\Objects\bin\classes\b4a\example\starter$starter_BR.class: java.nio.file.NoSuchFileException: example\exampl1\Objects\bin\classes\b4a\example\starter$starter_BR.class Error in example\exampl1\Objects\bin\classes\b4a\example\starter.class: java.nio.file.NoSuchFileException: example\exampl1\Objects\bin\classes\b4a\example\starter.class Error in example\exampl1\Objects\bin\classes\b4a\example\designerscripts\LS_layout.class: java.nio.file.NoSuchFileException: example\exampl1\Objects\bin\classes\b4a\example\designerscripts\LS_layout.class Error: Invalid output: example\exampl1\Objects\dexed Output must be a .zip or .jar archive or an existing directory Compilation failed Exception in thread "main" java.lang.RuntimeException: com.android.tools.r8.CompilationFailedException: Compilation failed to complete at com.android.tools.r8.internal.po.a(R8_8.3.37_d0b8d9dfe8720e37c27d2233931d9d72dbd696ffd92111cc9b36e58b4baad1cc:1269) at com.android.tools.r8.D8.main(R8_8.3.37_d0b8d9dfe8720e37c27d2233931d9d72dbd696ffd92111cc9b36e58b4baad1cc:5) Caused by: com.android.tools.r8.CompilationFailedException: Compilation failed to complete at Version.fakeStackEntry(Version_8.3.37.java:0) at com.android.tools.r8.Q.a(R8_8.3.37_d0b8d9dfe8720e37c27d2233931d9d72dbd696ffd92111cc9b36e58b4baad1cc:5) at com.android.tools.r8.internal.po.a(R8_8.3.37_d0b8d9dfe8720e37c27d2233931d9d72dbd696ffd92111cc9b36e58b4baad1cc:244) at com.android.tools.r8.internal.po.a(R8_8.3.37_d0b8d9dfe8720e37c27d2233931d9d72dbd696ffd92111cc9b36e58b4baad1cc:90) at com.android.tools.r8.internal.po.a(R8_8.3.37_d0b8d9dfe8720e37c27d2233931d9d72dbd696ffd92111cc9b36e58b4baad1cc:909) at com.android.tools.r8.BaseCommand$Builder.build(R8_8.3.37_d0b8d9dfe8720e37c27d2233931d9d72dbd696ffd92111cc9b36e58b4baad1cc:2) at com.android.tools.r8.D8.b(R8_8.3.37_d0b8d9dfe8720e37c27d2233931d9d72dbd696ffd92111cc9b36e58b4baad1cc:503) at com.android.tools.r8.D8.a(R8_8.3.37_d0b8d9dfe8720e37c27d2233931d9d72dbd696ffd92111cc9b36e58b4baad1cc:1076) at com.android.tools.r8.internal.po.a(R8_8.3.37_d0b8d9dfe8720e37c27d2233931d9d72dbd696ffd92111cc9b36e58b4baad1cc:1256) ... 1 more Caused by: com.android.tools.r8.internal.h: Invalid output: example\exampl1\Objects\dexed Output must be a .zip or .jar archive or an existing directory at com.android.tools.r8.internal.X30.a(R8_8.3.37_d0b8d9dfe8720e37c27d2233931d9d72dbd696ffd92111cc9b36e58b4baad1cc:346) at com.android.tools.r8.internal.X30.error(R8_8.3.37_d0b8d9dfe8720e37c27d2233931d9d72dbd696ffd92111cc9b36e58b4baad1cc:112) at com.android.tools.r8.internal.Hp.a(R8_8.3.37_d0b8d9dfe8720e37c27d2233931d9d72dbd696ffd92111cc9b36e58b4baad1cc:155) at com.android.tools.r8.BaseCompilerCommand$Builder.d(R8_8.3.37_d0b8d9dfe8720e37c27d2233931d9d72dbd696ffd92111cc9b36e58b4baad1cc:7) at com.android.tools.r8.D8Command$Builder.d(R8_8.3.37_d0b8d9dfe8720e37c27d2233931d9d72dbd696ffd92111cc9b36e58b4baad1cc:60) at com.android.tools.r8.BaseCommand$Builder.a(R8_8.3.37_d0b8d9dfe8720e37c27d2233931d9d72dbd696ffd92111cc9b36e58b4baad1cc:145) at com.android.tools.r8.internal.po.a(R8_8.3.37_d0b8d9dfe8720e37c27d2233931d9d72dbd696ffd92111cc9b36e58b4baad1cc:906) ... 5 more Suppressed: java.lang.RuntimeException: com.android.tools.r8.internal.h: Invalid output: example\exampl1\Objects\dexed Output must be a .zip or .jar archive or an existing directory at com.android.tools.r8.internal.X30.a(R8_8.3.37_d0b8d9dfe8720e37c27d2233931d9d72dbd696ffd92111cc9b36e58b4baad1cc:255) at com.android.tools.r8.BaseCommand$Builder.a(R8_8.3.37_d0b8d9dfe8720e37c27d2233931d9d72dbd696ffd92111cc9b36e58b4baad1cc:147) ... 6 more Caused by: [CIRCULAR REFERENCE: com.android.tools.r8.internal.h: Invalid output: example\exampl1\Objects\dexed Output must be a .zip or .jar archive or an existing directory]
B4A Version: 13.00 Parsing code. (0.00s) Java Version: 19 Building folders structure. (0.01s) Compiling code. (0.04s) Compiling layouts code. (0.03s) Organizing libraries. (0.02s) (AndroidX SDK) Compiling resources (0.14s) Linking resources (0.45s) build tools: 34.0.0, android jar: android-34 Compiling debugger engine code. (1.12s) Compiling generated Java code. (1.25s) Finding libraries that need to be dexed. (0.00s) Dex code Error Error in example\exampl1\Objects\dexed: java.nio.file.NoSuchFileException: example\exampl1\Objects\dexed Error in example\exampl1\Objects\bin\classes\b4a\example\main$1.class: java.nio.file.NoSuchFileException: example\exampl1\Objects\bin\classes\b4a\example\main$1.class Error in example\exampl1\Objects\bin\classes\b4a\example\main$B4AMenuItemsClickListener.class: java.nio.file.NoSuchFileException: example\exampl1\Objects\bin\classes\b4a\example\main$B4AMenuItemsClickListener.class Error in example\exampl1\Objects\bin\classes\b4a\example\main$HandleKeyDelayed.class: java.nio.file.NoSuchFileException: example\exampl1\Objects\bin\classes\b4a\example\main$HandleKeyDelayed.class Error in example\exampl1\Objects\bin\classes\b4a\example\main$ResumeMessage.class: java.nio.file.NoSuchFileException: example\exampl1\Objects\bin\classes\b4a\example\main$ResumeMessage.class Error in example\exampl1\Objects\bin\classes\b4a\example\main$WaitForLayout.class: java.nio.file.NoSuchFileException: example\exampl1\Objects\bin\classes\b4a\example\main$WaitForLayout.class Error in example\exampl1\Objects\bin\classes\b4a\example\main.class: java.nio.file.NoSuchFileException: example\exampl1\Objects\bin\classes\b4a\example\main.class Error in example\exampl1\Objects\bin\classes\b4a\example\R$drawable.class: java.nio.file.NoSuchFileException: example\exampl1\Objects\bin\classes\b4a\example\R$drawable.class Error in example\exampl1\Objects\bin\classes\b4a\example\R$style.class: java.nio.file.NoSuchFileException: example\exampl1\Objects\bin\classes\b4a\example\R$style.class Error in example\exampl1\Objects\bin\classes\b4a\example\R.class: java.nio.file.NoSuchFileException: example\exampl1\Objects\bin\classes\b4a\example\R.class Error in example\exampl1\Objects\bin\classes\b4a\example\starter$1.class: java.nio.file.NoSuchFileException: example\exampl1\Objects\bin\classes\b4a\example\starter$1.class Error in example\exampl1\Objects\bin\classes\b4a\example\starter$2.class: java.nio.file.NoSuchFileException: example\exampl1\Objects\bin\classes\b4a\example\starter$2.class Error in example\exampl1\Objects\bin\classes\b4a\example\starter$starter_BR.class: java.nio.file.NoSuchFileException: example\exampl1\Objects\bin\classes\b4a\example\starter$starter_BR.class Error in example\exampl1\Objects\bin\classes\b4a\example\starter.class: java.nio.file.NoSuchFileException: example\exampl1\Objects\bin\classes\b4a\example\starter.class Error in example\exampl1\Objects\bin\classes\b4a\example\designerscripts\LS_layout.class: java.nio.file.NoSuchFileException: example\exampl1\Objects\bin\classes\b4a\example\designerscripts\LS_layout.class Error: Invalid output: example\exampl1\Objects\dexed Output must be a .zip or .jar archive or an existing directory Compilation failed Exception in thread "main" java.lang.RuntimeException: com.android.tools.r8.CompilationFailedException: Compilation failed to complete at com.android.tools.r8.internal.po.a(R8_8.3.37_d0b8d9dfe8720e37c27d2233931d9d72dbd696ffd92111cc9b36e58b4baad1cc:1269) at com.android.tools.r8.D8.main(R8_8.3.37_d0b8d9dfe8720e37c27d2233931d9d72dbd696ffd92111cc9b36e58b4baad1cc:5) Caused by: com.android.tools.r8.CompilationFailedException: Compilation failed to complete at Version.fakeStackEntry(Version_8.3.37.java:0) at com.android.tools.r8.Q.a(R8_8.3.37_d0b8d9dfe8720e37c27d2233931d9d72dbd696ffd92111cc9b36e58b4baad1cc:5) at com.android.tools.r8.internal.po.a(R8_8.3.37_d0b8d9dfe8720e37c27d2233931d9d72dbd696ffd92111cc9b36e58b4baad1cc:244) at com.android.tools.r8.internal.po.a(R8_8.3.37_d0b8d9dfe8720e37c27d2233931d9d72dbd696ffd92111cc9b36e58b4baad1cc:90) at com.android.tools.r8.internal.po.a(R8_8.3.37_d0b8d9dfe8720e37c27d2233931d9d72dbd696ffd92111cc9b36e58b4baad1cc:909) at com.android.tools.r8.BaseCommand$Builder.build(R8_8.3.37_d0b8d9dfe8720e37c27d2233931d9d72dbd696ffd92111cc9b36e58b4baad1cc:2) at com.android.tools.r8.D8.b(R8_8.3.37_d0b8d9dfe8720e37c27d2233931d9d72dbd696ffd92111cc9b36e58b4baad1cc:503) at com.android.tools.r8.D8.a(R8_8.3.37_d0b8d9dfe8720e37c27d2233931d9d72dbd696ffd92111cc9b36e58b4baad1cc:1076) at com.android.tools.r8.internal.po.a(R8_8.3.37_d0b8d9dfe8720e37c27d2233931d9d72dbd696ffd92111cc9b36e58b4baad1cc:1256) ... 1 more Caused by: com.android.tools.r8.internal.h: Invalid output: example\exampl1\Objects\dexed Output must be a .zip or .jar archive or an existing directory at com.android.tools.r8.internal.X30.a(R8_8.3.37_d0b8d9dfe8720e37c27d2233931d9d72dbd696ffd92111cc9b36e58b4baad1cc:346) at com.android.tools.r8.internal.X30.error(R8_8.3.37_d0b8d9dfe8720e37c27d2233931d9d72dbd696ffd92111cc9b36e58b4baad1cc:112) at com.android.tools.r8.internal.Hp.a(R8_8.3.37_d0b8d9dfe8720e37c27d2233931d9d72dbd696ffd92111cc9b36e58b4baad1cc:155) at com.android.tools.r8.BaseCompilerCommand$Builder.d(R8_8.3.37_d0b8d9dfe8720e37c27d2233931d9d72dbd696ffd92111cc9b36e58b4baad1cc:7) at com.android.tools.r8.D8Command$Builder.d(R8_8.3.37_d0b8d9dfe8720e37c27d2233931d9d72dbd696ffd92111cc9b36e58b4baad1cc:60) at com.android.tools.r8.BaseCommand$Builder.a(R8_8.3.37_d0b8d9dfe8720e37c27d2233931d9d72dbd696ffd92111cc9b36e58b4baad1cc:145) at com.android.tools.r8.internal.po.a(R8_8.3.37_d0b8d9dfe8720e37c27d2233931d9d72dbd696ffd92111cc9b36e58b4baad1cc:906) ... 5 more Suppressed: java.lang.RuntimeException: com.android.tools.r8.internal.h: Invalid output: example\exampl1\Objects\dexed Output must be a .zip or .jar archive or an existing directory at com.android.tools.r8.internal.X30.a(R8_8.3.37_d0b8d9dfe8720e37c27d2233931d9d72dbd696ffd92111cc9b36e58b4baad1cc:255) at com.android.tools.r8.BaseCommand$Builder.a(R8_8.3.37_d0b8d9dfe8720e37c27d2233931d9d72dbd696ffd92111cc9b36e58b4baad1cc:147) ... 6 more Caused by: [CIRCULAR REFERENCE: com.android.tools.r8.internal.h: Invalid output: example\exampl1\Objects\dexed Output must be a .zip or .jar archive or an existing directory]
Erel B4X founder Staff member Licensed User Longtime User Sep 15, 2024 #2 More information please. Does it happen with all projects? Did it previously work? Please post a screenshot of Tools - Configure Paths dialog.
More information please. Does it happen with all projects? Did it previously work? Please post a screenshot of Tools - Configure Paths dialog.
J john234 Member Sep 15, 2024 #3 This is my first time using b4a for my school project. I did some basic stuff like put a MsgboxAsync function when the button is clicked when I was about to debug my project this pop out
This is my first time using b4a for my school project. I did some basic stuff like put a MsgboxAsync function when the button is clicked when I was about to debug my project this pop out
J john234 Member Sep 15, 2024 #5 john234 said: This is my first time using b4a for my school project. I did some basic stuff like put a MsgboxAsync function when the button is clicked when I was about to debug my project this pop outView attachment 156954 Click to expand... it does like this for all the project (b4a pages and default) .
john234 said: This is my first time using b4a for my school project. I did some basic stuff like put a MsgboxAsync function when the button is clicked when I was about to debug my project this pop outView attachment 156954 Click to expand... it does like this for all the project (b4a pages and default) .
Erel B4X founder Staff member Licensed User Longtime User Sep 15, 2024 #6 The project path looks wrong. Maybe it is a network drive? Try to save it locally.
J john234 Member Sep 15, 2024 #7 it's inside my Window-SSD(C Erel said: The project path looks wrong. Maybe it is a network drive? Try to save it locally Click to expand...
it's inside my Window-SSD(C Erel said: The project path looks wrong. Maybe it is a network drive? Try to save it locally Click to expand...
Erel B4X founder Staff member Licensed User Longtime User Sep 15, 2024 #8 Create a folder named c:\B4X\Project. Create a new project there and post the logs (as text).