iOS Question BUILD FAILED

RVP

Active Member
Licensed User
Just updated to 3.6 from 2.6, and I am getting the following errors when trying to compile the app:
B4X:
The following build commands failed:
    CompileC build/B4iProject.build/Release-iphoneos/B4iProject.build/Objects-normal/armv7/b4i_dbutils.o B4iProject/b4i_dbutils.m normal armv7 objective-c com.apple.compilers.llvm.clang.1_0.compiler
    CompileC build/B4iProject.build/Release-iphoneos/B4iProject.build/Objects-normal/armv7/b4i_filingmodule.o B4iProject/b4i_filingmodule.m normal armv7 objective-c com.apple.compilers.llvm.clang.1_0.compiler
(2 failures)
These errors seem to be referring to code modules in my project.

What should I be looking at?

Note! The message is not always the same. No changes in the project, just try to compile again.

B4X:
The following build commands failed:
    CompileC build/B4iProject.build/Release-iphoneos/B4iProject.build/Objects-normal/armv7/b4i_dbutils.o B4iProject/b4i_dbutils.m normal armv7 objective-c com.apple.compilers.llvm.clang.1_0.compiler
(1 failure)
 
Last edited:

RVP

Active Member
Licensed User
Complete message, looks like itableview2 is missing? I have included it, but if I look on my local builder it is not in the Libs folder

B4X:
B4i version: 3.60
Parsing code.    (0.08s)
Compiling code.    (1.00s)
Compiling layouts code.    (0.03s)
Compiling debugger engine code.    (1.87s)
Building Xcode project    (0.74s)
Sending data to remote compiler.    Error
Out: Build settings from command line:
    ARCHS = armv7
    CODE_SIGN_IDENTITY = iPhone
    CONFIGURATION_BUILD_DIR = /Users/rvanderpyl/B4iBuildServer/UploadedProjects/<user id>/Payload
    OTHER_CODE_SIGN_FLAGS = --keychain <user id>
    PRODUCT_NAME = PrimeLight
    PROVISIONING_PROFILE = 6b6b89cb-814f-4669-8255-7c3184c85980

=== BUILD TARGET B4iProject OF PROJECT B4iProject WITH CONFIGURATION Release ===

Check dependencies

Write auxiliary files
/bin/mkdir -p /Users/rvanderpyl/B4iBuildServer/UploadedProjects/<user id>/build/B4iProject.build/Release-iphoneos/B4iProject.build
write-file /Users/rvanderpyl/B4iBuildServer/UploadedProjects/<user id>/build/B4iProject.build/Release-iphoneos/B4iProject.build/PrimeLight-project-headers.hmap
write-file /Users/rvanderpyl/B4iBuildServer/UploadedProjects/<user id>/build/B4iProject.build/Release-iphoneos/B4iProject.build/PrimeLight.hmap
write-file /Users/rvanderpyl/B4iBuildServer/UploadedProjects/<user id>/build/B4iProject.build/Release-iphoneos/B4iProject.build/PrimeLight-all-non-framework-target-headers.hmap
write-file /Users/rvanderpyl/B4iBuildServer/UploadedProjects/<user id>/build/B4iProject.build/Release-iphoneos/B4iProject.build/PrimeLight-all-target-headers.hmap
/bin/mkdir -p /Users/rvanderpyl/B4iBuildServer/UploadedProjects/<user id>/build/B4iProject.build/Release-iphoneos/B4iProject.build/Objects-normal/armv7
write-file /Users/rvanderpyl/B4iBuildServer/UploadedProjects/<user id>/build/B4iProject.build/Release-iphoneos/B4iProject.build/Objects-normal/armv7/PrimeLight.LinkFileList
write-file /Users/rvanderpyl/B4iBuildServer/UploadedProjects/<user id>/build/B4iProject.build/Release-iphoneos/B4iProject.build/PrimeLight-own-target-headers.hmap
write-file /Users/rvanderpyl/B4iBuildServer/UploadedProjects/<user id>/build/B4iProject.build/Release-iphoneos/B4iProject.build/PrimeLight-generated-files.hmap

Create product structure
/bin/mkdir -p /Users/rvanderpyl/B4iBuildServer/UploadedProjects/<user id>/Payload/PrimeLight.app

ProcessInfoPlistFile Payload/PrimeLight.app/Info.plist B4iProject/B4iProject-Info.plist
    cd /Users/rvanderpyl/B4iBuildServer/UploadedProjects/<user id>
    export PATH="/Applications/Xcode.app/Contents/Developer/Platforms/iPhoneOS.platform/Developer/usr/bin:/Applications/Xcode.app/Contents/Developer/usr/bin:/usr/local/bin:/usr/bin:/bin:/usr/sbin:/sbin"
    builtin-infoPlistUtility /Users/rvanderpyl/B4iBuildServer/UploadedProjects/<user id>/B4iProject/B4iProject-Info.plist -genpkginfo /Users/rvanderpyl/B4iBuildServer/UploadedProjects/<user id>/Payload/PrimeLight.app/PkgInfo -expandbuildsettings -format binary -platform iphoneos -o /Users/rvanderpyl/B4iBuildServer/UploadedProjects/<user id>/Payload/PrimeLight.app/Info.plist

CompileC build/B4iProject.build/Release-iphoneos/B4iProject.build/Objects-normal/armv7/b4i_googlemapsextra.o B4iProject/b4i_googlemapsextra.m normal armv7 objective-c com.apple.compilers.llvm.clang.1_0.compiler
    cd /Users/rvanderpyl/B4iBuildServer/UploadedProjects/<user id>
    export LANG=en_US.US-ASCII
    export PATH="/Applications/Xcode.app/Contents/Developer/Platforms/iPhoneOS.platform/Developer/usr/bin:/Applications/Xcode.app/Contents/Developer/usr/bin:/usr/local/bin:/usr/bin:/bin:/usr/sbin:/sbin"
    /Applications/Xcode.app/Contents/Developer/Toolchains/XcodeDefault.xctoolchain/usr/bin/clang -x objective-c -arch armv7 -fmessage-length=0 -fdiagnostics-show-note-include-stack -fmacro-backtrace-limit=0 -std=gnu99 -fobjc-arc -fmodules -fmodules-prune-interval=86400 -fmodules-prune-after=345600 -fbuild-session-file=/var/folders/v0/k9s4gk4n0dd8hvzxztc624h40000gn/C/org.llvm.clang/ModuleCache/Session.modulevalidation -fmodules-validate-once-per-build-session -Wnon-modular-include-in-framework-module -Werror=non-modular-include-in-framework-module -Wno-trigraphs -fpascal-strings -O0 -Wno-missing-field-initializers -Wno-missing-prototypes -Werror=return-type -Wno-implicit-atomic-properties -Werror=deprecated-objc-isa-usage -Werror=objc-root-class -Wno-receiver-is-weak -Wno-arc-repeated-use-of-weak -Wduplicate-method-match -Wno-missing-braces -Wparentheses -Wswitch -Wunused-function -Wno-unused-label -Wno-unused-parameter -Wunused-variable -Wunused-value -Wempty-body -Wconditional-uninitialized -Wno-unknown-pragmas -Wno-shadow -Wno-four-char-constants -Wno-conversion -Wconstant-conversion -Wint-conversion -Wbool-conversion -Wenum-conversion -Wshorten-64-to-32 -Wpointer-sign -Wno-newline-eof -Wno-selector -Wno-strict-selector-match -Wundeclared-selector -Wno-deprecated-implementations -DNS_BLOCK_ASSERTIONS=1 -isysroot /Applications/Xcode.app/Contents/Developer/Platforms/iPhoneOS.platform/Developer/SDKs/iPhoneOS8.4.sdk -fstrict-aliasing -Wprotocol -Wdeprecated-declarations -fvisibility=hidden -Wno-sign-conversion -miphoneos-version-min=7.0 -iquote /Users/rvanderpyl/B4iBuildServer/UploadedProjects/<user id>/build/B4iProject.build/Release-iphoneos/B4iProject.build/PrimeLight-generated-files.hmap -I/Users/rvanderpyl/B4iBuildServer/UploadedProjects/<user id>/build/B4iProject.build/Release-iphoneos/B4iProject.build/PrimeLight-own-target-headers.hmap -I/Users/rvanderpyl/B4iBuildServer/UploadedProjects/<user id>/build/B4iProject.build/Release-iphoneos/B4iProject.build/PrimeLight-all-target-headers.hmap -iquote /Users/rvanderpyl/B4iBuildServer/UploadedProjects/<user id>/build/B4iProject.build/Release-iphoneos/B4iProject.build/PrimeLight-project-headers.hmap -I/Users/rvanderpyl/B4iBuildServer/UploadedProjects/<user id>/Payload/include -I/Applications/Xcode.app/Contents/Developer/Toolchains/XcodeDefault.xctoolchain/usr/include -I/Users/rvanderpyl/B4iBuildServer/UploadedProjects/<user id>/build/B4iProject.build/Release-iphoneos/B4iProject.build/DerivedSources/armv7 -I/Users/rvanderpyl/B4iBuildServer/UploadedProjects/<user id>/build/B4iProject.build/Release-iphoneos/B4iProject.build/DerivedSources -F/Users/rvanderpyl/B4iBuildServer/UploadedProjects/<user id>/Payload -F../../Libs -MMD -MT dependencies -MF /Users/rvanderpyl/B4iBuildServer/UploadedProjects/<user id>/build/B4iProject.build/Release-iphoneos/B4iProject.build/Objects-normal/armv7/b4i_googlemapsextra.d --serialize-diagnostics /Users/rvanderpyl/B4iBuildServer/UploadedProjects/<user id>/build/B4iProject.build/Release-iphoneos/B4iProject.build/Objects-normal/armv7/b4i_googlemapsextra.dia -c /Users/rvanderpyl/B4iBuildServer/UploadedProjects/<user id>/B4iProject/b4i_googlemapsextra.m -o /Users/rvanderpyl/B4iBuildServer/UploadedProjects/<user id>/build/B4iProject.build/Release-iphoneos/B4iProject.build/Objects-normal/armv7/b4i_googlemapsextra.o
In file included from /Users/rvanderpyl/B4iBuildServer/UploadedProjects/<user id>/B4iProject/b4i_googlemapsextra.m:2:
/Users/rvanderpyl/B4iBuildServer/UploadedProjects/<user id>/B4iProject/b4i_googlemapsextra.h:7:9: fatal error: 'iTableView2.h' file not found
#import "iTableView2.h"
        ^
1 error generated.

CompileC build/B4iProject.build/Release-iphoneos/B4iProject.build/Objects-normal/armv7/main.o B4iProject/main.m normal armv7 objective-c com.apple.compilers.llvm.clang.1_0.compiler
    cd /Users/rvanderpyl/B4iBuildServer/UploadedProjects/<user id>
    export LANG=en_US.US-ASCII
    export PATH="/Applications/Xcode.app/Contents/Developer/Platforms/iPhoneOS.platform/Developer/usr/bin:/Applications/Xcode.app/Contents/Developer/usr/bin:/usr/local/bin:/usr/bin:/bin:/usr/sbin:/sbin"
    /Applications/Xcode.app/Contents/Developer/Toolchains/XcodeDefault.xctoolchain/usr/bin/clang -x objective-c -arch armv7 -fmessage-length=0 -fdiagnostics-show-note-include-stack -fmacro-backtrace-limit=0 -std=gnu99 -fobjc-arc -fmodules -fmodules-prune-interval=86400 -fmodules-prune-after=345600 -fbuild-session-file=/var/folders/v0/k9s4gk4n0dd8hvzxztc624h40000gn/C/org.llvm.clang/ModuleCache/Session.modulevalidation -fmodules-validate-once-per-build-session -Wnon-modular-include-in-framework-module -Werror=non-modular-include-in-framework-module -Wno-trigraphs -fpascal-strings -O0 -Wno-missing-field-initializers -Wno-missing-prototypes -Werror=return-type -Wno-implicit-atomic-properties -Werror=deprecated-objc-isa-usage -Werror=objc-root-class -Wno-receiver-is-weak -Wno-arc-repeated-use-of-weak -Wduplicate-method-match -Wno-missing-braces -Wparentheses -Wswitch -Wunused-function -Wno-unused-label -Wno-unused-parameter -Wunused-variable -Wunused-value -Wempty-body -Wconditional-uninitialized -Wno-unknown-pragmas -Wno-shadow -Wno-four-char-constants -Wno-conversion -Wconstant-conversion -Wint-conversion -Wbool-conversion -Wenum-conversion -Wshorten-64-to-32 -Wpointer-sign -Wno-newline-eof -Wno-selector -Wno-strict-selector-match -Wundeclared-selector -Wno-deprecated-implementations -DNS_BLOCK_ASSERTIONS=1 -isysroot /Applications/Xcode.app/Contents/Developer/Platforms/iPhoneOS.platform/Developer/SDKs/iPhoneOS8.4.sdk -fstrict-aliasing -Wprotocol -Wdeprecated-declarations -fvisibility=hidden -Wno-sign-conversion -miphoneos-version-min=7.0 -iquote /Users/rvanderpyl/B4iBuildServer/UploadedProjects/<user id>/build/B4iProject.build/Release-iphoneos/B4iProject.build/PrimeLight-generated-files.hmap -I/Users/rvanderpyl/B4iBuildServer/UploadedProjects/<user id>/build/B4iProject.build/Release-iphoneos/B4iProject.build/PrimeLight-own-target-headers.hmap -I/Users/rvanderpyl/B4iBuildServer/UploadedProjects/<user id>/build/B4iProject.build/Release-iphoneos/B4iProject.build/PrimeLight-all-target-headers.hmap -iquote /Users/rvanderpyl/B4iBuildServer/UploadedProjects/<user id>/build/B4iProject.build/Release-iphoneos/B4iProject.build/PrimeLight-project-headers.hmap -I/Users/rvanderpyl/B4iBuildServer/UploadedProjects/<user id>/Payload/include -I/Applications/Xcode.app/Contents/Developer/Toolchains/XcodeDefault.xctoolchain/usr/include -I/Users/rvanderpyl/B4iBuildServer/UploadedProjects/<user id>/build/B4iProject.build/Release-iphoneos/B4iProject.build/DerivedSources/armv7 -I/Users/rvanderpyl/B4iBuildServer/UploadedProjects/<user id>/build/B4iProject.build/Release-iphoneos/B4iProject.build/DerivedSources -F/Users/rvanderpyl/B4iBuildServer/UploadedProjects/<user id>/Payload -F../../Libs -MMD -MT dependencies -MF /Users/rvanderpyl/B4iBuildServer/UploadedProjects/<user id>/build/B4iProject.build/Release-iphoneos/B4iProject.build/Objects-normal/armv7/main.d --serialize-diagnostics /Users/rvanderpyl/B4iBuildServer/UploadedProjects/<user id>/build/B4iProject.build/Release-iphoneos/B4iProject.build/Objects-normal/armv7/main.dia -c /Users/rvanderpyl/B4iBuildServer/UploadedProjects/<user id>/B4iProject/main.m -o /Users/rvanderpyl/B4iBuildServer/UploadedProjects/<user id>/build/B4iProject.build/Release-iphoneos/B4iProject.build/Objects-normal/armv7/main.o

CompileC build/B4iProject.build/Release-iphoneos/B4iProject.build/Objects-normal/armv7/b4i_filingmodule.o B4iProject/b4i_filingmodule.m normal armv7 objective-c com.apple.compilers.llvm.clang.1_0.compiler
    cd /Users/rvanderpyl/B4iBuildServer/UploadedProjects/<user id>
    export LANG=en_US.US-ASCII
    export PATH="/Applications/Xcode.app/Contents/Developer/Platforms/iPhoneOS.platform/Developer/usr/bin:/Applications/Xcode.app/Contents/Developer/usr/bin:/usr/local/bin:/usr/bin:/bin:/usr/sbin:/sbin"
    /Applications/Xcode.app/Contents/Developer/Toolchains/XcodeDefault.xctoolchain/usr/bin/clang -x objective-c -arch armv7 -fmessage-length=0 -fdiagnostics-show-note-include-stack -fmacro-backtrace-limit=0 -std=gnu99 -fobjc-arc -fmodules -fmodules-prune-interval=86400 -fmodules-prune-after=345600 -fbuild-session-file=/var/folders/v0/k9s4gk4n0dd8hvzxztc624h40000gn/C/org.llvm.clang/ModuleCache/Session.modulevalidation -fmodules-validate-once-per-build-session -Wnon-modular-include-in-framework-module -Werror=non-modular-include-in-framework-module -Wno-trigraphs -fpascal-strings -O0 -Wno-missing-field-initializers -Wno-missing-prototypes -Werror=return-type -Wno-implicit-atomic-properties -Werror=deprecated-objc-isa-usage -Werror=objc-root-class -Wno-receiver-is-weak -Wno-arc-repeated-use-of-weak -Wduplicate-method-match -Wno-missing-braces -Wparentheses -Wswitch -Wunused-function -Wno-unused-label -Wno-unused-parameter -Wunused-variable -Wunused-value -Wempty-body -Wconditional-uninitialized -Wno-unknown-pragmas -Wno-shadow -Wno-four-char-constants -Wno-conversion -Wconstant-conversion -Wint-conversion -Wbool-conversion -Wenum-conversion -Wshorten-64-to-32 -Wpointer-sign -Wno-newline-eof -Wno-selector -Wno-strict-selector-match -Wundeclared-selector -Wno-deprecated-implementations -DNS_BLOCK_ASSERTIONS=1 -isysroot /Applications/Xcode.app/Contents/Developer/Platforms/iPhoneOS.platform/Developer/SDKs/iPhoneOS8.4.sdk -fstrict-aliasing -Wprotocol -Wdeprecated-declarations -fvisibility=hidden -Wno-sign-conversion -miphoneos-version-min=7.0 -iquote /Users/rvanderpyl/B4iBuildServer/UploadedProjects/<user id>/build/B4iProject.build/Release-iphoneos/B4iProject.build/PrimeLight-generated-files.hmap -I/Users/rvanderpyl/B4iBuildServer/UploadedProjects/<user id>/build/B4iProject.build/Release-iphoneos/B4iProject.build/PrimeLight-own-target-headers.hmap -I/Users/rvanderpyl/B4iBuildServer/UploadedProjects/<user id>/build/B4iProject.build/Release-iphoneos/B4iProject.build/PrimeLight-all-target-headers.hmap -iquote /Users/rvanderpyl/B4iBuildServer/UploadedProjects/<user id>/build/B4iProject.build/Release-iphoneos/B4iProject.build/PrimeLight-project-headers.hmap -I/Users/rvanderpyl/B4iBuildServer/UploadedProjects/<user id>/Payload/include -I/Applications/Xcode.app/Contents/Developer/Toolchains/XcodeDefault.xctoolchain/usr/include -I/Users/rvanderpyl/B4iBuildServer/UploadedProjects/<user id>/build/B4iProject.build/Release-iphoneos/B4iProject.build/DerivedSources/armv7 -I/Users/rvanderpyl/B4iBuildServer/UploadedProjects/<user id>/build/B4iProject.build/Release-iphoneos/B4iProject.build/DerivedSources -F/Users/rvanderpyl/B4iBuildServer/UploadedProjects/<user id>/Payload -F../../Libs -MMD -MT dependencies -MF /Users/rvanderpyl/B4iBuildServer/UploadedProjects/<user id>/build/B4iProject.build/Release-iphoneos/B4iProject.build/Objects-normal/armv7/b4i_filingmodule.d --serialize-diagnostics /Users/rvanderpyl/B4iBuildServer/UploadedProjects/<user id>/build/B4iProject.build/Release-iphoneos/B4iProject.build/Objects-normal/armv7/b4i_filingmodule.dia -c /Users/rvanderpyl/B4iBuildServer/UploadedProjects/<user id>/B4iProject/b4i_filingmodule.m -o /Users/rvanderpyl/B4iBuildServer/UploadedProjects/<user id>/build/B4iProject.build/Release-iphoneos/B4iProject.build/Objects-normal/armv7/b4i_filingmodule.o
In file included from /Users/rvanderpyl/B4iBuildServer/UploadedProjects/<user id>/B4iProject/b4i_filingmodule.m:2:
/Users/rvanderpyl/B4iBuildServer/UploadedProjects/<user id>/B4iProject/b4i_filingmodule.h:7:9: fatal error: 'iTableView2.h' file not found
#import "iTableView2.h"
        ^

CompileC build/B4iProject.build/Release-iphoneos/B4iProject.build/Objects-normal/armv7/b4i_dbutils.o B4iProject/b4i_dbutils.m normal armv7 objective-c com.apple.compilers.llvm.clang.1_0.compiler
    cd /Users/rvanderpyl/B4iBuildServer/UploadedProjects/<user id>
    export LANG=en_US.US-ASCII
    export PATH="/Applications/Xcode.app/Contents/Developer/Platforms/iPhoneOS.platform/Developer/usr/bin:/Applications/Xcode.app/Contents/Developer/usr/bin:/usr/local/bin:/usr/bin:/bin:/usr/sbin:/sbin"
    /Applications/Xcode.app/Contents/Developer/Toolchains/XcodeDefault.xctoolchain/usr/bin/clang -x objective-c -arch armv7 -fmessage-length=0 -fdiagnostics-show-note-include-stack -fmacro-backtrace-limit=0 -std=gnu99 -fobjc-arc -fmodules -fmodules-prune-interval=86400 -fmodules-prune-after=345600 -fbuild-session-file=/var/folders/v0/k9s4gk4n0dd8hvzxztc624h40000gn/C/org.llvm.clang/ModuleCache/Session.modulevalidation -fmodules-validate-once-per-build-session -Wnon-modular-include-in-framework-module -Werror=non-modular-include-in-framework-module -Wno-trigraphs -fpascal-strings -O0 -Wno-missing-field-initializers -Wno-missing-prototypes -Werror=return-type -Wno-implicit-atomic-properties -Werror=deprecated-objc-isa-usage -Werror=objc-root-class -Wno-receiver-is-weak -Wno-arc-repeated-use-of-weak -Wduplicate-method-match -Wno-missing-braces -Wparentheses -Wswitch -Wunused-function -Wno-unused-label -Wno-unused-parameter -Wunused-variable -Wunused-value -Wempty-body -Wconditional-uninitialized -Wno-unknown-pragmas -Wno-shadow -Wno-four-char-constants -Wno-conversion -Wconstant-conversion -Wint-conversion -Wbool-conversion -Wenum-conversion -Wshorten-64-to-32 -Wpointer-sign -Wno-newline-eof -Wno-selector -Wno-strict-selector-match -Wundeclared-selector -Wno-deprecated-implementations -DNS_BLOCK_ASSERTIONS=1 -isysroot /Applications/Xcode.app/Contents/Developer/Platforms/iPhoneOS.platform/Developer/SDKs/iPhoneOS8.4.sdk -fstrict-aliasing -Wprotocol -Wdeprecated-declarations -fvisibility=hidden -Wno-sign-conversion -miphoneos-version-min=7.0 -iquote /Users/rvanderpyl/B4iBuildServer/UploadedProjects/<user id>/build/B4iProject.build/Release-iphoneos/B4iProject.build/PrimeLight-generated-files.hmap -I/Users/rvanderpyl/B4iBuildServer/UploadedProjects/<user id>/build/B4iProject.build/Release-iphoneos/B4iProject.build/PrimeLight-own-target-headers.hmap -I/Users/rvanderpyl/B4iBuildServer/UploadedProjects/<user id>/build/B4iProject.build/Release-iphoneos/B4iProject.build/PrimeLight-all-target-headers.hmap -iquote /Users/rvanderpyl/B4iBuildServer/UploadedProjects/<user id>/build/B4iProject.build/Release-iphoneos/B4iProject.build/PrimeLight-project-headers.hmap -I/Users/rvanderpyl/B4iBuildServer/UploadedProjects/<user id>/Payload/include -I/Applications/Xcode.app/Contents/Developer/Toolchains/XcodeDefault.xctoolchain/usr/include -I/Users/rvanderpyl/B4iBuildServer/UploadedProjects/<user id>/build/B4iProject.build/Release-iphoneos/B4iProject.build/DerivedSources/armv7 -I/Users/rvanderpyl/B4iBuildServer/UploadedProjects/<user id>/build/B4iProject.build/Release-iphoneos/B4iProject.build/DerivedSources -F/Users/rvanderpyl/B4iBuildServer/UploadedProjects/<user id>/Payload -F../../Libs -MMD -MT dependencies -MF /Users/rvanderpyl/B4iBuildServer/UploadedProjects/<user id>/build/B4iProject.build/Release-iphoneos/B4iProject.build/Objects-normal/armv7/b4i_dbutils.d --serialize-diagnostics /Users/rvanderpyl/B4iBuildServer/UploadedProjects/<user id>/build/B4iProject.build/Release-iphoneos/B4iProject.build/Objects-normal/armv7/b4i_dbutils.dia -c /Users/rvanderpyl/B4iBuildServer/UploadedProjects/<user id>/B4iProject/b4i_dbutils.m -o /Users/rvanderpyl/B4iBuildServer/UploadedProjects/<user id>/build/B4iProject.build/Release-iphoneos/B4iProject.build/Objects-normal/armv7/b4i_dbutils.o
In file included from /Users/rvanderpyl/B4iBuildServer/UploadedProjects/<user id>/B4iProject/b4i_dbutils.m:2:
/Users/rvanderpyl/B4iBuildServer/UploadedProjects/<user id>/B4iProject/b4i_dbutils.h:7:9: fatal error: 'iTableView2.h' file not found
#import "iTableView2.h"
        ^
1 error generated.


Error: ** BUILD FAILED **


The following build commands failed:
    CompileC build/B4iProject.build/Release-iphoneos/B4iProject.build/Objects-normal/armv7/b4i_googlemapsextra.o B4iProject/b4i_googlemapsextra.m normal armv7 objective-c com.apple.compilers.llvm.clang.1_0.compiler
    CompileC build/B4iProject.build/Release-iphoneos/B4iProject.build/Objects-normal/armv7/b4i_dbutils.o B4iProject/b4i_dbutils.m normal armv7 objective-c com.apple.compilers.llvm.clang.1_0.compiler
(2 failures)
 
Last edited:

RVP

Active Member
Licensed User
Now it doesn't like googlemaps. iGoogleMaps.h and libiGoogleMaps.a, both dated Dec 15 2016 are in the Libs folder

B4X:
B4i version: 3.60
Parsing code.    (0.08s)
Compiling code.    (0.93s)
Compiling layouts code.    (0.01s)
Compiling debugger engine code.    (1.82s)
Building Xcode project    (0.74s)
Sending data to remote compiler.    Error
Out: Build settings from command line:
    ARCHS = armv7
    CODE_SIGN_IDENTITY = iPhone
    CONFIGURATION_BUILD_DIR = /Users/rvanderpyl/B4iBuildServer/UploadedProjects/<user id>/Payload
    OTHER_CODE_SIGN_FLAGS = --keychain <user id>
    PRODUCT_NAME = Gaffer Guru
    PROVISIONING_PROFILE = 6b6b89cb-814f-4669-8255-7c3184c85980

=== BUILD TARGET B4iProject OF PROJECT B4iProject WITH CONFIGURATION Release ===

Check dependencies

Write auxiliary files
/bin/mkdir -p /Users/rvanderpyl/B4iBuildServer/UploadedProjects/<user id>/build/B4iProject.build/Release-iphoneos/B4iProject.build/Objects-normal/armv7
write-file /Users/rvanderpyl/B4iBuildServer/UploadedProjects/<user id>/build/B4iProject.build/Release-iphoneos/B4iProject.build/Objects-normal/armv7/Gaffer\ Guru.LinkFileList
write-file /Users/rvanderpyl/B4iBuildServer/UploadedProjects/<user id>/build/B4iProject.build/Release-iphoneos/B4iProject.build/Gaffer\ Guru.hmap
write-file /Users/rvanderpyl/B4iBuildServer/UploadedProjects/<user id>/build/B4iProject.build/Release-iphoneos/B4iProject.build/Gaffer\ Guru-own-target-headers.hmap
write-file /Users/rvanderpyl/B4iBuildServer/UploadedProjects/<user id>/build/B4iProject.build/Release-iphoneos/B4iProject.build/Gaffer\ Guru-project-headers.hmap
write-file /Users/rvanderpyl/B4iBuildServer/UploadedProjects/<user id>/build/B4iProject.build/Release-iphoneos/B4iProject.build/Gaffer\ Guru-all-target-headers.hmap
write-file /Users/rvanderpyl/B4iBuildServer/UploadedProjects/<user id>/build/B4iProject.build/Release-iphoneos/B4iProject.build/Gaffer\ Guru-all-non-framework-target-headers.hmap
write-file /Users/rvanderpyl/B4iBuildServer/UploadedProjects/<user id>/build/B4iProject.build/Release-iphoneos/B4iProject.build/Gaffer\ Guru-generated-files.hmap

Create product structure
/bin/mkdir -p /Users/rvanderpyl/B4iBuildServer/UploadedProjects/<user id>/Payload/Gaffer\ Guru.app

ProcessInfoPlistFile Payload/Gaffer\ Guru.app/Info.plist B4iProject/B4iProject-Info.plist
    cd /Users/rvanderpyl/B4iBuildServer/UploadedProjects/<user id>
    export PATH="/Applications/Xcode.app/Contents/Developer/Platforms/iPhoneOS.platform/Developer/usr/bin:/Applications/Xcode.app/Contents/Developer/usr/bin:/usr/local/bin:/usr/bin:/bin:/usr/sbin:/sbin"
    builtin-infoPlistUtility /Users/rvanderpyl/B4iBuildServer/UploadedProjects/<user id>/B4iProject/B4iProject-Info.plist -genpkginfo /Users/rvanderpyl/B4iBuildServer/UploadedProjects/<user id>/Payload/Gaffer\ Guru.app/PkgInfo -expandbuildsettings -format binary -platform iphoneos -o /Users/rvanderpyl/B4iBuildServer/UploadedProjects/<user id>/Payload/Gaffer\ Guru.app/Info.plist

CompileC build/B4iProject.build/Release-iphoneos/B4iProject.build/Objects-normal/armv7/main.o B4iProject/main.m normal armv7 objective-c com.apple.compilers.llvm.clang.1_0.compiler
    cd /Users/rvanderpyl/B4iBuildServer/UploadedProjects/<user id>
    export LANG=en_US.US-ASCII
    export PATH="/Applications/Xcode.app/Contents/Developer/Platforms/iPhoneOS.platform/Developer/usr/bin:/Applications/Xcode.app/Contents/Developer/usr/bin:/usr/local/bin:/usr/bin:/bin:/usr/sbin:/sbin"
    /Applications/Xcode.app/Contents/Developer/Toolchains/XcodeDefault.xctoolchain/usr/bin/clang -x objective-c -arch armv7 -fmessage-length=0 -fdiagnostics-show-note-include-stack -fmacro-backtrace-limit=0 -std=gnu99 -fobjc-arc -fmodules -fmodules-prune-interval=86400 -fmodules-prune-after=345600 -fbuild-session-file=/var/folders/v0/k9s4gk4n0dd8hvzxztc624h40000gn/C/org.llvm.clang/ModuleCache/Session.modulevalidation -fmodules-validate-once-per-build-session -Wnon-modular-include-in-framework-module -Werror=non-modular-include-in-framework-module -Wno-trigraphs -fpascal-strings -O0 -Wno-missing-field-initializers -Wno-missing-prototypes -Werror=return-type -Wno-implicit-atomic-properties -Werror=deprecated-objc-isa-usage -Werror=objc-root-class -Wno-receiver-is-weak -Wno-arc-repeated-use-of-weak -Wduplicate-method-match -Wno-missing-braces -Wparentheses -Wswitch -Wunused-function -Wno-unused-label -Wno-unused-parameter -Wunused-variable -Wunused-value -Wempty-body -Wconditional-uninitialized -Wno-unknown-pragmas -Wno-shadow -Wno-four-char-constants -Wno-conversion -Wconstant-conversion -Wint-conversion -Wbool-conversion -Wenum-conversion -Wshorten-64-to-32 -Wpointer-sign -Wno-newline-eof -Wno-selector -Wno-strict-selector-match -Wundeclared-selector -Wno-deprecated-implementations -DNS_BLOCK_ASSERTIONS=1 -isysroot /Applications/Xcode.app/Contents/Developer/Platforms/iPhoneOS.platform/Developer/SDKs/iPhoneOS8.4.sdk -fstrict-aliasing -Wprotocol -Wdeprecated-declarations -fvisibility=hidden -Wno-sign-conversion -miphoneos-version-min=7.0 -iquote /Users/rvanderpyl/B4iBuildServer/UploadedProjects/<user id>/build/B4iProject.build/Release-iphoneos/B4iProject.build/Gaffer\ Guru-generated-files.hmap -I/Users/rvanderpyl/B4iBuildServer/UploadedProjects/<user id>/build/B4iProject.build/Release-iphoneos/B4iProject.build/Gaffer\ Guru-own-target-headers.hmap -I/Users/rvanderpyl/B4iBuildServer/UploadedProjects/<user id>/build/B4iProject.build/Release-iphoneos/B4iProject.build/Gaffer\ Guru-all-target-headers.hmap -iquote /Users/rvanderpyl/B4iBuildServer/UploadedProjects/<user id>/build/B4iProject.build/Release-iphoneos/B4iProject.build/Gaffer\ Guru-project-headers.hmap -I/Users/rvanderpyl/B4iBuildServer/UploadedProjects/<user id>/Payload/include -I/Applications/Xcode.app/Contents/Developer/Toolchains/XcodeDefault.xctoolchain/usr/include -I/Users/rvanderpyl/B4iBuildServer/UploadedProjects/<user id>/build/B4iProject.build/Release-iphoneos/B4iProject.build/DerivedSources/armv7 -I/Users/rvanderpyl/B4iBuildServer/UploadedProjects/<user id>/build/B4iProject.build/Release-iphoneos/B4iProject.build/DerivedSources -F/Users/rvanderpyl/B4iBuildServer/UploadedProjects/<user id>/Payload -F../../Libs -MMD -MT dependencies -MF /Users/rvanderpyl/B4iBuildServer/UploadedProjects/<user id>/build/B4iProject.build/Release-iphoneos/B4iProject.build/Objects-normal/armv7/main.d --serialize-diagnostics /Users/rvanderpyl/B4iBuildServer/UploadedProjects/<user id>/build/B4iProject.build/Release-iphoneos/B4iProject.build/Objects-normal/armv7/main.dia -c /Users/rvanderpyl/B4iBuildServer/UploadedProjects/<user id>/B4iProject/main.m -o /Users/rvanderpyl/B4iBuildServer/UploadedProjects/<user id>/build/B4iProject.build/Release-iphoneos/B4iProject.build/Objects-normal/armv7/main.o

CompileC build/B4iProject.build/Release-iphoneos/B4iProject.build/Objects-normal/armv7/b4i_dbutils.o B4iProject/b4i_dbutils.m normal armv7 objective-c com.apple.compilers.llvm.clang.1_0.compiler
    cd /Users/rvanderpyl/B4iBuildServer/UploadedProjects/<user id>
    export LANG=en_US.US-ASCII
    export PATH="/Applications/Xcode.app/Contents/Developer/Platforms/iPhoneOS.platform/Developer/usr/bin:/Applications/Xcode.app/Contents/Developer/usr/bin:/usr/local/bin:/usr/bin:/bin:/usr/sbin:/sbin"
    /Applications/Xcode.app/Contents/Developer/Toolchains/XcodeDefault.xctoolchain/usr/bin/clang -x objective-c -arch armv7 -fmessage-length=0 -fdiagnostics-show-note-include-stack -fmacro-backtrace-limit=0 -std=gnu99 -fobjc-arc -fmodules -fmodules-prune-interval=86400 -fmodules-prune-after=345600 -fbuild-session-file=/var/folders/v0/k9s4gk4n0dd8hvzxztc624h40000gn/C/org.llvm.clang/ModuleCache/Session.modulevalidation -fmodules-validate-once-per-build-session -Wnon-modular-include-in-framework-module -Werror=non-modular-include-in-framework-module -Wno-trigraphs -fpascal-strings -O0 -Wno-missing-field-initializers -Wno-missing-prototypes -Werror=return-type -Wno-implicit-atomic-properties -Werror=deprecated-objc-isa-usage -Werror=objc-root-class -Wno-receiver-is-weak -Wno-arc-repeated-use-of-weak -Wduplicate-method-match -Wno-missing-braces -Wparentheses -Wswitch -Wunused-function -Wno-unused-label -Wno-unused-parameter -Wunused-variable -Wunused-value -Wempty-body -Wconditional-uninitialized -Wno-unknown-pragmas -Wno-shadow -Wno-four-char-constants -Wno-conversion -Wconstant-conversion -Wint-conversion -Wbool-conversion -Wenum-conversion -Wshorten-64-to-32 -Wpointer-sign -Wno-newline-eof -Wno-selector -Wno-strict-selector-match -Wundeclared-selector -Wno-deprecated-implementations -DNS_BLOCK_ASSERTIONS=1 -isysroot /Applications/Xcode.app/Contents/Developer/Platforms/iPhoneOS.platform/Developer/SDKs/iPhoneOS8.4.sdk -fstrict-aliasing -Wprotocol -Wdeprecated-declarations -fvisibility=hidden -Wno-sign-conversion -miphoneos-version-min=7.0 -iquote /Users/rvanderpyl/B4iBuildServer/UploadedProjects/<user id>/build/B4iProject.build/Release-iphoneos/B4iProject.build/Gaffer\ Guru-generated-files.hmap -I/Users/rvanderpyl/B4iBuildServer/UploadedProjects/<user id>/build/B4iProject.build/Release-iphoneos/B4iProject.build/Gaffer\ Guru-own-target-headers.hmap -I/Users/rvanderpyl/B4iBuildServer/UploadedProjects/<user id>/build/B4iProject.build/Release-iphoneos/B4iProject.build/Gaffer\ Guru-all-target-headers.hmap -iquote /Users/rvanderpyl/B4iBuildServer/UploadedProjects/<user id>/build/B4iProject.build/Release-iphoneos/B4iProject.build/Gaffer\ Guru-project-headers.hmap -I/Users/rvanderpyl/B4iBuildServer/UploadedProjects/<user id>/Payload/include -I/Applications/Xcode.app/Contents/Developer/Toolchains/XcodeDefault.xctoolchain/usr/include -I/Users/rvanderpyl/B4iBuildServer/UploadedProjects/<user id>/build/B4iProject.build/Release-iphoneos/B4iProject.build/DerivedSources/armv7 -I/Users/rvanderpyl/B4iBuildServer/UploadedProjects/<user id>/build/B4iProject.build/Release-iphoneos/B4iProject.build/DerivedSources -F/Users/rvanderpyl/B4iBuildServer/UploadedProjects/<user id>/Payload -F../../Libs -MMD -MT dependencies -MF /Users/rvanderpyl/B4iBuildServer/UploadedProjects/<user id>/build/B4iProject.build/Release-iphoneos/B4iProject.build/Objects-normal/armv7/b4i_dbutils.d --serialize-diagnostics /Users/rvanderpyl/B4iBuildServer/UploadedProjects/<user id>/build/B4iProject.build/Release-iphoneos/B4iProject.build/Objects-normal/armv7/b4i_dbutils.dia -c /Users/rvanderpyl/B4iBuildServer/UploadedProjects/<user id>/B4iProject/b4i_dbutils.m -o /Users/rvanderpyl/B4iBuildServer/UploadedProjects/<user id>/build/B4iProject.build/Release-iphoneos/B4iProject.build/Objects-normal/armv7/b4i_dbutils.o

CompileC build/B4iProject.build/Release-iphoneos/B4iProject.build/Objects-normal/armv7/b4i_filing.o B4iProject/b4i_filing.m normal armv7 objective-c com.apple.compilers.llvm.clang.1_0.compiler
    cd /Users/rvanderpyl/B4iBuildServer/UploadedProjects/<user id>
    export LANG=en_US.US-ASCII
    export PATH="/Applications/Xcode.app/Contents/Developer/Platforms/iPhoneOS.platform/Developer/usr/bin:/Applications/Xcode.app/Contents/Developer/usr/bin:/usr/local/bin:/usr/bin:/bin:/usr/sbin:/sbin"
    /Applications/Xcode.app/Contents/Developer/Toolchains/XcodeDefault.xctoolchain/usr/bin/clang -x objective-c -arch armv7 -fmessage-length=0 -fdiagnostics-show-note-include-stack -fmacro-backtrace-limit=0 -std=gnu99 -fobjc-arc -fmodules -fmodules-prune-interval=86400 -fmodules-prune-after=345600 -fbuild-session-file=/var/folders/v0/k9s4gk4n0dd8hvzxztc624h40000gn/C/org.llvm.clang/ModuleCache/Session.modulevalidation -fmodules-validate-once-per-build-session -Wnon-modular-include-in-framework-module -Werror=non-modular-include-in-framework-module -Wno-trigraphs -fpascal-strings -O0 -Wno-missing-field-initializers -Wno-missing-prototypes -Werror=return-type -Wno-implicit-atomic-properties -Werror=deprecated-objc-isa-usage -Werror=objc-root-class -Wno-receiver-is-weak -Wno-arc-repeated-use-of-weak -Wduplicate-method-match -Wno-missing-braces -Wparentheses -Wswitch -Wunused-function -Wno-unused-label -Wno-unused-parameter -Wunused-variable -Wunused-value -Wempty-body -Wconditional-uninitialized -Wno-unknown-pragmas -Wno-shadow -Wno-four-char-constants -Wno-conversion -Wconstant-conversion -Wint-conversion -Wbool-conversion -Wenum-conversion -Wshorten-64-to-32 -Wpointer-sign -Wno-newline-eof -Wno-selector -Wno-strict-selector-match -Wundeclared-selector -Wno-deprecated-implementations -DNS_BLOCK_ASSERTIONS=1 -isysroot /Applications/Xcode.app/Contents/Developer/Platforms/iPhoneOS.platform/Developer/SDKs/iPhoneOS8.4.sdk -fstrict-aliasing -Wprotocol -Wdeprecated-declarations -fvisibility=hidden -Wno-sign-conversion -miphoneos-version-min=7.0 -iquote /Users/rvanderpyl/B4iBuildServer/UploadedProjects/<user id>/build/B4iProject.build/Release-iphoneos/B4iProject.build/Gaffer\ Guru-generated-files.hmap -I/Users/rvanderpyl/B4iBuildServer/UploadedProjects/<user id>/build/B4iProject.build/Release-iphoneos/B4iProject.build/Gaffer\ Guru-own-target-headers.hmap -I/Users/rvanderpyl/B4iBuildServer/UploadedProjects/<user id>/build/B4iProject.build/Release-iphoneos/B4iProject.build/Gaffer\ Guru-all-target-headers.hmap -iquote /Users/rvanderpyl/B4iBuildServer/UploadedProjects/<user id>/build/B4iProject.build/Release-iphoneos/B4iProject.build/Gaffer\ Guru-project-headers.hmap -I/Users/rvanderpyl/B4iBuildServer/UploadedProjects/<user id>/Payload/include -I/Applications/Xcode.app/Contents/Developer/Toolchains/XcodeDefault.xctoolchain/usr/include -I/Users/rvanderpyl/B4iBuildServer/UploadedProjects/<user id>/build/B4iProject.build/Release-iphoneos/B4iProject.build/DerivedSources/armv7 -I/Users/rvanderpyl/B4iBuildServer/UploadedProjects/<user id>/build/B4iProject.build/Release-iphoneos/B4iProject.build/DerivedSources -F/Users/rvanderpyl/B4iBuildServer/UploadedProjects/<user id>/Payload -F../../Libs -MMD -MT dependencies -MF /Users/rvanderpyl/B4iBuildServer/UploadedProjects/<user id>/build/B4iProject.build/Release-iphoneos/B4iProject.build/Objects-normal/armv7/b4i_filing.d --serialize-diagnostics /Users/rvanderpyl/B4iBuildServer/UploadedProjects/<user id>/build/B4iProject.build/Release-iphoneos/B4iProject.build/Objects-normal/armv7/b4i_filing.dia -c /Users/rvanderpyl/B4iBuildServer/UploadedProjects/<user id>/B4iProject/b4i_filing.m -o /Users/rvanderpyl/B4iBuildServer/UploadedProjects/<user id>/build/B4iProject.build/Release-iphoneos/B4iProject.build/Objects-normal/armv7/b4i_filing.o

CompileC build/B4iProject.build/Release-iphoneos/B4iProject.build/Objects-normal/armv7/b4i_googlemapsextra.o B4iProject/b4i_googlemapsextra.m normal armv7 objective-c com.apple.compilers.llvm.clang.1_0.compiler
    cd /Users/rvanderpyl/B4iBuildServer/UploadedProjects/<user id>
    export LANG=en_US.US-ASCII
    export PATH="/Applications/Xcode.app/Contents/Developer/Platforms/iPhoneOS.platform/Developer/usr/bin:/Applications/Xcode.app/Contents/Developer/usr/bin:/usr/local/bin:/usr/bin:/bin:/usr/sbin:/sbin"
    /Applications/Xcode.app/Contents/Developer/Toolchains/XcodeDefault.xctoolchain/usr/bin/clang -x objective-c -arch armv7 -fmessage-length=0 -fdiagnostics-show-note-include-stack -fmacro-backtrace-limit=0 -std=gnu99 -fobjc-arc -fmodules -fmodules-prune-interval=86400 -fmodules-prune-after=345600 -fbuild-session-file=/var/folders/v0/k9s4gk4n0dd8hvzxztc624h40000gn/C/org.llvm.clang/ModuleCache/Session.modulevalidation -fmodules-validate-once-per-build-session -Wnon-modular-include-in-framework-module -Werror=non-modular-include-in-framework-module -Wno-trigraphs -fpascal-strings -O0 -Wno-missing-field-initializers -Wno-missing-prototypes -Werror=return-type -Wno-implicit-atomic-properties -Werror=deprecated-objc-isa-usage -Werror=objc-root-class -Wno-receiver-is-weak -Wno-arc-repeated-use-of-weak -Wduplicate-method-match -Wno-missing-braces -Wparentheses -Wswitch -Wunused-function -Wno-unused-label -Wno-unused-parameter -Wunused-variable -Wunused-value -Wempty-body -Wconditional-uninitialized -Wno-unknown-pragmas -Wno-shadow -Wno-four-char-constants -Wno-conversion -Wconstant-conversion -Wint-conversion -Wbool-conversion -Wenum-conversion -Wshorten-64-to-32 -Wpointer-sign -Wno-newline-eof -Wno-selector -Wno-strict-selector-match -Wundeclared-selector -Wno-deprecated-implementations -DNS_BLOCK_ASSERTIONS=1 -isysroot /Applications/Xcode.app/Contents/Developer/Platforms/iPhoneOS.platform/Developer/SDKs/iPhoneOS8.4.sdk -fstrict-aliasing -Wprotocol -Wdeprecated-declarations -fvisibility=hidden -Wno-sign-conversion -miphoneos-version-min=7.0 -iquote /Users/rvanderpyl/B4iBuildServer/UploadedProjects/<user id>/build/B4iProject.build/Release-iphoneos/B4iProject.build/Gaffer\ Guru-generated-files.hmap -I/Users/rvanderpyl/B4iBuildServer/UploadedProjects/<user id>/build/B4iProject.build/Release-iphoneos/B4iProject.build/Gaffer\ Guru-own-target-headers.hmap -I/Users/rvanderpyl/B4iBuildServer/UploadedProjects/<user id>/build/B4iProject.build/Release-iphoneos/B4iProject.build/Gaffer\ Guru-all-target-headers.hmap -iquote /Users/rvanderpyl/B4iBuildServer/UploadedProjects/<user id>/build/B4iProject.build/Release-iphoneos/B4iProject.build/Gaffer\ Guru-project-headers.hmap -I/Users/rvanderpyl/B4iBuildServer/UploadedProjects/<user id>/Payload/include -I/Applications/Xcode.app/Contents/Developer/Toolchains/XcodeDefault.xctoolchain/usr/include -I/Users/rvanderpyl/B4iBuildServer/UploadedProjects/<user id>/build/B4iProject.build/Release-iphoneos/B4iProject.build/DerivedSources/armv7 -I/Users/rvanderpyl/B4iBuildServer/UploadedProjects/<user id>/build/B4iProject.build/Release-iphoneos/B4iProject.build/DerivedSources -F/Users/rvanderpyl/B4iBuildServer/UploadedProjects/<user id>/Payload -F../../Libs -MMD -MT dependencies -MF /Users/rvanderpyl/B4iBuildServer/UploadedProjects/<user id>/build/B4iProject.build/Release-iphoneos/B4iProject.build/Objects-normal/armv7/b4i_googlemapsextra.d --serialize-diagnostics /Users/rvanderpyl/B4iBuildServer/UploadedProjects/<user id>/build/B4iProject.build/Release-iphoneos/B4iProject.build/Objects-normal/armv7/b4i_googlemapsextra.dia -c /Users/rvanderpyl/B4iBuildServer/UploadedProjects/<user id>/B4iProject/b4i_googlemapsextra.m -o /Users/rvanderpyl/B4iBuildServer/UploadedProjects/<user id>/build/B4iProject.build/Release-iphoneos/B4iProject.build/Objects-normal/armv7/b4i_googlemapsextra.o
/Users/rvanderpyl/B4iBuildServer/UploadedProjects/<user id>/B4iProject/b4i_googlemapsextra.m:12:9: fatal error: 'GoogleMaps/GoogleMaps.h' file not found
#import <GoogleMaps/GoogleMaps.h>
        ^
1 error generated.

CompileC build/B4iProject.build/Release-iphoneos/B4iProject.build/Objects-normal/armv7/b4i_indexedtable.o B4iProject/b4i_indexedtable.m normal armv7 objective-c com.apple.compilers.llvm.clang.1_0.compiler
    cd /Users/rvanderpyl/B4iBuildServer/UploadedProjects/<user id>
    export LANG=en_US.US-ASCII
    export PATH="/Applications/Xcode.app/Contents/Developer/Platforms/iPhoneOS.platform/Developer/usr/bin:/Applications/Xcode.app/Contents/Developer/usr/bin:/usr/local/bin:/usr/bin:/bin:/usr/sbin:/sbin"
    /Applications/Xcode.app/Contents/Developer/Toolchains/XcodeDefault.xctoolchain/usr/bin/clang -x objective-c -arch armv7 -fmessage-length=0 -fdiagnostics-show-note-include-stack -fmacro-backtrace-limit=0 -std=gnu99 -fobjc-arc -fmodules -fmodules-prune-interval=86400 -fmodules-prune-after=345600 -fbuild-session-file=/var/folders/v0/k9s4gk4n0dd8hvzxztc624h40000gn/C/org.llvm.clang/ModuleCache/Session.modulevalidation -fmodules-validate-once-per-build-session -Wnon-modular-include-in-framework-module -Werror=non-modular-include-in-framework-module -Wno-trigraphs -fpascal-strings -O0 -Wno-missing-field-initializers -Wno-missing-prototypes -Werror=return-type -Wno-implicit-atomic-properties -Werror=deprecated-objc-isa-usage -Werror=objc-root-class -Wno-receiver-is-weak -Wno-arc-repeated-use-of-weak -Wduplicate-method-match -Wno-missing-braces -Wparentheses -Wswitch -Wunused-function -Wno-unused-label -Wno-unused-parameter -Wunused-variable -Wunused-value -Wempty-body -Wconditional-uninitialized -Wno-unknown-pragmas -Wno-shadow -Wno-four-char-constants -Wno-conversion -Wconstant-conversion -Wint-conversion -Wbool-conversion -Wenum-conversion -Wshorten-64-to-32 -Wpointer-sign -Wno-newline-eof -Wno-selector -Wno-strict-selector-match -Wundeclared-selector -Wno-deprecated-implementations -DNS_BLOCK_ASSERTIONS=1 -isysroot /Applications/Xcode.app/Contents/Developer/Platforms/iPhoneOS.platform/Developer/SDKs/iPhoneOS8.4.sdk -fstrict-aliasing -Wprotocol -Wdeprecated-declarations -fvisibility=hidden -Wno-sign-conversion -miphoneos-version-min=7.0 -iquote /Users/rvanderpyl/B4iBuildServer/UploadedProjects/<user id>/build/B4iProject.build/Release-iphoneos/B4iProject.build/Gaffer\ Guru-generated-files.hmap -I/Users/rvanderpyl/B4iBuildServer/UploadedProjects/<user id>/build/B4iProject.build/Release-iphoneos/B4iProject.build/Gaffer\ Guru-own-target-headers.hmap -I/Users/rvanderpyl/B4iBuildServer/UploadedProjects/<user id>/build/B4iProject.build/Release-iphoneos/B4iProject.build/Gaffer\ Guru-all-target-headers.hmap -iquote /Users/rvanderpyl/B4iBuildServer/UploadedProjects/<user id>/build/B4iProject.build/Release-iphoneos/B4iProject.build/Gaffer\ Guru-project-headers.hmap -I/Users/rvanderpyl/B4iBuildServer/UploadedProjects/<user id>/Payload/include -I/Applications/Xcode.app/Contents/Developer/Toolchains/XcodeDefault.xctoolchain/usr/include -I/Users/rvanderpyl/B4iBuildServer/UploadedProjects/<user id>/build/B4iProject.build/Release-iphoneos/B4iProject.build/DerivedSources/armv7 -I/Users/rvanderpyl/B4iBuildServer/UploadedProjects/<user id>/build/B4iProject.build/Release-iphoneos/B4iProject.build/DerivedSources -F/Users/rvanderpyl/B4iBuildServer/UploadedProjects/<user id>/Payload -F../../Libs -MMD -MT dependencies -MF /Users/rvanderpyl/B4iBuildServer/UploadedProjects/<user id>/build/B4iProject.build/Release-iphoneos/B4iProject.build/Objects-normal/armv7/b4i_indexedtable.d --serialize-diagnostics /Users/rvanderpyl/B4iBuildServer/UploadedProjects/<user id>/build/B4iProject.build/Release-iphoneos/B4iProject.build/Objects-normal/armv7/b4i_indexedtable.dia -c /Users/rvanderpyl/B4iBuildServer/UploadedProjects/<user id>/B4iProject/b4i_indexedtable.m -o /Users/rvanderpyl/B4iBuildServer/UploadedProjects/<user id>/build/B4iProject.build/Release-iphoneos/B4iProject.build/Objects-normal/armv7/b4i_indexedtable.o

CompileC build/B4iProject.build/Release-iphoneos/B4iProject.build/Objects-normal/armv7/b4i_info.o B4iProject/b4i_info.m normal armv7 objective-c com.apple.compilers.llvm.clang.1_0.compiler
    cd /Users/rvanderpyl/B4iBuildServer/UploadedProjects/<user id>
    export LANG=en_US.US-ASCII
    export PATH="/Applications/Xcode.app/Contents/Developer/Platforms/iPhoneOS.platform/Developer/usr/bin:/Applications/Xcode.app/Contents/Developer/usr/bin:/usr/local/bin:/usr/bin:/bin:/usr/sbin:/sbin"
    /Applications/Xcode.app/Contents/Developer/Toolchains/XcodeDefault.xctoolchain/usr/bin/clang -x objective-c -arch armv7 -fmessage-length=0 -fdiagnostics-show-note-include-stack -fmacro-backtrace-limit=0 -std=gnu99 -fobjc-arc -fmodules -fmodules-prune-interval=86400 -fmodules-prune-after=345600 -fbuild-session-file=/var/folders/v0/k9s4gk4n0dd8hvzxztc624h40000gn/C/org.llvm.clang/ModuleCache/Session.modulevalidation -fmodules-validate-once-per-build-session -Wnon-modular-include-in-framework-module -Werror=non-modular-include-in-framework-module -Wno-trigraphs -fpascal-strings -O0 -Wno-missing-field-initializers -Wno-missing-prototypes -Werror=return-type -Wno-implicit-atomic-properties -Werror=deprecated-objc-isa-usage -Werror=objc-root-class -Wno-receiver-is-weak -Wno-arc-repeated-use-of-weak -Wduplicate-method-match -Wno-missing-braces -Wparentheses -Wswitch -Wunused-function -Wno-unused-label -Wno-unused-parameter -Wunused-variable -Wunused-value -Wempty-body -Wconditional-uninitialized -Wno-unknown-pragmas -Wno-shadow -Wno-four-char-constants -Wno-conversion -Wconstant-conversion -Wint-conversion -Wbool-conversion -Wenum-conversion -Wshorten-64-to-32 -Wpointer-sign -Wno-newline-eof -Wno-selector -Wno-strict-selector-match -Wundeclared-selector -Wno-deprecated-implementations -DNS_BLOCK_ASSERTIONS=1 -isysroot /Applications/Xcode.app/Contents/Developer/Platforms/iPhoneOS.platform/Developer/SDKs/iPhoneOS8.4.sdk -fstrict-aliasing -Wprotocol -Wdeprecated-declarations -fvisibility=hidden -Wno-sign-conversion -miphoneos-version-min=7.0 -iquote /Users/rvanderpyl/B4iBuildServer/UploadedProjects/<user id>/build/B4iProject.build/Release-iphoneos/B4iProject.build/Gaffer\ Guru-generated-files.hmap -I/Users/rvanderpyl/B4iBuildServer/UploadedProjects/<user id>/build/B4iProject.build/Release-iphoneos/B4iProject.build/Gaffer\ Guru-own-target-headers.hmap -I/Users/rvanderpyl/B4iBuildServer/UploadedProjects/<user id>/build/B4iProject.build/Release-iphoneos/B4iProject.build/Gaffer\ Guru-all-target-headers.hmap -iquote /Users/rvanderpyl/B4iBuildServer/UploadedProjects/<user id>/build/B4iProject.build/Release-iphoneos/B4iProject.build/Gaffer\ Guru-project-headers.hmap -I/Users/rvanderpyl/B4iBuildServer/UploadedProjects/<user id>/Payload/include -I/Applications/Xcode.app/Contents/Developer/Toolchains/XcodeDefault.xctoolchain/usr/include -I/Users/rvanderpyl/B4iBuildServer/UploadedProjects/<user id>/build/B4iProject.build/Release-iphoneos/B4iProject.build/DerivedSources/armv7 -I/Users/rvanderpyl/B4iBuildServer/UploadedProjects/<user id>/build/B4iProject.build/Release-iphoneos/B4iProject.build/DerivedSources -F/Users/rvanderpyl/B4iBuildServer/UploadedProjects/<user id>/Payload -F../../Libs -MMD -MT dependencies -MF /Users/rvanderpyl/B4iBuildServer/UploadedProjects/<user id>/build/B4iProject.build/Release-iphoneos/B4iProject.build/Objects-normal/armv7/b4i_info.d --serialize-diagnostics /Users/rvanderpyl/B4iBuildServer/UploadedProjects/<user id>/build/B4iProject.build/Release-iphoneos/B4iProject.build/Objects-normal/armv7/b4i_info.dia -c /Users/rvanderpyl/B4iBuildServer/UploadedProjects/<user id>/B4iProject/b4i_info.m -o /Users/rvanderpyl/B4iBuildServer/UploadedProjects/<user id>/build/B4iProject.build/Release-iphoneos/B4iProject.build/Objects-normal/armv7/b4i_info.o

CompileC build/B4iProject.build/Release-iphoneos/B4iProject.build/Objects-normal/armv7/b4i_main.o B4iProject/b4i_main.m normal armv7 objective-c com.apple.compilers.llvm.clang.1_0.compiler
    cd /Users/rvanderpyl/B4iBuildServer/UploadedProjects/<user id>
    export LANG=en_US.US-ASCII
    export PATH="/Applications/Xcode.app/Contents/Developer/Platforms/iPhoneOS.platform/Developer/usr/bin:/Applications/Xcode.app/Contents/Developer/usr/bin:/usr/local/bin:/usr/bin:/bin:/usr/sbin:/sbin"
    /Applications/Xcode.app/Contents/Developer/Toolchains/XcodeDefault.xctoolchain/usr/bin/clang -x objective-c -arch armv7 -fmessage-length=0 -fdiagnostics-show-note-include-stack -fmacro-backtrace-limit=0 -std=gnu99 -fobjc-arc -fmodules -fmodules-prune-interval=86400 -fmodules-prune-after=345600 -fbuild-session-file=/var/folders/v0/k9s4gk4n0dd8hvzxztc624h40000gn/C/org.llvm.clang/ModuleCache/Session.modulevalidation -fmodules-validate-once-per-build-session -Wnon-modular-include-in-framework-module -Werror=non-modular-include-in-framework-module -Wno-trigraphs -fpascal-strings -O0 -Wno-missing-field-initializers -Wno-missing-prototypes -Werror=return-type -Wno-implicit-atomic-properties -Werror=deprecated-objc-isa-usage -Werror=objc-root-class -Wno-receiver-is-weak -Wno-arc-repeated-use-of-weak -Wduplicate-method-match -Wno-missing-braces -Wparentheses -Wswitch -Wunused-function -Wno-unused-label -Wno-unused-parameter -Wunused-variable -Wunused-value -Wempty-body -Wconditional-uninitialized -Wno-unknown-pragmas -Wno-shadow -Wno-four-char-constants -Wno-conversion -Wconstant-conversion -Wint-conversion -Wbool-conversion -Wenum-conversion -Wshorten-64-to-32 -Wpointer-sign -Wno-newline-eof -Wno-selector -Wno-strict-selector-match -Wundeclared-selector -Wno-deprecated-implementations -DNS_BLOCK_ASSERTIONS=1 -isysroot /Applications/Xcode.app/Contents/Developer/Platforms/iPhoneOS.platform/Developer/SDKs/iPhoneOS8.4.sdk -fstrict-aliasing -Wprotocol -Wdeprecated-declarations -fvisibility=hidden -Wno-sign-conversion -miphoneos-version-min=7.0 -iquote /Users/rvanderpyl/B4iBuildServer/UploadedProjects/<user id>/build/B4iProject.build/Release-iphoneos/B4iProject.build/Gaffer\ Guru-generated-files.hmap -I/Users/rvanderpyl/B4iBuildServer/UploadedProjects/<user id>/build/B4iProject.build/Release-iphoneos/B4iProject.build/Gaffer\ Guru-own-target-headers.hmap -I/Users/rvanderpyl/B4iBuildServer/UploadedProjects/<user id>/build/B4iProject.build/Release-iphoneos/B4iProject.build/Gaffer\ Guru-all-target-headers.hmap -iquote /Users/rvanderpyl/B4iBuildServer/UploadedProjects/<user id>/build/B4iProject.build/Release-iphoneos/B4iProject.build/Gaffer\ Guru-project-headers.hmap -I/Users/rvanderpyl/B4iBuildServer/UploadedProjects/<user id>/Payload/include -I/Applications/Xcode.app/Contents/Developer/Toolchains/XcodeDefault.xctoolchain/usr/include -I/Users/rvanderpyl/B4iBuildServer/UploadedProjects/<user id>/build/B4iProject.build/Release-iphoneos/B4iProject.build/DerivedSources/armv7 -I/Users/rvanderpyl/B4iBuildServer/UploadedProjects/<user id>/build/B4iProject.build/Release-iphoneos/B4iProject.build/DerivedSources -F/Users/rvanderpyl/B4iBuildServer/UploadedProjects/<user id>/Payload -F../../Libs -MMD -MT dependencies -MF /Users/rvanderpyl/B4iBuildServer/UploadedProjects/<user id>/build/B4iProject.build/Release-iphoneos/B4iProject.build/Objects-normal/armv7/b4i_main.d --serialize-diagnostics /Users/rvanderpyl/B4iBuildServer/UploadedProjects/<user id>/build/B4iProject.build/Release-iphoneos/B4iProject.build/Objects-normal/armv7/b4i_main.dia -c /Users/rvanderpyl/B4iBuildServer/UploadedProjects/<user id>/B4iProject/b4i_main.m -o /Users/rvanderpyl/B4iBuildServer/UploadedProjects/<user id>/build/B4iProject.build/Release-iphoneos/B4iProject.build/Objects-normal/armv7/b4i_main.o


Error: ** BUILD FAILED **


The following build commands failed:
    CompileC build/B4iProject.build/Release-iphoneos/B4iProject.build/Objects-normal/armv7/b4i_googlemapsextra.o B4iProject/b4i_googlemapsextra.m normal armv7 objective-c com.apple.compilers.llvm.clang.1_0.compiler
(1 failure)
Here is my Server info

B4X:
B4i Build Server

Build server is running.
Version: 3.6
Server time: 09:54:19
Mac SSL Key

Key IP: 192.168.2.103
SSL port: 51042
h files

iAd: 1.00
iAdMob: 1.50
iAnalytics: 1.0
iArchiver: 1.20
iBarcode: 1.20
iBLE: 2.00
iCallSubUtils
iContacts: 1.00
iCore: 3.60
iCustomListView
iDateUtils
iDebug: 1.60
iDebug2: 1.60
iDesigner: 1.20
iDropboxSync: 1.00
iEncryption: 1.02
iFacebook: 1.00
iFirebaseAnalytics: 1.00
iFirebaseAuth: 1.02
iFirebaseNotifications: 1.00
iFirebaseStorage: 1.00
iGameView: 1.0
iGoogleMaps: 1.10
iHttp: 1.01
iHttpUtils2
iHUD: 1.00
iJSON: 1.0
iLeadbolt: 2.00
iLocation: 1.20
iMedia: 1.21
iMQTT: 1.0
iNet: 1.30
iNetwork: 1.25
iPhone: 2.00
iRandomAccessFile: 1.71
iReleaseLogger: 1.00
iSideMenu: 1.01
iSpeechRecognition: 1.00
iSQL: 1.30
iStore: 1.0
iStringUtils: 1.00
iSVG: 1.00
iTableView: 1.21
iUI8: 1.21
iUI9: 1.0
iWebSocket: 1.01
iXmlBuilder: 1.00
iXmlSax: 1.10
a files

libAdapterInMobi, size=1125360, modified=12/15/2016 20:06:18
libCore, size=3521640, modified=02/06/2017 22:58:50
libiAd, size=36880, modified=12/15/2016 20:06:18
libiAdMob, size=95080, modified=11/13/2016 17:32:00
libiAnalytics, size=39504, modified=12/15/2016 20:06:18
libiArchiver, size=445144, modified=11/09/2016 17:06:02
libiBarcode, size=247568, modified=12/15/2016 20:06:18
libiBLE, size=226416, modified=12/15/2016 20:06:18
libiCallSubUtils, size=125560, modified=12/15/2016 01:37:52
libiContacts, size=111512, modified=12/15/2016 20:06:18
libiCustomListView, size=249864, modified=12/14/2016 20:36:16
libiDateUtils, size=263576, modified=12/14/2016 22:43:40
libiDebug2, size=1077520, modified=12/15/2016 20:06:18
libiDesigner, size=847032, modified=12/08/2016 19:30:02
libiDropboxSync, size=80960, modified=12/15/2016 20:06:18
libiEncryption, size=67752, modified=12/15/2016 20:06:18
libiFacebook, size=52672, modified=12/15/2016 20:06:18
libiFirebaseAnalytics, size=31608, modified=12/15/2016 20:06:18
libiFirebaseAuth, size=158688, modified=12/15/2016 20:06:18
libiFirebaseNotifications, size=49976, modified=12/15/2016 20:06:18
libiFirebaseStorage, size=91344, modified=12/15/2016 20:06:18
libiGameView, size=3804208, modified=12/15/2016 20:06:18
libiGoogleMaps, size=160616, modified=12/15/2016 20:06:18
libiHttp, size=121800, modified=12/15/2016 20:06:18
libiHttpUtils2, size=322800, modified=12/15/2016 01:43:16
libiHUD, size=285496, modified=12/15/2016 20:06:18
libiJSON, size=53320, modified=12/15/2016 20:06:18
libiLeadbolt, size=21440, modified=12/15/2016 20:06:18
libiLocation, size=122192, modified=12/15/2016 20:06:18
libiMedia, size=250584, modified=01/05/2017 16:44:44
libiMQTT, size=1575592, modified=12/15/2016 20:06:20
libiNet, size=542520, modified=12/15/2016 20:06:20
libiNetwork, size=261400, modified=12/27/2016 22:28:18
libiPhone, size=321792, modified=11/17/2016 17:38:16
libiRandomAccessFile, size=403456, modified=12/26/2016 19:41:24
libiReleaseLogger, size=49976, modified=12/15/2016 20:06:20
libiSideMenu, size=504704, modified=12/15/2016 20:06:20
libiSpeechRecognition, size=167464, modified=11/10/2016 23:27:22
libiSQL, size=401008, modified=12/15/2016 20:06:20
libiStore, size=51224, modified=12/15/2016 20:06:20
libiStringUtils, size=55328, modified=12/15/2016 20:06:20
libiSVG, size=57360, modified=12/15/2016 20:06:20
libiTableView, size=194152, modified=12/15/2016 20:06:20
libiUI8, size=504576, modified=01/04/2017 22:16:44
libiUI9, size=66552, modified=12/15/2016 20:06:20
libiWebSocket, size=390560, modified=12/27/2016 22:52:06
libiXmlBuilder, size=151200, modified=12/15/2016 20:06:20
libiXmlSax, size=61888
 

RVP

Active Member
Licensed User
I had this working fine with my previous version but I was trying to cleanup my local MacBuilder install when I loaded this version and I have obviously done something wrong this time. I am trying to follow the instructions in the link to the SDK, but I am not sure whether I actually need to go thru the process of building a project that they show, or if I just need to download and grab the GoogleMaps.Framework and copy it over to the Libs. Doing so doesn't seem to work as it then complains about missing other Frameworks. The other question is whether I need an older version of the SDK, or I can use the current 2.2?
 

RVP

Active Member
Licensed User
Thanks, that seems to have gotten rid of the google maps related errors, still getting an other error, but I realized that I was still run Xcode 6.x so am upgrading to 7.3 to see if that will fix this one.
 

RVP

Active Member
Licensed User
Ah ok, I was going by the Macbuilder installation instructions. Have to see if i can install 8.
 

RVP

Active Member
Licensed User
Finally got everything updated, could only go to XCode 7.3.1.

I am still getting an error:

B4X:
B4i version: 3.60
Parsing code.    (0.07s)
Compiling code.    (0.95s)
Compiling layouts code.    (0.01s)
Compiling debugger engine code.    (1.94s)
Building Xcode project    (0.62s)
Sending data to remote compiler.    Error
Error compiling designer script.
File: info, variant: General script
Line: sgBeam.SetLeftAndRight(20%x,8    0%x)
Out: Build settings from command line:
    ARCHS = armv7
    CODE_SIGN_IDENTITY = iPhone
    CONFIGURATION_BUILD_DIR = /Users/rvanderpyl/B4iBuildServer/UploadedProjects/<user id>/Payload
    OTHER_CODE_SIGN_FLAGS = --keychain <user id>
    PRODUCT_NAME = PrimeLight
    PROVISIONING_PROFILE = 6b6b89cb-814f-4669-8255-7c3184c85980

=== BUILD TARGET B4iProject OF PROJECT B4iProject WITH CONFIGURATION Release ===

Check dependencies

Write auxiliary files
write-file /Users/rvanderpyl/B4iBuildServer/UploadedProjects/<user id>/build/B4iProject.build/Release-iphoneos/B4iProject.build/PrimeLight-project-headers.hmap
write-file /Users/rvanderpyl/B4iBuildServer/UploadedProjects/<user id>/build/B4iProject.build/Release-iphoneos/B4iProject.build/PrimeLight.hmap
write-file /Users/rvanderpyl/B4iBuildServer/UploadedProjects/<user id>/build/B4iProject.build/Release-iphoneos/B4iProject.build/PrimeLight-all-non-framework-target-headers.hmap
write-file /Users/rvanderpyl/B4iBuildServer/UploadedProjects/<user id>/build/B4iProject.build/Release-iphoneos/B4iProject.build/PrimeLight-all-target-headers.hmap
/bin/mkdir -p /Users/rvanderpyl/B4iBuildServer/UploadedProjects/<user id>/build/B4iProject.build/Release-iphoneos/B4iProject.build/Objects-normal/armv7
write-file /Users/rvanderpyl/B4iBuildServer/UploadedProjects/<user id>/build/B4iProject.build/Release-iphoneos/B4iProject.build/Objects-normal/armv7/PrimeLight.LinkFileList
write-file /Users/rvanderpyl/B4iBuildServer/UploadedProjects/<user id>/build/B4iProject.build/Release-iphoneos/B4iProject.build/PrimeLight-own-target-headers.hmap
write-file /Users/rvanderpyl/B4iBuildServer/UploadedProjects/<user id>/build/B4iProject.build/Release-iphoneos/B4iProject.build/PrimeLight-generated-files.hmap

Create product structure
/bin/mkdir -p /Users/rvanderpyl/B4iBuildServer/UploadedProjects/<user id>/Payload/PrimeLight.app

ProcessInfoPlistFile Payload/PrimeLight.app/Info.plist B4iProject/B4iProject-Info.plist
    cd /Users/rvanderpyl/B4iBuildServer/UploadedProjects/<user id>
    export PATH="/Applications/Xcode.app/Contents/Developer/Platforms/iPhoneOS.platform/Developer/usr/bin:/Applications/Xcode.app/Contents/Developer/usr/bin:/usr/local/bin:/usr/bin:/bin:/usr/sbin:/sbin"
    builtin-infoPlistUtility /Users/rvanderpyl/B4iBuildServer/UploadedProjects/<user id>/B4iProject/B4iProject-Info.plist -genpkginfo /Users/rvanderpyl/B4iBuildServer/UploadedProjects/<user id>/Payload/PrimeLight.app/PkgInfo -expandbuildsettings -format binary -platform iphoneos -o /Users/rvanderpyl/B4iBuildServer/UploadedProjects/<user id>/Payload/PrimeLight.app/Info.plist

CompileC build/B4iProject.build/Release-iphoneos/B4iProject.build/Objects-normal/armv7/b4i_filingmodule.o B4iProject/b4i_filingmodule.m normal armv7 objective-c com.apple.compilers.llvm.clang.1_0.compiler
    cd /Users/rvanderpyl/B4iBuildServer/UploadedProjects/<user id>
    export LANG=en_US.US-ASCII
    export PATH="/Applications/Xcode.app/Contents/Developer/Platforms/iPhoneOS.platform/Developer/usr/bin:/Applications/Xcode.app/Contents/Developer/usr/bin:/usr/local/bin:/usr/bin:/bin:/usr/sbin:/sbin"
    /Applications/Xcode.app/Contents/Developer/Toolchains/XcodeDefault.xctoolchain/usr/bin/clang -x objective-c -arch armv7 -fmessage-length=0 -fdiagnostics-show-note-include-stack -fmacro-backtrace-limit=0 -std=gnu99 -fobjc-arc -fmodules -fmodules-prune-interval=86400 -fmodules-prune-after=345600 -fbuild-session-file=/var/folders/v0/k9s4gk4n0dd8hvzxztc624h40000gn/C/org.llvm.clang/ModuleCache/Session.modulevalidation -fmodules-validate-once-per-build-session -Wnon-modular-include-in-framework-module -Werror=non-modular-include-in-framework-module -Wno-trigraphs -fpascal-strings -O0 -Wno-missing-field-initializers -Wno-missing-prototypes -Werror=return-type -Wno-implicit-atomic-properties -Werror=deprecated-objc-isa-usage -Werror=objc-root-class -Wno-arc-repeated-use-of-weak -Wduplicate-method-match -Wno-missing-braces -Wparentheses -Wswitch -Wunused-function -Wno-unused-label -Wno-unused-parameter -Wunused-variable -Wunused-value -Wempty-body -Wconditional-uninitialized -Wno-unknown-pragmas -Wno-shadow -Wno-four-char-constants -Wno-conversion -Wconstant-conversion -Wint-conversion -Wbool-conversion -Wenum-conversion -Wshorten-64-to-32 -Wpointer-sign -Wno-newline-eof -Wno-selector -Wno-strict-selector-match -Wundeclared-selector -Wno-deprecated-implementations -DNS_BLOCK_ASSERTIONS=1 -isysroot /Applications/Xcode.app/Contents/Developer/Platforms/iPhoneOS.platform/Developer/SDKs/iPhoneOS9.3.sdk -fstrict-aliasing -Wprotocol -Wdeprecated-declarations -miphoneos-version-min=8.0 -fvisibility=hidden -Wno-sign-conversion -iquote /Users/rvanderpyl/B4iBuildServer/UploadedProjects/<user id>/build/B4iProject.build/Release-iphoneos/B4iProject.build/PrimeLight-generated-files.hmap -I/Users/rvanderpyl/B4iBuildServer/UploadedProjects/<user id>/build/B4iProject.build/Release-iphoneos/B4iProject.build/PrimeLight-own-target-headers.hmap -I/Users/rvanderpyl/B4iBuildServer/UploadedProjects/<user id>/build/B4iProject.build/Release-iphoneos/B4iProject.build/PrimeLight-all-target-headers.hmap -iquote /Users/rvanderpyl/B4iBuildServer/UploadedProjects/<user id>/build/B4iProject.build/Release-iphoneos/B4iProject.build/PrimeLight-project-headers.hmap -I/Users/rvanderpyl/B4iBuildServer/UploadedProjects/<user id>/Payload/include -I/Users/rvanderpyl/B4iBuildServer/UploadedProjects/<user id>/build/B4iProject.build/Release-iphoneos/B4iProject.build/DerivedSources/armv7 -I/Users/rvanderpyl/B4iBuildServer/UploadedProjects/<user id>/build/B4iProject.build/Release-iphoneos/B4iProject.build/DerivedSources -F/Users/rvanderpyl/B4iBuildServer/UploadedProjects/<user id>/Payload -F../../Libs -MMD -MT dependencies -MF /Users/rvanderpyl/B4iBuildServer/UploadedProjects/<user id>/build/B4iProject.build/Release-iphoneos/B4iProject.build/Objects-normal/armv7/b4i_filingmodule.d --serialize-diagnostics /Users/rvanderpyl/B4iBuildServer/UploadedProjects/<user id>/build/B4iProject.build/Release-iphoneos/B4iProject.build/Objects-normal/armv7/b4i_filingmodule.dia -c /Users/rvanderpyl/B4iBuildServer/UploadedProjects/<user id>/B4iProject/b4i_filingmodule.m -o /Users/rvanderpyl/B4iBuildServer/UploadedProjects/<user id>/build/B4iProject.build/Release-iphoneos/B4iProject.build/Objects-normal/armv7/b4i_filingmodule.o

CompileC build/B4iProject.build/Release-iphoneos/B4iProject.build/Objects-normal/armv7/b4i_indexedtable.o B4iProject/b4i_indexedtable.m normal armv7 objective-c com.apple.compilers.llvm.clang.1_0.compiler
    cd /Users/rvanderpyl/B4iBuildServer/UploadedProjects/<user id>
    export LANG=en_US.US-ASCII
    export PATH="/Applications/Xcode.app/Contents/Developer/Platforms/iPhoneOS.platform/Developer/usr/bin:/Applications/Xcode.app/Contents/Developer/usr/bin:/usr/local/bin:/usr/bin:/bin:/usr/sbin:/sbin"
    /Applications/Xcode.app/Contents/Developer/Toolchains/XcodeDefault.xctoolchain/usr/bin/clang -x objective-c -arch armv7 -fmessage-length=0 -fdiagnostics-show-note-include-stack -fmacro-backtrace-limit=0 -std=gnu99 -fobjc-arc -fmodules -fmodules-prune-interval=86400 -fmodules-prune-after=345600 -fbuild-session-file=/var/folders/v0/k9s4gk4n0dd8hvzxztc624h40000gn/C/org.llvm.clang/ModuleCache/Session.modulevalidation -fmodules-validate-once-per-build-session -Wnon-modular-include-in-framework-module -Werror=non-modular-include-in-framework-module -Wno-trigraphs -fpascal-strings -O0 -Wno-missing-field-initializers -Wno-missing-prototypes -Werror=return-type -Wno-implicit-atomic-properties -Werror=deprecated-objc-isa-usage -Werror=objc-root-class -Wno-arc-repeated-use-of-weak -Wduplicate-method-match -Wno-missing-braces -Wparentheses -Wswitch -Wunused-function -Wno-unused-label -Wno-unused-parameter -Wunused-variable -Wunused-value -Wempty-body -Wconditional-uninitialized -Wno-unknown-pragmas -Wno-shadow -Wno-four-char-constants -Wno-conversion -Wconstant-conversion -Wint-conversion -Wbool-conversion -Wenum-conversion -Wshorten-64-to-32 -Wpointer-sign -Wno-newline-eof -Wno-selector -Wno-strict-selector-match -Wundeclared-selector -Wno-deprecated-implementations -DNS_BLOCK_ASSERTIONS=1 -isysroot /Applications/Xcode.app/Contents/Developer/Platforms/iPhoneOS.platform/Developer/SDKs/iPhoneOS9.3.sdk -fstrict-aliasing -Wprotocol -Wdeprecated-declarations -miphoneos-version-min=8.0 -fvisibility=hidden -Wno-sign-conversion -iquote /Users/rvanderpyl/B4iBuildServer/UploadedProjects/<user id>/build/B4iProject.build/Release-iphoneos/B4iProject.build/PrimeLight-generated-files.hmap -I/Users/rvanderpyl/B4iBuildServer/UploadedProjects/<user id>/build/B4iProject.build/Release-iphoneos/B4iProject.build/PrimeLight-own-target-headers.hmap -I/Users/rvanderpyl/B4iBuildServer/UploadedProjects/<user id>/build/B4iProject.build/Release-iphoneos/B4iProject.build/PrimeLight-all-target-headers.hmap -iquote /Users/rvanderpyl/B4iBuildServer/UploadedProjects/<user id>/build/B4iProject.build/Release-iphoneos/B4iProject.build/PrimeLight-project-headers.hmap -I/Users/rvanderpyl/B4iBuildServer/UploadedProjects/<user id>/Payload/include -I/Users/rvanderpyl/B4iBuildServer/UploadedProjects/<user id>/build/B4iProject.build/Release-iphoneos/B4iProject.build/DerivedSources/armv7 -I/Users/rvanderpyl/B4iBuildServer/UploadedProjects/<user id>/build/B4iProject.build/Release-iphoneos/B4iProject.build/DerivedSources -F/Users/rvanderpyl/B4iBuildServer/UploadedProjects/<user id>/Payload -F../../Libs -MMD -MT dependencies -MF /Users/rvanderpyl/B4iBuildServer/UploadedProjects/<user id>/build/B4iProject.build/Release-iphoneos/B4iProject.build/Objects-normal/armv7/b4i_indexedtable.d --serialize-diagnostics /Users/rvanderpyl/B4iBuildServer/UploadedProjects/<user id>/build/B4iProject.build/Release-iphoneos/B4iProject.build/Objects-normal/armv7/b4i_indexedtable.dia -c /Users/rvanderpyl/B4iBuildServer/UploadedProjects/<user id>/B4iProject/b4i_indexedtable.m -o /Users/rvanderpyl/B4iBuildServer/UploadedProjects/<user id>/build/B4iProject.build/Release-iphoneos/B4iProject.build/Objects-normal/armv7/b4i_indexedtable.o

CompileC build/B4iProject.build/Release-iphoneos/B4iProject.build/Objects-normal/armv7/main.o B4iProject/main.m normal armv7 objective-c com.apple.compilers.llvm.clang.1_0.compiler
    cd /Users/rvanderpyl/B4iBuildServer/UploadedProjects/<user id>
    export LANG=en_US.US-ASCII
    export PATH="/Applications/Xcode.app/Contents/Developer/Platforms/iPhoneOS.platform/Developer/usr/bin:/Applications/Xcode.app/Contents/Developer/usr/bin:/usr/local/bin:/usr/bin:/bin:/usr/sbin:/sbin"
    /Applications/Xcode.app/Contents/Developer/Toolchains/XcodeDefault.xctoolchain/usr/bin/clang -x objective-c -arch armv7 -fmessage-length=0 -fdiagnostics-show-note-include-stack -fmacro-backtrace-limit=0 -std=gnu99 -fobjc-arc -fmodules -fmodules-prune-interval=86400 -fmodules-prune-after=345600 -fbuild-session-file=/var/folders/v0/k9s4gk4n0dd8hvzxztc624h40000gn/C/org.llvm.clang/ModuleCache/Session.modulevalidation -fmodules-validate-once-per-build-session -Wnon-modular-include-in-framework-module -Werror=non-modular-include-in-framework-module -Wno-trigraphs -fpascal-strings -O0 -Wno-missing-field-initializers -Wno-missing-prototypes -Werror=return-type -Wno-implicit-atomic-properties -Werror=deprecated-objc-isa-usage -Werror=objc-root-class -Wno-arc-repeated-use-of-weak -Wduplicate-method-match -Wno-missing-braces -Wparentheses -Wswitch -Wunused-function -Wno-unused-label -Wno-unused-parameter -Wunused-variable -Wunused-value -Wempty-body -Wconditional-uninitialized -Wno-unknown-pragmas -Wno-shadow -Wno-four-char-constants -Wno-conversion -Wconstant-conversion -Wint-conversion -Wbool-conversion -Wenum-conversion -Wshorten-64-to-32 -Wpointer-sign -Wno-newline-eof -Wno-selector -Wno-strict-selector-match -Wundeclared-selector -Wno-deprecated-implementations -DNS_BLOCK_ASSERTIONS=1 -isysroot /Applications/Xcode.app/Contents/Developer/Platforms/iPhoneOS.platform/Developer/SDKs/iPhoneOS9.3.sdk -fstrict-aliasing -Wprotocol -Wdeprecated-declarations -miphoneos-version-min=8.0 -fvisibility=hidden -Wno-sign-conversion -iquote /Users/rvanderpyl/B4iBuildServer/UploadedProjects/<user id>/build/B4iProject.build/Release-iphoneos/B4iProject.build/PrimeLight-generated-files.hmap -I/Users/rvanderpyl/B4iBuildServer/UploadedProjects/<user id>/build/B4iProject.build/Release-iphoneos/B4iProject.build/PrimeLight-own-target-headers.hmap -I/Users/rvanderpyl/B4iBuildServer/UploadedProjects/<user id>/build/B4iProject.build/Release-iphoneos/B4iProject.build/PrimeLight-all-target-headers.hmap -iquote /Users/rvanderpyl/B4iBuildServer/UploadedProjects/<user id>/build/B4iProject.build/Release-iphoneos/B4iProject.build/PrimeLight-project-headers.hmap -I/Users/rvanderpyl/B4iBuildServer/UploadedProjects/<user id>/Payload/include -I/Users/rvanderpyl/B4iBuildServer/UploadedProjects/<user id>/build/B4iProject.build/Release-iphoneos/B4iProject.build/DerivedSources/armv7 -I/Users/rvanderpyl/B4iBuildServer/UploadedProjects/<user id>/build/B4iProject.build/Release-iphoneos/B4iProject.build/DerivedSources -F/Users/rvanderpyl/B4iBuildServer/UploadedProjects/<user id>/Payload -F../../Libs -MMD -MT dependencies -MF /Users/rvanderpyl/B4iBuildServer/UploadedProjects/<user id>/build/B4iProject.build/Release-iphoneos/B4iProject.build/Objects-normal/armv7/main.d --serialize-diagnostics /Users/rvanderpyl/B4iBuildServer/UploadedProjects/<user id>/build/B4iProject.build/Release-iphoneos/B4iProject.build/Objects-normal/armv7/main.dia -c /Users/rvanderpyl/B4iBuildServer/UploadedProjects/<user id>/B4iProject/main.m -o /Users/rvanderpyl/B4iBuildServer/UploadedProjects/<user id>/build/B4iProject.build/Release-iphoneos/B4iProject.build/Objects-normal/armv7/main.o

CompileC build/B4iProject.build/Release-iphoneos/B4iProject.build/Objects-normal/armv7/b4i_dbutils.o B4iProject/b4i_dbutils.m normal armv7 objective-c com.apple.compilers.llvm.clang.1_0.compiler
    cd /Users/rvanderpyl/B4iBuildServer/UploadedProjects/<user id>
    export LANG=en_US.US-ASCII
    export PATH="/Applications/Xcode.app/Contents/Developer/Platforms/iPhoneOS.platform/Developer/usr/bin:/Applications/Xcode.app/Contents/Developer/usr/bin:/usr/local/bin:/usr/bin:/bin:/usr/sbin:/sbin"
    /Applications/Xcode.app/Contents/Developer/Toolchains/XcodeDefault.xctoolchain/usr/bin/clang -x objective-c -arch armv7 -fmessage-length=0 -fdiagnostics-show-note-include-stack -fmacro-backtrace-limit=0 -std=gnu99 -fobjc-arc -fmodules -fmodules-prune-interval=86400 -fmodules-prune-after=345600 -fbuild-session-file=/var/folders/v0/k9s4gk4n0dd8hvzxztc624h40000gn/C/org.llvm.clang/ModuleCache/Session.modulevalidation -fmodules-validate-once-per-build-session -Wnon-modular-include-in-framework-module -Werror=non-modular-include-in-framework-module -Wno-trigraphs -fpascal-strings -O0 -Wno-missing-field-initializers -Wno-missing-prototypes -Werror=return-type -Wno-implicit-atomic-properties -Werror=deprecated-objc-isa-usage -Werror=objc-root-class -Wno-arc-repeated-use-of-weak -Wduplicate-method-match -Wno-missing-braces -Wparentheses -Wswitch -Wunused-function -Wno-unused-label -Wno-unused-parameter -Wunused-variable -Wunused-value -Wempty-body -Wconditional-uninitialized -Wno-unknown-pragmas -Wno-shadow -Wno-four-char-constants -Wno-conversion -Wconstant-conversion -Wint-conversion -Wbool-conversion -Wenum-conversion -Wshorten-64-to-32 -Wpointer-sign -Wno-newline-eof -Wno-selector -Wno-strict-selector-match -Wundeclared-selector -Wno-deprecated-implementations -DNS_BLOCK_ASSERTIONS=1 -isysroot /Applications/Xcode.app/Contents/Developer/Platforms/iPhoneOS.platform/Developer/SDKs/iPhoneOS9.3.sdk -fstrict-aliasing -Wprotocol -Wdeprecated-declarations -miphoneos-version-min=8.0 -fvisibility=hidden -Wno-sign-conversion -iquote /Users/rvanderpyl/B4iBuildServer/UploadedProjects/<user id>/build/B4iProject.build/Release-iphoneos/B4iProject.build/PrimeLight-generated-files.hmap -I/Users/rvanderpyl/B4iBuildServer/UploadedProjects/<user id>/build/B4iProject.build/Release-iphoneos/B4iProject.build/PrimeLight-own-target-headers.hmap -I/Users/rvanderpyl/B4iBuildServer/UploadedProjects/<user id>/build/B4iProject.build/Release-iphoneos/B4iProject.build/PrimeLight-all-target-headers.hmap -iquote /Users/rvanderpyl/B4iBuildServer/UploadedProjects/<user id>/build/B4iProject.build/Release-iphoneos/B4iProject.build/PrimeLight-project-headers.hmap -I/Users/rvanderpyl/B4iBuildServer/UploadedProjects/<user id>/Payload/include -I/Users/rvanderpyl/B4iBuildServer/UploadedProjects/<user id>/build/B4iProject.build/Release-iphoneos/B4iProject.build/DerivedSources/armv7 -I/Users/rvanderpyl/B4iBuildServer/UploadedProjects/<user id>/build/B4iProject.build/Release-iphoneos/B4iProject.build/DerivedSources -F/Users/rvanderpyl/B4iBuildServer/UploadedProjects/<user id>/Payload -F../../Libs -MMD -MT dependencies -MF /Users/rvanderpyl/B4iBuildServer/UploadedProjects/<user id>/build/B4iProject.build/Release-iphoneos/B4iProject.build/Objects-normal/armv7/b4i_dbutils.d --serialize-diagnostics /Users/rvanderpyl/B4iBuildServer/UploadedProjects/<user id>/build/B4iProject.build/Release-iphoneos/B4iProject.build/Objects-normal/armv7/b4i_dbutils.dia -c /Users/rvanderpyl/B4iBuildServer/UploadedProjects/<user id>/B4iProject/b4i_dbutils.m -o /Users/rvanderpyl/B4iBuildServer/UploadedProjects/<user id>/build/B4iProject.build/Release-iphoneos/B4iProject.build/Objects-normal/armv7/b4i_dbutils.o

CompileC build/B4iProject.build/Release-iphoneos/B4iProject.build/Objects-normal/armv7/b4i_info.o B4iProject/b4i_info.m normal armv7 objective-c com.apple.compilers.llvm.clang.1_0.compiler
    cd /Users/rvanderpyl/B4iBuildServer/UploadedProjects/<user id>
    export LANG=en_US.US-ASCII
    export PATH="/Applications/Xcode.app/Contents/Developer/Platforms/iPhoneOS.platform/Developer/usr/bin:/Applications/Xcode.app/Contents/Developer/usr/bin:/usr/local/bin:/usr/bin:/bin:/usr/sbin:/sbin"
    /Applications/Xcode.app/Contents/Developer/Toolchains/XcodeDefault.xctoolchain/usr/bin/clang -x objective-c -arch armv7 -fmessage-length=0 -fdiagnostics-show-note-include-stack -fmacro-backtrace-limit=0 -std=gnu99 -fobjc-arc -fmodules -fmodules-prune-interval=86400 -fmodules-prune-after=345600 -fbuild-session-file=/var/folders/v0/k9s4gk4n0dd8hvzxztc624h40000gn/C/org.llvm.clang/ModuleCache/Session.modulevalidation -fmodules-validate-once-per-build-session -Wnon-modular-include-in-framework-module -Werror=non-modular-include-in-framework-module -Wno-trigraphs -fpascal-strings -O0 -Wno-missing-field-initializers -Wno-missing-prototypes -Werror=return-type -Wno-implicit-atomic-properties -Werror=deprecated-objc-isa-usage -Werror=objc-root-class -Wno-arc-repeated-use-of-weak -Wduplicate-method-match -Wno-missing-braces -Wparentheses -Wswitch -Wunused-function -Wno-unused-label -Wno-unused-parameter -Wunused-variable -Wunused-value -Wempty-body -Wconditional-uninitialized -Wno-unknown-pragmas -Wno-shadow -Wno-four-char-constants -Wno-conversion -Wconstant-conversion -Wint-conversion -Wbool-conversion -Wenum-conversion -Wshorten-64-to-32 -Wpointer-sign -Wno-newline-eof -Wno-selector -Wno-strict-selector-match -Wundeclared-selector -Wno-deprecated-implementations -DNS_BLOCK_ASSERTIONS=1 -isysroot /Applications/Xcode.app/Contents/Developer/Platforms/iPhoneOS.platform/Developer/SDKs/iPhoneOS9.3.sdk -fstrict-aliasing -Wprotocol -Wdeprecated-declarations -miphoneos-version-min=8.0 -fvisibility=hidden -Wno-sign-conversion -iquote /Users/rvanderpyl/B4iBuildServer/UploadedProjects/<user id>/build/B4iProject.build/Release-iphoneos/B4iProject.build/PrimeLight-generated-files.hmap -I/Users/rvanderpyl/B4iBuildServer/UploadedProjects/<user id>/build/B4iProject.build/Release-iphoneos/B4iProject.build/PrimeLight-own-target-headers.hmap -I/Users/rvanderpyl/B4iBuildServer/UploadedProjects/<user id>/build/B4iProject.build/Release-iphoneos/B4iProject.build/PrimeLight-all-target-headers.hmap -iquote /Users/rvanderpyl/B4iBuildServer/UploadedProjects/<user id>/build/B4iProject.build/Release-iphoneos/B4iProject.build/PrimeLight-project-headers.hmap -I/Users/rvanderpyl/B4iBuildServer/UploadedProjects/<user id>/Payload/include -I/Users/rvanderpyl/B4iBuildServer/UploadedProjects/<user id>/build/B4iProject.build/Release-iphoneos/B4iProject.build/DerivedSources/armv7 -I/Users/rvanderpyl/B4iBuildServer/UploadedProjects/<user id>/build/B4iProject.build/Release-iphoneos/B4iProject.build/DerivedSources -F/Users/rvanderpyl/B4iBuildServer/UploadedProjects/<user id>/Payload -F../../Libs -MMD -MT dependencies -MF /Users/rvanderpyl/B4iBuildServer/UploadedProjects/<user id>/build/B4iProject.build/Release-iphoneos/B4iProject.build/Objects-normal/armv7/b4i_info.d --serialize-diagnostics /Users/rvanderpyl/B4iBuildServer/UploadedProjects/<user id>/build/B4iProject.build/Release-iphoneos/B4iProject.build/Objects-normal/armv7/b4i_info.dia -c /Users/rvanderpyl/B4iBuildServer/UploadedProjects/<user id>/B4iProject/b4i_info.m -o /Users/rvanderpyl/B4iBuildServer/UploadedProjects/<user id>/build/B4iProject.build/Release-iphoneos/B4iProject.build/Objects-normal/armv7/b4i_info.o

CompileC build/B4iProject.build/Release-iphoneos/B4iProject.build/Objects-normal/armv7/b4i_main.o B4iProject/b4i_main.m normal armv7 objective-c com.apple.compilers.llvm.clang.1_0.compiler
    cd /Users/rvanderpyl/B4iBuildServer/UploadedProjects/<user id>
    export LANG=en_US.US-ASCII
    export PATH="/Applications/Xcode.app/Contents/Developer/Platforms/iPhoneOS.platform/Developer/usr/bin:/Applications/Xcode.app/Contents/Developer/usr/bin:/usr/local/bin:/usr/bin:/bin:/usr/sbin:/sbin"
    /Applications/Xcode.app/Contents/Developer/Toolchains/XcodeDefault.xctoolchain/usr/bin/clang -x objective-c -arch armv7 -fmessage-length=0 -fdiagnostics-show-note-include-stack -fmacro-backtrace-limit=0 -std=gnu99 -fobjc-arc -fmodules -fmodules-prune-interval=86400 -fmodules-prune-after=345600 -fbuild-session-file=/var/folders/v0/k9s4gk4n0dd8hvzxztc624h40000gn/C/org.llvm.clang/ModuleCache/Session.modulevalidation -fmodules-validate-once-per-build-session -Wnon-modular-include-in-framework-module -Werror=non-modular-include-in-framework-module -Wno-trigraphs -fpascal-strings -O0 -Wno-missing-field-initializers -Wno-missing-prototypes -Werror=return-type -Wno-implicit-atomic-properties -Werror=deprecated-objc-isa-usage -Werror=objc-root-class -Wno-arc-repeated-use-of-weak -Wduplicate-method-match -Wno-missing-braces -Wparentheses -Wswitch -Wunused-function -Wno-unused-label -Wno-unused-parameter -Wunused-variable -Wunused-value -Wempty-body -Wconditional-uninitialized -Wno-unknown-pragmas -Wno-shadow -Wno-four-char-constants -Wno-conversion -Wconstant-conversion -Wint-conversion -Wbool-conversion -Wenum-conversion -Wshorten-64-to-32 -Wpointer-sign -Wno-newline-eof -Wno-selector -Wno-strict-selector-match -Wundeclared-selector -Wno-deprecated-implementations -DNS_BLOCK_ASSERTIONS=1 -isysroot /Applications/Xcode.app/Contents/Developer/Platforms/iPhoneOS.platform/Developer/SDKs/iPhoneOS9.3.sdk -fstrict-aliasing -Wprotocol -Wdeprecated-declarations -miphoneos-version-min=8.0 -fvisibility=hidden -Wno-sign-conversion -iquote /Users/rvanderpyl/B4iBuildServer/UploadedProjects/<user id>/build/B4iProject.build/Release-iphoneos/B4iProject.build/PrimeLight-generated-files.hmap -I/Users/rvanderpyl/B4iBuildServer/UploadedProjects/<user id>/build/B4iProject.build/Release-iphoneos/B4iProject.build/PrimeLight-own-target-headers.hmap -I/Users/rvanderpyl/B4iBuildServer/UploadedProjects/<user id>/build/B4iProject.build/Release-iphoneos/B4iProject.build/PrimeLight-all-target-headers.hmap -iquote /Users/rvanderpyl/B4iBuildServer/UploadedProjects/<user id>/build/B4iProject.build/Release-iphoneos/B4iProject.build/PrimeLight-project-headers.hmap -I/Users/rvanderpyl/B4iBuildServer/UploadedProjects/<user id>/Payload/include -I/Users/rvanderpyl/B4iBuildServer/UploadedProjects/<user id>/build/B4iProject.build/Release-iphoneos/B4iProject.build/DerivedSources/armv7 -I/Users/rvanderpyl/B4iBuildServer/UploadedProjects/<user id>/build/B4iProject.build/Release-iphoneos/B4iProject.build/DerivedSources -F/Users/rvanderpyl/B4iBuildServer/UploadedProjects/<user id>/Payload -F../../Libs -MMD -MT dependencies -MF /Users/rvanderpyl/B4iBuildServer/UploadedProjects/<user id>/build/B4iProject.build/Release-iphoneos/B4iProject.build/Objects-normal/armv7/b4i_main.d --serialize-diagnostics /Users/rvanderpyl/B4iBuildServer/UploadedProjects/<user id>/build/B4iProject.build/Release-iphoneos/B4iProject.build/Objects-normal/armv7/b4i_main.dia -c /Users/rvanderpyl/B4iBuildServer/UploadedProjects/<user id>/B4iProject/b4i_main.m -o /Users/rvanderpyl/B4iBuildServer/UploadedProjects/<user id>/build/B4iProject.build/Release-iphoneos/B4iProject.build/Objects-normal/armv7/b4i_main.o

CompileC build/B4iProject.build/Release-iphoneos/B4iProject.build/Objects-normal/armv7/b4i_sqlstrings.o B4iProject/b4i_sqlstrings.m normal armv7 objective-c com.apple.compilers.llvm.clang.1_0.compiler
    cd /Users/rvanderpyl/B4iBuildServer/UploadedProjects/<user id>
    export LANG=en_US.US-ASCII
    export PATH="/Applications/Xcode.app/Contents/Developer/Platforms/iPhoneOS.platform/Developer/usr/bin:/Applications/Xcode.app/Contents/Developer/usr/bin:/usr/local/bin:/usr/bin:/bin:/usr/sbin:/sbin"
    /Applications/Xcode.app/Contents/Developer/Toolchains/XcodeDefault.xctoolchain/usr/bin/clang -x objective-c -arch armv7 -fmessage-length=0 -fdiagnostics-show-note-include-stack -fmacro-backtrace-limit=0 -std=gnu99 -fobjc-arc -fmodules -fmodules-prune-interval=86400 -fmodules-prune-after=345600 -fbuild-session-file=/var/folders/v0/k9s4gk4n0dd8hvzxztc624h40000gn/C/org.llvm.clang/ModuleCache/Session.modulevalidation -fmodules-validate-once-per-build-session -Wnon-modular-include-in-framework-module -Werror=non-modular-include-in-framework-module -Wno-trigraphs -fpascal-strings -O0 -Wno-missing-field-initializers -Wno-missing-prototypes -Werror=return-type -Wno-implicit-atomic-properties -Werror=deprecated-objc-isa-usage -Werror=objc-root-class -Wno-arc-repeated-use-of-weak -Wduplicate-method-match -Wno-missing-braces -Wparentheses -Wswitch -Wunused-function -Wno-unused-label -Wno-unused-parameter -Wunused-variable -Wunused-value -Wempty-body -Wconditional-uninitialized -Wno-unknown-pragmas -Wno-shadow -Wno-four-char-constants -Wno-conversion -Wconstant-conversion -Wint-conversion -Wbool-conversion -Wenum-conversion -Wshorten-64-to-32 -Wpointer-sign -Wno-newline-eof -Wno-selector -Wno-strict-selector-match -Wundeclared-selector -Wno-deprecated-implementations -DNS_BLOCK_ASSERTIONS=1 -isysroot /Applications/Xcode.app/Contents/Developer/Platforms/iPhoneOS.platform/Developer/SDKs/iPhoneOS9.3.sdk -fstrict-aliasing -Wprotocol -Wdeprecated-declarations -miphoneos-version-min=8.0 -fvisibility=hidden -Wno-sign-conversion -iquote /Users/rvanderpyl/B4iBuildServer/UploadedProjects/<user id>/build/B4iProject.build/Release-iphoneos/B4iProject.build/PrimeLight-generated-files.hmap -I/Users/rvanderpyl/B4iBuildServer/UploadedProjects/<user id>/build/B4iProject.build/Release-iphoneos/B4iProject.build/PrimeLight-own-target-headers.hmap -I/Users/rvanderpyl/B4iBuildServer/UploadedProjects/<user id>/build/B4iProject.build/Release-iphoneos/B4iProject.build/PrimeLight-all-target-headers.hmap -iquote /Users/rvanderpyl/B4iBuildServer/UploadedProjects/<user id>/build/B4iProject.build/Release-iphoneos/B4iProject.build/PrimeLight-project-headers.hmap -I/Users/rvanderpyl/B4iBuildServer/UploadedProjects/<user id>/Payload/include -I/Users/rvanderpyl/B4iBuildServer/UploadedProjects/<user id>/build/B4iProject.build/Release-iphoneos/B4iProject.build/DerivedSources/armv7 -I/Users/rvanderpyl/B4iBuildServer/UploadedProjects/<user id>/build/B4iProject.build/Release-iphoneos/B4iProject.build/DerivedSources -F/Users/rvanderpyl/B4iBuildServer/UploadedProjects/<user id>/Payload -F../../Libs -MMD -MT dependencies -MF /Users/rvanderpyl/B4iBuildServer/UploadedProjects/<user id>/build/B4iProject.build/Release-iphoneos/B4iProject.build/Objects-normal/armv7/b4i_sqlstrings.d --serialize-diagnostics /Users/rvanderpyl/B4iBuildServer/UploadedProjects/<user id>/build/B4iProject.build/Release-iphoneos/B4iProject.build/Objects-normal/armv7/b4i_sqlstrings.dia -c /Users/rvanderpyl/B4iBuildServer/UploadedProjects/<user id>/B4iProject/b4i_sqlstrings.m -o /Users/rvanderpyl/B4iBuildServer/UploadedProjects/<user id>/build/B4iProject.build/Release-iphoneos/B4iProject.build/Objects-normal/armv7/b4i_sqlstrings.o

CompileC build/B4iProject.build/Release-iphoneos/B4iProject.build/Objects-normal/armv7/b4i_table.o B4iProject/b4i_table.m normal armv7 objective-c com.apple.compilers.llvm.clang.1_0.compiler
    cd /Users/rvanderpyl/B4iBuildServer/UploadedProjects/<user id>
    export LANG=en_US.US-ASCII
    export PATH="/Applications/Xcode.app/Contents/Developer/Platforms/iPhoneOS.platform/Developer/usr/bin:/Applications/Xcode.app/Contents/Developer/usr/bin:/usr/local/bin:/usr/bin:/bin:/usr/sbin:/sbin"
    /Applications/Xcode.app/Contents/Developer/Toolchains/XcodeDefault.xctoolchain/usr/bin/clang -x objective-c -arch armv7 -fmessage-length=0 -fdiagnostics-show-note-include-stack -fmacro-backtrace-limit=0 -std=gnu99 -fobjc-arc -fmodules -fmodules-prune-interval=86400 -fmodules-prune-after=345600 -fbuild-session-file=/var/folders/v0/k9s4gk4n0dd8hvzxztc624h40000gn/C/org.llvm.clang/ModuleCache/Session.modulevalidation -fmodules-validate-once-per-build-session -Wnon-modular-include-in-framework-module -Werror=non-modular-include-in-framework-module -Wno-trigraphs -fpascal-strings -O0 -Wno-missing-field-initializers -Wno-missing-prototypes -Werror=return-type -Wno-implicit-atomic-properties -Werror=deprecated-objc-isa-usage -Werror=objc-root-class -Wno-arc-repeated-use-of-weak -Wduplicate-method-match -Wno-missing-braces -Wparentheses -Wswitch -Wunused-function -Wno-unused-label -Wno-unused-parameter -Wunused-variable -Wunused-value -Wempty-body -Wconditional-uninitialized -Wno-unknown-pragmas -Wno-shadow -Wno-four-char-constants -Wno-conversion -Wconstant-conversion -Wint-conversion -Wbool-conversion -Wenum-conversion -Wshorten-64-to-32 -Wpointer-sign -Wno-newline-eof -Wno-selector -Wno-strict-selector-match -Wundeclared-selector -Wno-deprecated-implementations -DNS_BLOCK_ASSERTIONS=1 -isysroot /Applications/Xcode.app/Contents/Developer/Platforms/iPhoneOS.platform/Developer/SDKs/iPhoneOS9.3.sdk -fstrict-aliasing -Wprotocol -Wdeprecated-declarations -miphoneos-version-min=8.0 -fvisibility=hidden -Wno-sign-conversion -iquote /Users/rvanderpyl/B4iBuildServer/UploadedProjects/<user id>/build/B4iProject.build/Release-iphoneos/B4iProject.build/PrimeLight-generated-files.hmap -I/Users/rvanderpyl/B4iBuildServer/UploadedProjects/<user id>/build/B4iProject.build/Release-iphoneos/B4iProject.build/PrimeLight-own-target-headers.hmap -I/Users/rvanderpyl/B4iBuildServer/UploadedProjects/<user id>/build/B4iProject.build/Release-iphoneos/B4iProject.build/PrimeLight-all-target-headers.hmap -iquote /Users/rvanderpyl/B4iBuildServer/UploadedProjects/<user id>/build/B4iProject.build/Release-iphoneos/B4iProject.build/PrimeLight-project-headers.hmap -I/Users/rvanderpyl/B4iBuildServer/UploadedProjects/<user id>/Payload/include -I/Users/rvanderpyl/B4iBuildServer/UploadedProjects/<user id>/build/B4iProject.build/Release-iphoneos/B4iProject.build/DerivedSources/armv7 -I/Users/rvanderpyl/B4iBuildServer/UploadedProjects/<user id>/build/B4iProject.build/Release-iphoneos/B4iProject.build/DerivedSources -F/Users/rvanderpyl/B4iBuildServer/UploadedProjects/<user id>/Payload -F../../Libs -MMD -MT dependencies -MF /Users/rvanderpyl/B4iBuildServer/UploadedProjects/<user id>/build/B4iProject.build/Release-iphoneos/B4iProject.build/Objects-normal/armv7/b4i_table.d --serialize-diagnostics /Users/rvanderpyl/B4iBuildServer/UploadedProjects/<user id>/build/B4iProject.build/Release-iphoneos/B4iProject.build/Objects-normal/armv7/b4i_table.dia -c /Users/rvanderpyl/B4iBuildServer/UploadedProjects/<user id>/B4iProject/b4i_table.m -o /Users/rvanderpyl/B4iBuildServer/UploadedProjects/<user id>/build/B4iProject.build/Release-iphoneos/B4iProject.build/Objects-normal/armv7/b4i_table.o

CompileC build/B4iProject.build/Release-iphoneos/B4iProject.build/Objects-normal/armv7/b4i_vendorview.o B4iProject/b4i_vendorview.m normal armv7 objective-c com.apple.compilers.llvm.clang.1_0.compiler
    cd /Users/rvanderpyl/B4iBuildServer/UploadedProjects/<user id>
    export LANG=en_US.US-ASCII
    export PATH="/Applications/Xcode.app/Contents/Developer/Platforms/iPhoneOS.platform/Developer/usr/bin:/Applications/Xcode.app/Contents/Developer/usr/bin:/usr/local/bin:/usr/bin:/bin:/usr/sbin:/sbin"
    /Applications/Xcode.app/Contents/Developer/Toolchains/XcodeDefault.xctoolchain/usr/bin/clang -x objective-c -arch armv7 -fmessage-length=0 -fdiagnostics-show-note-include-stack -fmacro-backtrace-limit=0 -std=gnu99 -fobjc-arc -fmodules -fmodules-prune-interval=86400 -fmodules-prune-after=345600 -fbuild-session-file=/var/folders/v0/k9s4gk4n0dd8hvzxztc624h40000gn/C/org.llvm.clang/ModuleCache/Session.modulevalidation -fmodules-validate-once-per-build-session -Wnon-modular-include-in-framework-module -Werror=non-modular-include-in-framework-module -Wno-trigraphs -fpascal-strings -O0 -Wno-missing-field-initializers -Wno-missing-prototypes -Werror=return-type -Wno-implicit-atomic-properties -Werror=deprecated-objc-isa-usage -Werror=objc-root-class -Wno-arc-repeated-use-of-weak -Wduplicate-method-match -Wno-missing-braces -Wparentheses -Wswitch -Wunused-function -Wno-unused-label -Wno-unused-parameter -Wunused-variable -Wunused-value -Wempty-body -Wconditional-uninitialized -Wno-unknown-pragmas -Wno-shadow -Wno-four-char-constants -Wno-conversion -Wconstant-conversion -Wint-conversion -Wbool-conversion -Wenum-conversion -Wshorten-64-to-32 -Wpointer-sign -Wno-newline-eof -Wno-selector -Wno-strict-selector-match -Wundeclared-selector -Wno-deprecated-implementations -DNS_BLOCK_ASSERTIONS=1 -isysroot /Applications/Xcode.app/Contents/Developer/Platforms/iPhoneOS.platform/Developer/SDKs/iPhoneOS9.3.sdk -fstrict-aliasing -Wprotocol -Wdeprecated-declarations -miphoneos-version-min=8.0 -fvisibility=hidden -Wno-sign-conversion -iquote /Users/rvanderpyl/B4iBuildServer/UploadedProjects/<user id>/build/B4iProject.build/Release-iphoneos/B4iProject.build/PrimeLight-generated-files.hmap -I/Users/rvanderpyl/B4iBuildServer/UploadedProjects/<user id>/build/B4iProject.build/Release-iphoneos/B4iProject.build/PrimeLight-own-target-headers.hmap -I/Users/rvanderpyl/B4iBuildServer/UploadedProjects/<user id>/build/B4iProject.build/Release-iphoneos/B4iProject.build/PrimeLight-all-target-headers.hmap -iquote /Users/rvanderpyl/B4iBuildServer/UploadedProjects/<user id>/build/B4iProject.build/Release-iphoneos/B4iProject.build/PrimeLight-project-headers.hmap -I/Users/rvanderpyl/B4iBuildServer/UploadedProjects/<user id>/Payload/include -I/Users/rvanderpyl/B4iBuildServer/UploadedProjects/<user id>/build/B4iProject.build/Release-iphoneos/B4iProject.build/DerivedSources/armv7 -I/Users/rvanderpyl/B4iBuildServer/UploadedProjects/<user id>/build/B4iProject.build/Release-iphoneos/B4iProject.build/DerivedSources -F/Users/rvanderpyl/B4iBuildServer/UploadedProjects/<user id>/Payload -F../../Libs -MMD -MT dependencies -MF /Users/rvanderpyl/B4iBuildServer/UploadedProjects/<user id>/build/B4iProject.build/Release-iphoneos/B4iProject.build/Objects-normal/armv7/b4i_vendorview.d --serialize-diagnostics /Users/rvanderpyl/B4iBuildServer/UploadedProjects/<user id>/build/B4iProject.build/Release-iphoneos/B4iProject.build/Objects-normal/armv7/b4i_vendorview.dia -c /Users/rvanderpyl/B4iBuildServer/UploadedProjects/<user id>/B4iProject/b4i_vendorview.m -o /Users/rvanderpyl/B4iBuildServer/UploadedProjects/<user id>/build/B4iProject.build/Release-iphoneos/B4iProject.build/Objects-normal/armv7/b4i_vendorview.o

CompileC build/B4iProject.build/Release-iphoneos/B4iProject.build/Objects-normal/armv7/LS_1.o B4iProject/LS_1.m normal armv7 objective-c com.apple.compilers.llvm.clang.1_0.compiler
    cd /Users/rvanderpyl/B4iBuildServer/UploadedProjects/<user id>
    export LANG=en_US.US-ASCII
    export PATH="/Applications/Xcode.app/Contents/Developer/Platforms/iPhoneOS.platform/Developer/usr/bin:/Applications/Xcode.app/Contents/Developer/usr/bin:/usr/local/bin:/usr/bin:/bin:/usr/sbin:/sbin"
    /Applications/Xcode.app/Contents/Developer/Toolchains/XcodeDefault.xctoolchain/usr/bin/clang -x objective-c -arch armv7 -fmessage-length=0 -fdiagnostics-show-note-include-stack -fmacro-backtrace-limit=0 -std=gnu99 -fobjc-arc -fmodules -fmodules-prune-interval=86400 -fmodules-prune-after=345600 -fbuild-session-file=/var/folders/v0/k9s4gk4n0dd8hvzxztc624h40000gn/C/org.llvm.clang/ModuleCache/Session.modulevalidation -fmodules-validate-once-per-build-session -Wnon-modular-include-in-framework-module -Werror=non-modular-include-in-framework-module -Wno-trigraphs -fpascal-strings -O0 -Wno-missing-field-initializers -Wno-missing-prototypes -Werror=return-type -Wno-implicit-atomic-properties -Werror=deprecated-objc-isa-usage -Werror=objc-root-class -Wno-arc-repeated-use-of-weak -Wduplicate-method-match -Wno-missing-braces -Wparentheses -Wswitch -Wunused-function -Wno-unused-label -Wno-unused-parameter -Wunused-variable -Wunused-value -Wempty-body -Wconditional-uninitialized -Wno-unknown-pragmas -Wno-shadow -Wno-four-char-constants -Wno-conversion -Wconstant-conversion -Wint-conversion -Wbool-conversion -Wenum-conversion -Wshorten-64-to-32 -Wpointer-sign -Wno-newline-eof -Wno-selector -Wno-strict-selector-match -Wundeclared-selector -Wno-deprecated-implementations -DNS_BLOCK_ASSERTIONS=1 -isysroot /Applications/Xcode.app/Contents/Developer/Platforms/iPhoneOS.platform/Developer/SDKs/iPhoneOS9.3.sdk -fstrict-aliasing -Wprotocol -Wdeprecated-declarations -miphoneos-version-min=8.0 -fvisibility=hidden -Wno-sign-conversion -iquote /Users/rvanderpyl/B4iBuildServer/UploadedProjects/<user id>/build/B4iProject.build/Release-iphoneos/B4iProject.build/PrimeLight-generated-files.hmap -I/Users/rvanderpyl/B4iBuildServer/UploadedProjects/<user id>/build/B4iProject.build/Release-iphoneos/B4iProject.build/PrimeLight-own-target-headers.hmap -I/Users/rvanderpyl/B4iBuildServer/UploadedProjects/<user id>/build/B4iProject.build/Release-iphoneos/B4iProject.build/PrimeLight-all-target-headers.hmap -iquote /Users/rvanderpyl/B4iBuildServer/UploadedProjects/<user id>/build/B4iProject.build/Release-iphoneos/B4iProject.build/PrimeLight-project-headers.hmap -I/Users/rvanderpyl/B4iBuildServer/UploadedProjects/<user id>/Payload/include -I/Users/rvanderpyl/B4iBuildServer/UploadedProjects/<user id>/build/B4iProject.build/Release-iphoneos/B4iProject.build/DerivedSources/armv7 -I/Users/rvanderpyl/B4iBuildServer/UploadedProjects/<user id>/build/B4iProject.build/Release-iphoneos/B4iProject.build/DerivedSources -F/Users/rvanderpyl/B4iBuildServer/UploadedProjects/<user id>/Payload -F../../Libs -MMD -MT dependencies -MF /Users/rvanderpyl/B4iBuildServer/UploadedProjects/<user id>/build/B4iProject.build/Release-iphoneos/B4iProject.build/Objects-normal/armv7/LS_1.d --serialize-diagnostics /Users/rvanderpyl/B4iBuildServer/UploadedProjects/<user id>/build/B4iProject.build/Release-iphoneos/B4iProject.build/Objects-normal/armv7/LS_1.dia -c /Users/rvanderpyl/B4iBuildServer/UploadedProjects/<user id>/B4iProject/LS_1.m -o /Users/rvanderpyl/B4iBuildServer/UploadedProjects/<user id>/build/B4iProject.build/Release-iphoneos/B4iProject.build/Objects-normal/armv7/LS_1.o

CompileC build/B4iProject.build/Release-iphoneos/B4iProject.build/Objects-normal/armv7/LS_filing.o B4iProject/LS_filing.m normal armv7 objective-c com.apple.compilers.llvm.clang.1_0.compiler
    cd /Users/rvanderpyl/B4iBuildServer/UploadedProjects/<user id>
    export LANG=en_US.US-ASCII
    export PATH="/Applications/Xcode.app/Contents/Developer/Platforms/iPhoneOS.platform/Developer/usr/bin:/Applications/Xcode.app/Contents/Developer/usr/bin:/usr/local/bin:/usr/bin:/bin:/usr/sbin:/sbin"
    /Applications/Xcode.app/Contents/Developer/Toolchains/XcodeDefault.xctoolchain/usr/bin/clang -x objective-c -arch armv7 -fmessage-length=0 -fdiagnostics-show-note-include-stack -fmacro-backtrace-limit=0 -std=gnu99 -fobjc-arc -fmodules -fmodules-prune-interval=86400 -fmodules-prune-after=345600 -fbuild-session-file=/var/folders/v0/k9s4gk4n0dd8hvzxztc624h40000gn/C/org.llvm.clang/ModuleCache/Session.modulevalidation -fmodules-validate-once-per-build-session -Wnon-modular-include-in-framework-module -Werror=non-modular-include-in-framework-module -Wno-trigraphs -fpascal-strings -O0 -Wno-missing-field-initializers -Wno-missing-prototypes -Werror=return-type -Wno-implicit-atomic-properties -Werror=deprecated-objc-isa-usage -Werror=objc-root-class -Wno-arc-repeated-use-of-weak -Wduplicate-method-match -Wno-missing-braces -Wparentheses -Wswitch -Wunused-function -Wno-unused-label -Wno-unused-parameter -Wunused-variable -Wunused-value -Wempty-body -Wconditional-uninitialized -Wno-unknown-pragmas -Wno-shadow -Wno-four-char-constants -Wno-conversion -Wconstant-conversion -Wint-conversion -Wbool-conversion -Wenum-conversion -Wshorten-64-to-32 -Wpointer-sign -Wno-newline-eof -Wno-selector -Wno-strict-selector-match -Wundeclared-selector -Wno-deprecated-implementations -DNS_BLOCK_ASSERTIONS=1 -isysroot /Applications/Xcode.app/Contents/Developer/Platforms/iPhoneOS.platform/Developer/SDKs/iPhoneOS9.3.sdk -fstrict-aliasing -Wprotocol -Wdeprecated-declarations -miphoneos-version-min=8.0 -fvisibility=hidden -Wno-sign-conversion -iquote /Users/rvanderpyl/B4iBuildServer/UploadedProjects/<user id>/build/B4iProject.build/Release-iphoneos/B4iProject.build/PrimeLight-generated-files.hmap -I/Users/rvanderpyl/B4iBuildServer/UploadedProjects/<user id>/build/B4iProject.build/Release-iphoneos/B4iProject.build/PrimeLight-own-target-headers.hmap -I/Users/rvanderpyl/B4iBuildServer/UploadedProjects/<user id>/build/B4iProject.build/Release-iphoneos/B4iProject.build/PrimeLight-all-target-headers.hmap -iquote /Users/rvanderpyl/B4iBuildServer/UploadedProjects/<user id>/build/B4iProject.build/Release-iphoneos/B4iProject.build/PrimeLight-project-headers.hmap -I/Users/rvanderpyl/B4iBuildServer/UploadedProjects/<user id>/Payload/include -I/Users/rvanderpyl/B4iBuildServer/UploadedProjects/<user id>/build/B4iProject.build/Release-iphoneos/B4iProject.build/DerivedSources/armv7 -I/Users/rvanderpyl/B4iBuildServer/UploadedProjects/<user id>/build/B4iProject.build/Release-iphoneos/B4iProject.build/DerivedSources -F/Users/rvanderpyl/B4iBuildServer/UploadedProjects/<user id>/Payload -F../../Libs -MMD -MT dependencies -MF /Users/rvanderpyl/B4iBuildServer/UploadedProjects/<user id>/build/B4iProject.build/Release-iphoneos/B4iProject.build/Objects-normal/armv7/LS_filing.d --serialize-diagnostics /Users/rvanderpyl/B4iBuildServer/UploadedProjects/<user id>/build/B4iProject.build/Release-iphoneos/B4iProject.build/Objects-normal/armv7/LS_filing.dia -c /Users/rvanderpyl/B4iBuildServer/UploadedProjects/<user id>/B4iProject/LS_filing.m -o /Users/rvanderpyl/B4iBuildServer/UploadedProjects/<user id>/build/B4iProject.build/Release-iphoneos/B4iProject.build/Objects-normal/armv7/LS_filing.o

CompileC build/B4iProject.build/Release-iphoneos/B4iProject.build/Objects-normal/armv7/LS_info.o B4iProject/LS_info.m normal armv7 objective-c com.apple.compilers.llvm.clang.1_0.compiler
    cd /Users/rvanderpyl/B4iBuildServer/UploadedProjects/<user id>
    export LANG=en_US.US-ASCII
    export PATH="/Applications/Xcode.app/Contents/Developer/Platforms/iPhoneOS.platform/Developer/usr/bin:/Applications/Xcode.app/Contents/Developer/usr/bin:/usr/local/bin:/usr/bin:/bin:/usr/sbin:/sbin"
    /Applications/Xcode.app/Contents/Developer/Toolchains/XcodeDefault.xctoolchain/usr/bin/clang -x objective-c -arch armv7 -fmessage-length=0 -fdiagnostics-show-note-include-stack -fmacro-backtrace-limit=0 -std=gnu99 -fobjc-arc -fmodules -fmodules-prune-interval=86400 -fmodules-prune-after=345600 -fbuild-session-file=/var/folders/v0/k9s4gk4n0dd8hvzxztc624h40000gn/C/org.llvm.clang/ModuleCache/Session.modulevalidation -fmodules-validate-once-per-build-session -Wnon-modular-include-in-framework-module -Werror=non-modular-include-in-framework-module -Wno-trigraphs -fpascal-strings -O0 -Wno-missing-field-initializers -Wno-missing-prototypes -Werror=return-type -Wno-implicit-atomic-properties -Werror=deprecated-objc-isa-usage -Werror=objc-root-class -Wno-arc-repeated-use-of-weak -Wduplicate-method-match -Wno-missing-braces -Wparentheses -Wswitch -Wunused-function -Wno-unused-label -Wno-unused-parameter -Wunused-variable -Wunused-value -Wempty-body -Wconditional-uninitialized -Wno-unknown-pragmas -Wno-shadow -Wno-four-char-constants -Wno-conversion -Wconstant-conversion -Wint-conversion -Wbool-conversion -Wenum-conversion -Wshorten-64-to-32 -Wpointer-sign -Wno-newline-eof -Wno-selector -Wno-strict-selector-match -Wundeclared-selector -Wno-deprecated-implementations -DNS_BLOCK_ASSERTIONS=1 -isysroot /Applications/Xcode.app/Contents/Developer/Platforms/iPhoneOS.platform/Developer/SDKs/iPhoneOS9.3.sdk -fstrict-aliasing -Wprotocol -Wdeprecated-declarations -miphoneos-version-min=8.0 -fvisibility=hidden -Wno-sign-conversion -iquote /Users/rvanderpyl/B4iBuildServer/UploadedProjects/<user id>/build/B4iProject.build/Release-iphoneos/B4iProject.build/PrimeLight-generated-files.hmap -I/Users/rvanderpyl/B4iBuildServer/UploadedProjects/<user id>/build/B4iProject.build/Release-iphoneos/B4iProject.build/PrimeLight-own-target-headers.hmap -I/Users/rvanderpyl/B4iBuildServer/UploadedProjects/<user id>/build/B4iProject.build/Release-iphoneos/B4iProject.build/PrimeLight-all-target-headers.hmap -iquote /Users/rvanderpyl/B4iBuildServer/UploadedProjects/<user id>/build/B4iProject.build/Release-iphoneos/B4iProject.build/PrimeLight-project-headers.hmap -I/Users/rvanderpyl/B4iBuildServer/UploadedProjects/<user id>/Payload/include -I/Users/rvanderpyl/B4iBuildServer/UploadedProjects/<user id>/build/B4iProject.build/Release-iphoneos/B4iProject.build/DerivedSources/armv7 -I/Users/rvanderpyl/B4iBuildServer/UploadedProjects/<user id>/build/B4iProject.build/Release-iphoneos/B4iProject.build/DerivedSources -F/Users/rvanderpyl/B4iBuildServer/UploadedProjects/<user id>/Payload -F../../Libs -MMD -MT dependencies -MF /Users/rvanderpyl/B4iBuildServer/UploadedProjects/<user id>/build/B4iProject.build/Release-iphoneos/B4iProject.build/Objects-normal/armv7/LS_info.d --serialize-diagnostics /Users/rvanderpyl/B4iBuildServer/UploadedProjects/<user id>/build/B4iProject.build/Release-iphoneos/B4iProject.build/Objects-normal/armv7/LS_info.dia -c /Users/rvanderpyl/B4iBuildServer/UploadedProjects/<user id>/B4iProject/LS_info.m -o /Users/rvanderpyl/B4iBuildServer/UploadedProjects/<user id>/build/B4iProject.build/Release-iphoneos/B4iProject.build/Objects-normal/armv7/LS_info.o
/Users/rvanderpyl/B4iBuildServer/UploadedProjects/<user id>/B4iProject/LS_info.m:99:40: error: called object type 'double' is not a function or function pointer
[views get:@"sgbeam"].Width = (int)(8.0(0 / 100.0 * width) - ((20 / 100.0 * width)));
                                    ~~~^
1 error generated.

......


Error: ** BUILD FAILED **


The following build commands failed:
    CompileC build/B4iProject.build/Release-iphoneos/B4iProject.build/Objects-normal/armv7/LS_info.o B4iProject/LS_info.m normal armv7 objective-c com.apple.compilers.llvm.clang.1_0.compiler
(1 failure)
 

Erel

Administrator
Staff member
Licensed User
This is the relevant error:

LS_info.m:99:40: error: called object type 'double' is not a function or function pointer
[views get "sgbeam"].Width = (int)(8.0(0 / 100.0 * width) - ((20 / 100.0 * width)));

It happens in the designer script code in the info layout file. Check it and you will find this line:

B4X:
sgBeam.SetLeftAndRight(20%x,8   0%x)
Fix the extra space and it will work.
 

RVP

Active Member
Licensed User
So now it compiles fine, installs fine, but when I try to launch the app, it flashes up a black screen, then immediately closes. Doesn't even connect to the debugger as I am not getting any log messages.
 
Top