JavaScript is disabled. For a better experience, please enable JavaScript in your browser before proceeding.
You are using an out of date browser. It may not display this or other websites correctly.
You should upgrade or use an
alternative browser .
iOS Question Cannot Compile to Simulator or Connected iPhone to Mac
B4i Version: 4.30
Parsing code. (0.15s)
Compiling code. (0.22s)
Compiling layouts code. (0.04s)
Compiling debugger engine code. (2.03s)
Building Xcode project (0.02s)
Sending data to remote compiler. Error
Out: Build settings from command line:
ARCHS = i386
CODE_SIGNING_REQUIRED = NO
CONFIGURATION_BUILD_DIR = /Users/<user id>/Desktop/B4iBuildServer/UploadedProjects/<user id>/Payload
PRODUCT_NAME = Unify Mobile
SDKROOT = iphonesimulator10.3
=== BUILD TARGET B4iProject OF PROJECT B4iProject WITH CONFIGURATION Release ===
Check dependencies
No architectures to compile for (ARCHS=i386, VALID_ARCHS=armv7 armv7s arm64 x86_64).
Error: ** BUILD FAILED **
The following build commands failed:
Check dependencies
(1 failure)
B4X founder
Staff member
Licensed User
Longtime User
Looks like you haven't updated the Mac builder with v4.30.
I have been on the latest version while receiving the error.
B4X founder
Staff member
Licensed User
Longtime User
You also need to update the Mac builder that runs on the local Mac.
How do I update the local mac builder?
B4X founder
Staff member
Licensed User
Longtime User
There was a link to the updated builder in the upgrade mail. You just need to copy the updated files to the builder folder and restart the builder server.
After updating the build server to 4.3 I now get the following error:
B4i Version: 4.30
Parsing code. (0.13s)
Compiling code. (0.34s)
Compiling layouts code. (0.04s)
Compiling debugger engine code. (2.25s)
Building Xcode project (0.06s)
Sending data to remote compiler. Error
Out: Build settings from command line:
ARCHS = x86_64
CODE_SIGNING_REQUIRED = NO
CONFIGURATION_BUILD_DIR = /Users/development/Desktop/B4iBuildServer/UploadedProjects/<user id>/Payload
PRODUCT_NAME = Unify Mobile
SDKROOT = iphonesimulator10.3
=== BUILD TARGET B4iProject OF PROJECT B4iProject WITH CONFIGURATION Release ===
Check dependencies
Write auxiliary files
write-file /Users/development/Desktop/B4iBuildServer/UploadedProjects/<user id>/build/B4iProject.build/Release-iphonesimulator/B4iProject.build/Unify\ Mobile-project-headers.hmap
write-file /Users/development/Desktop/B4iBuildServer/UploadedProjects/<user id>/build/B4iProject.build/Release-iphonesimulator/B4iProject.build/Unify\ Mobile-all-non-framework-target-headers.hmap
write-file /Users/development/Desktop/B4iBuildServer/UploadedProjects/<user id>/build/B4iProject.build/Release-iphonesimulator/B4iProject.build/Unify\ Mobile-generated-files.hmap
/bin/mkdir -p /Users/development/Desktop/B4iBuildServer/UploadedProjects/<user id>/build/B4iProject.build/Release-iphonesimulator/B4iProject.build/Objects-normal/x86_64
write-file /Users/development/Desktop/B4iBuildServer/UploadedProjects/<user id>/build/B4iProject.build/Release-iphonesimulator/B4iProject.build/Objects-normal/x86_64/Unify\ Mobile.LinkFileList
write-file /Users/development/Desktop/B4iBuildServer/UploadedProjects/<user id>/build/B4iProject.build/Release-iphonesimulator/B4iProject.build/Unify\ Mobile-all-target-headers.hmap
write-file /Users/development/Desktop/B4iBuildServer/UploadedProjects/<user id>/build/B4iProject.build/Release-iphonesimulator/B4iProject.build/Unify\ Mobile-own-target-headers.hmap
write-file /Users/development/Desktop/B4iBuildServer/UploadedProjects/<user id>/build/B4iProject.build/Release-iphonesimulator/B4iProject.build/Unify\ Mobile.hmap
Create product structure
/bin/mkdir -p /Users/development/Desktop/B4iBuildServer/UploadedProjects/<user id>/Payload/Unify\ Mobile.app
ProcessInfoPlistFile Payload/Unify\ Mobile.app/Info.plist B4iProject/B4iProject-Info.plist
cd /Users/development/Desktop/B4iBuildServer/UploadedProjects/<user id>
export PATH="/Applications/Xcode.app/Contents/Developer/Platforms/iPhoneSimulator.platform/Developer/usr/bin:/Applications/Xcode.app/Contents/Developer/usr/bin:/usr/local/bin:/usr/bin:/bin:/usr/sbin:/sbin"
builtin-infoPlistUtility /Users/development/Desktop/B4iBuildServer/UploadedProjects/<user id>/B4iProject/B4iProject-Info.plist -genpkginfo /Users/development/Desktop/B4iBuildServer/UploadedProjects/<user id>/Payload/Unify\ Mobile.app/PkgInfo -expandbuildsettings -format binary -platform iphonesimulator -o /Users/development/Desktop/B4iBuildServer/UploadedProjects/<user id>/Payload/Unify\ Mobile.app/Info.plist
ProcessProductPackaging "" build/B4iProject.build/Release-iphonesimulator/B4iProject.build/Unify\ Mobile.app.xcent
cd /Users/development/Desktop/B4iBuildServer/UploadedProjects/<user id>
export PATH="/Applications/Xcode.app/Contents/Developer/Platforms/iPhoneSimulator.platform/Developer/usr/bin:/Applications/Xcode.app/Contents/Developer/usr/bin:/usr/local/bin:/usr/bin:/bin:/usr/sbin:/sbin"
builtin-productPackagingUtility -entitlements -format xml -o /Users/development/Desktop/B4iBuildServer/UploadedProjects/<user id>/build/B4iProject.build/Release-iphonesimulator/B4iProject.build/Unify\ Mobile.app.xcent
CompileC build/B4iProject.build/Release-iphonesimulator/B4iProject.build/Objects-normal/x86_64/main.o B4iProject/main.m normal x86_64 objective-c com.apple.compilers.llvm.clang.1_0.compiler
cd /Users/development/Desktop/B4iBuildServer/UploadedProjects/<user id>
export LANG=en_US.US-ASCII
export PATH="/Applications/Xcode.app/Contents/Developer/Platforms/iPhoneSimulator.platform/Developer/usr/bin:/Applications/Xcode.app/Contents/Developer/usr/bin:/usr/local/bin:/usr/bin:/bin:/usr/sbin:/sbin"
/Applications/Xcode.app/Contents/Developer/Toolchains/XcodeDefault.xctoolchain/usr/bin/clang -x objective-c -arch x86_64 -fmessage-length=0 -fdiagnostics-show-note-include-stack -fmacro-backtrace-limit=0 -std=gnu99 -fobjc-arc -fmodules -gmodules -fmodules-prune-interval=86400 -fmodules-prune-after=345600 -fbuild-session-file=/var/folders/_h/tkdvr6x50m1bdsp6spsdz32w0000gn/C/org.llvm.clang/ModuleCache/Session.modulevalidation -fmodules-validate-once-per-build-session -Wnon-modular-include-in-framework-module -Werror=non-modular-include-in-framework-module -Wno-trigraphs -fpascal-strings -O0 -Wno-missing-field-initializers -Wno-missing-prototypes -Werror=return-type -Wno-implicit-atomic-properties -Werror=deprecated-objc-isa-usage -Werror=objc-root-class -Wno-arc-repeated-use-of-weak -Wduplicate-method-match -Wno-missing-braces -Wparentheses -Wswitch -Wunused-function -Wno-unused-label -Wno-unused-parameter -Wunused-variable -Wunused-value -Wempty-body -Wuninitialized -Wconditional-uninitialized -Wno-unknown-pragmas -Wno-shadow -Wno-four-char-constants -Wno-conversion -Wconstant-conversion -Wint-conversion -Wbool-conversion -Wenum-conversion -Wshorten-64-to-32 -Wpointer-sign -Wno-newline-eof -Wno-selector -Wno-strict-selector-match -Wundeclared-selector -Wno-deprecated-implementations -DNS_BLOCK_ASSERTIONS=1 -isysroot /Applications/Xcode.app/Contents/Developer/Platforms/iPhoneSimulator.platform/Developer/SDKs/iPhoneSimulator10.3.sdk -fasm-blocks -fstrict-aliasing -Wprotocol -Wdeprecated-declarations -mios-simulator-version-min=10.0 -fvisibility=hidden -Wno-sign-conversion -Wno-infinite-recursion -fobjc-abi-version=2 -fobjc-legacy-dispatch -iquote /Users/development/Desktop/B4iBuildServer/UploadedProjects/<user id>/build/B4iProject.build/Release-iphonesimulator/B4iProject.build/Unify\ Mobile-generated-files.hmap -I/Users/development/Desktop/B4iBuildServer/UploadedProjects/<user id>/build/B4iProject.build/Release-iphonesimulator/B4iProject.build/Unify\ Mobile-own-target-headers.hmap -I/Users/development/Desktop/B4iBuildServer/UploadedProjects/<user id>/build/B4iProject.build/Release-iphonesimulator/B4iProject.build/Unify\ Mobile-all-target-headers.hmap -iquote /Users/development/Desktop/B4iBuildServer/UploadedProjects/<user id>/build/B4iProject.build/Release-iphonesimulator/B4iProject.build/Unify\ Mobile-project-headers.hmap -I/Users/development/Desktop/B4iBuildServer/UploadedProjects/<user id>/Payload/include -I/Users/development/Desktop/B4iBuildServer/UploadedProjects/<user id>/build/B4iProject.build/Release-iphonesimulator/B4iProject.build/DerivedSources/x86_64 -I/Users/development/Desktop/B4iBuildServer/UploadedProjects/<user id>/build/B4iProject.build/Release-iphonesimulator/B4iProject.build/DerivedSources -F/Users/development/Desktop/B4iBuildServer/UploadedProjects/<user id>/Payload -F../../Libs -MMD -MT dependencies -MF /Users/development/Desktop/B4iBuildServer/UploadedProjects/<user id>/build/B4iProject.build/Release-iphonesimulator/B4iProject.build/Objects-normal/x86_64/main.d --serialize-diagnostics /Users/development/Desktop/B4iBuildServer/UploadedProjects/<user id>/build/B4iProject.build/Release-iphonesimulator/B4iProject.build/Objects-normal/x86_64/main.dia -c /Users/development/Desktop/B4iBuildServer/UploadedProjects/<user id>/B4iProject/main.m -o /Users/development/Desktop/B4iBuildServer/UploadedProjects/<user id>/build/B4iProject.build/Release-iphonesimulator/B4iProject.build/Objects-normal/x86_64/main.o
CompileC build/B4iProject.build/Release-iphonesimulator/B4iProject.build/Objects-normal/x86_64/b4i_helper.o B4iProject/b4i_helper.m normal x86_64 objective-c com.apple.compilers.llvm.clang.1_0.compiler
cd /Users/development/Desktop/B4iBuildServer/UploadedProjects/<user id>
export LANG=en_US.US-ASCII
export PATH="/Applications/Xcode.app/Contents/Developer/Platforms/iPhoneSimulator.platform/Developer/usr/bin:/Applications/Xcode.app/Contents/Developer/usr/bin:/usr/local/bin:/usr/bin:/bin:/usr/sbin:/sbin"
/Applications/Xcode.app/Contents/Developer/Toolchains/XcodeDefault.xctoolchain/usr/bin/clang -x objective-c -arch x86_64 -fmessage-length=0 -fdiagnostics-show-note-include-stack -fmacro-backtrace-limit=0 -std=gnu99 -fobjc-arc -fmodules -gmodules -fmodules-prune-interval=86400 -fmodules-prune-after=345600 -fbuild-session-file=/var/folders/_h/tkdvr6x50m1bdsp6spsdz32w0000gn/C/org.llvm.clang/ModuleCache/Session.modulevalidation -fmodules-validate-once-per-build-session -Wnon-modular-include-in-framework-module -Werror=non-modular-include-in-framework-module -Wno-trigraphs -fpascal-strings -O0 -Wno-missing-field-initializers -Wno-missing-prototypes -Werror=return-type -Wno-implicit-atomic-properties -Werror=deprecated-objc-isa-usage -Werror=objc-root-class -Wno-arc-repeated-use-of-weak -Wduplicate-method-match -Wno-missing-braces -Wparentheses -Wswitch -Wunused-function -Wno-unused-label -Wno-unused-parameter -Wunused-variable -Wunused-value -Wempty-body -Wuninitialized -Wconditional-uninitialized -Wno-unknown-pragmas -Wno-shadow -Wno-four-char-constants -Wno-conversion -Wconstant-conversion -Wint-conversion -Wbool-conversion -Wenum-conversion -Wshorten-64-to-32 -Wpointer-sign -Wno-newline-eof -Wno-selector -Wno-strict-selector-match -Wundeclared-selector -Wno-deprecated-implementations -DNS_BLOCK_ASSERTIONS=1 -isysroot /Applications/Xcode.app/Contents/Developer/Platforms/iPhoneSimulator.platform/Developer/SDKs/iPhoneSimulator10.3.sdk -fasm-blocks -fstrict-aliasing -Wprotocol -Wdeprecated-declarations -mios-simulator-version-min=10.0 -fvisibility=hidden -Wno-sign-conversion -Wno-infinite-recursion -fobjc-abi-version=2 -fobjc-legacy-dispatch -iquote /Users/development/Desktop/B4iBuildServer/UploadedProjects/<user id>/build/B4iProject.build/Release-iphonesimulator/B4iProject.build/Unify\ Mobile-generated-files.hmap -I/Users/development/Desktop/B4iBuildServer/UploadedProjects/<user id>/build/B4iProject.build/Release-iphonesimulator/B4iProject.build/Unify\ Mobile-own-target-headers.hmap -I/Users/development/Desktop/B4iBuildServer/UploadedProjects/<user id>/build/B4iProject.build/Release-iphonesimulator/B4iProject.build/Unify\ Mobile-all-target-headers.hmap -iquote /Users/development/Desktop/B4iBuildServer/UploadedProjects/<user id>/build/B4iProject.build/Release-iphonesimulator/B4iProject.build/Unify\ Mobile-project-headers.hmap -I/Users/development/Desktop/B4iBuildServer/UploadedProjects/<user id>/Payload/include -I/Users/development/Desktop/B4iBuildServer/UploadedProjects/<user id>/build/B4iProject.build/Release-iphonesimulator/B4iProject.build/DerivedSources/x86_64 -I/Users/development/Desktop/B4iBuildServer/UploadedProjects/<user id>/build/B4iProject.build/Release-iphonesimulator/B4iProject.build/DerivedSources -F/Users/development/Desktop/B4iBuildServer/UploadedProjects/<user id>/Payload -F../../Libs -MMD -MT dependencies -MF /Users/development/Desktop/B4iBuildServer/UploadedProjects/<user id>/build/B4iProject.build/Release-iphonesimulator/B4iProject.build/Objects-normal/x86_64/b4i_helper.d --serialize-diagnostics /Users/development/Desktop/B4iBuildServer/UploadedProjects/<user id>/build/B4iProject.build/Release-iphonesimulator/B4iProject.build/Objects-normal/x86_64/b4i_helper.dia -c /Users/development/Desktop/B4iBuildServer/UploadedProjects/<user id>/B4iProject/b4i_helper.m -o /Users/development/Desktop/B4iBuildServer/UploadedProjects/<user id>/build/B4iProject.build/Release-iphonesimulator/B4iProject.build/Objects-normal/x86_64/b4i_helper.o
In file included from /Users/development/Desktop/B4iBuildServer/UploadedProjects/<user id>/B4iProject/b4i_helper.m:2:
/Users/development/Desktop/B4iBuildServer/UploadedProjects/<user id>/B4iProject/b4i_helper.h:10:9: fatal error: 'iAlertView.h' file not found
#import "iAlertView.h"
^
CompileC build/B4iProject.build/Release-iphonesimulator/B4iProject.build/Objects-normal/x86_64/b4i_contactsutils.o B4iProject/b4i_contactsutils.m normal x86_64 objective-c com.apple.compilers.llvm.clang.1_0.compiler
cd /Users/development/Desktop/B4iBuildServer/UploadedProjects/<user id>
export LANG=en_US.US-ASCII
export PATH="/Applications/Xcode.app/Contents/Developer/Platforms/iPhoneSimulator.platform/Developer/usr/bin:/Applications/Xcode.app/Contents/Developer/usr/bin:/usr/local/bin:/usr/bin:/bin:/usr/sbin:/sbin"
/Applications/Xcode.app/Contents/Developer/Toolchains/XcodeDefault.xctoolchain/usr/bin/clang -x objective-c -arch x86_64 -fmessage-length=0 -fdiagnostics-show-note-include-stack -fmacro-backtrace-limit=0 -std=gnu99 -fobjc-arc -fmodules -gmodules -fmodules-prune-interval=86400 -fmodules-prune-after=345600 -fbuild-session-file=/var/folders/_h/tkdvr6x50m1bdsp6spsdz32w0000gn/C/org.llvm.clang/ModuleCache/Session.modulevalidation -fmodules-validate-once-per-build-session -Wnon-modular-include-in-framework-module -Werror=non-modular-include-in-framework-module -Wno-trigraphs -fpascal-strings -O0 -Wno-missing-field-initializers -Wno-missing-prototypes -Werror=return-type -Wno-implicit-atomic-properties -Werror=deprecated-objc-isa-usage -Werror=objc-root-class -Wno-arc-repeated-use-of-weak -Wduplicate-method-match -Wno-missing-braces -Wparentheses -Wswitch -Wunused-function -Wno-unused-label -Wno-unused-parameter -Wunused-variable -Wunused-value -Wempty-body -Wuninitialized -Wconditional-uninitialized -Wno-unknown-pragmas -Wno-shadow -Wno-four-char-constants -Wno-conversion -Wconstant-conversion -Wint-conversion -Wbool-conversion -Wenum-conversion -Wshorten-64-to-32 -Wpointer-sign -Wno-newline-eof -Wno-selector -Wno-strict-selector-match -Wundeclared-selector -Wno-deprecated-implementations -DNS_BLOCK_ASSERTIONS=1 -isysroot /Applications/Xcode.app/Contents/Developer/Platforms/iPhoneSimulator.platform/Developer/SDKs/iPhoneSimulator10.3.sdk -fasm-blocks -fstrict-aliasing -Wprotocol -Wdeprecated-declarations -mios-simulator-version-min=10.0 -fvisibility=hidden -Wno-sign-conversion -Wno-infinite-recursion -fobjc-abi-version=2 -fobjc-legacy-dispatch -iquote /Users/development/Desktop/B4iBuildServer/UploadedProjects/<user id>/build/B4iProject.build/Release-iphonesimulator/B4iProject.build/Unify\ Mobile-generated-files.hmap -I/Users/development/Desktop/B4iBuildServer/UploadedProjects/<user id>/build/B4iProject.build/Release-iphonesimulator/B4iProject.build/Unify\ Mobile-own-target-headers.hmap -I/Users/development/Desktop/B4iBuildServer/UploadedProjects/<user id>/build/B4iProject.build/Release-iphonesimulator/B4iProject.build/Unify\ Mobile-all-target-headers.hmap -iquote /Users/development/Desktop/B4iBuildServer/UploadedProjects/<user id>/build/B4iProject.build/Release-iphonesimulator/B4iProject.build/Unify\ Mobile-project-headers.hmap -I/Users/development/Desktop/B4iBuildServer/UploadedProjects/<user id>/Payload/include -I/Users/development/Desktop/B4iBuildServer/UploadedProjects/<user id>/build/B4iProject.build/Release-iphonesimulator/B4iProject.build/DerivedSources/x86_64 -I/Users/development/Desktop/B4iBuildServer/UploadedProjects/<user id>/build/B4iProject.build/Release-iphonesimulator/B4iProject.build/DerivedSources -F/Users/development/Desktop/B4iBuildServer/UploadedProjects/<user id>/Payload -F../../Libs -MMD -MT dependencies -MF /Users/development/Desktop/B4iBuildServer/UploadedProjects/<user id>/build/B4iProject.build/Release-iphonesimulator/B4iProject.build/Objects-normal/x86_64/b4i_contactsutils.d --serialize-diagnostics /Users/development/Desktop/B4iBuildServer/UploadedProjects/<user id>/build/B4iProject.build/Release-iphonesimulator/B4iProject.build/Objects-normal/x86_64/b4i_contactsutils.dia -c /Users/development/Desktop/B4iBuildServer/UploadedProjects/<user id>/B4iProject/b4i_contactsutils.m -o /Users/development/Desktop/B4iBuildServer/UploadedProjects/<user id>/build/B4iProject.build/Release-iphonesimulator/B4iProject.build/Objects-normal/x86_64/b4i_contactsutils.o
In file included from /Users/development/Desktop/B4iBuildServer/UploadedProjects/<user id>/B4iProject/b4i_contactsutils.m:2:
/Users/development/Desktop/B4iBuildServer/UploadedProjects/<user id>/B4iProject/b4i_contactsutils.h:10:9: fatal error: 'iAlertView.h' file not found
#import "iAlertView.h"
^
1 error generated.
CompileC build/B4iProject.build/Release-iphonesimulator/B4iProject.build/Objects-normal/x86_64/b4i_datalayer.o B4iProject/b4i_datalayer.m normal x86_64 objective-c com.apple.compilers.llvm.clang.1_0.compiler
cd /Users/development/Desktop/B4iBuildServer/UploadedProjects/<user id>
export LANG=en_US.US-ASCII
export PATH="/Applications/Xcode.app/Contents/Developer/Platforms/iPhoneSimulator.platform/Developer/usr/bin:/Applications/Xcode.app/Contents/Developer/usr/bin:/usr/local/bin:/usr/bin:/bin:/usr/sbin:/sbin"
/Applications/Xcode.app/Contents/Developer/Toolchains/XcodeDefault.xctoolchain/usr/bin/clang -x objective-c -arch x86_64 -fmessage-length=0 -fdiagnostics-show-note-include-stack -fmacro-backtrace-limit=0 -std=gnu99 -fobjc-arc -fmodules -gmodules -fmodules-prune-interval=86400 -fmodules-prune-after=345600 -fbuild-session-file=/var/folders/_h/tkdvr6x50m1bdsp6spsdz32w0000gn/C/org.llvm.clang/ModuleCache/Session.modulevalidation -fmodules-validate-once-per-build-session -Wnon-modular-include-in-framework-module -Werror=non-modular-include-in-framework-module -Wno-trigraphs -fpascal-strings -O0 -Wno-missing-field-initializers -Wno-missing-prototypes -Werror=return-type -Wno-implicit-atomic-properties -Werror=deprecated-objc-isa-usage -Werror=objc-root-class -Wno-arc-repeated-use-of-weak -Wduplicate-method-match -Wno-missing-braces -Wparentheses -Wswitch -Wunused-function -Wno-unused-label -Wno-unused-parameter -Wunused-variable -Wunused-value -Wempty-body -Wuninitialized -Wconditional-uninitialized -Wno-unknown-pragmas -Wno-shadow -Wno-four-char-constants -Wno-conversion -Wconstant-conversion -Wint-conversion -Wbool-conversion -Wenum-conversion -Wshorten-64-to-32 -Wpointer-sign -Wno-newline-eof -Wno-selector -Wno-strict-selector-match -Wundeclared-selector -Wno-deprecated-implementations -DNS_BLOCK_ASSERTIONS=1 -isysroot /Applications/Xcode.app/Contents/Developer/Platforms/iPhoneSimulator.platform/Developer/SDKs/iPhoneSimulator10.3.sdk -fasm-blocks -fstrict-aliasing -Wprotocol -Wdeprecated-declarations -mios-simulator-version-min=10.0 -fvisibility=hidden -Wno-sign-conversion -Wno-infinite-recursion -fobjc-abi-version=2 -fobjc-legacy-dispatch -iquote /Users/development/Desktop/B4iBuildServer/UploadedProjects/<user id>/build/B4iProject.build/Release-iphonesimulator/B4iProject.build/Unify\ Mobile-generated-files.hmap -I/Users/development/Desktop/B4iBuildServer/UploadedProjects/<user id>/build/B4iProject.build/Release-iphonesimulator/B4iProject.build/Unify\ Mobile-own-target-headers.hmap -I/Users/development/Desktop/B4iBuildServer/UploadedProjects/<user id>/build/B4iProject.build/Release-iphonesimulator/B4iProject.build/Unify\ Mobile-all-target-headers.hmap -iquote /Users/development/Desktop/B4iBuildServer/UploadedProjects/<user id>/build/B4iProject.build/Release-iphonesimulator/B4iProject.build/Unify\ Mobile-project-headers.hmap -I/Users/development/Desktop/B4iBuildServer/UploadedProjects/<user id>/Payload/include -I/Users/development/Desktop/B4iBuildServer/UploadedProjects/<user id>/build/B4iProject.build/Release-iphonesimulator/B4iProject.build/DerivedSources/x86_64 -I/Users/development/Desktop/B4iBuildServer/UploadedProjects/<user id>/build/B4iProject.build/Release-iphonesimulator/B4iProject.build/DerivedSources -F/Users/development/Desktop/B4iBuildServer/UploadedProjects/<user id>/Payload -F../../Libs -MMD -MT dependencies -MF /Users/development/Desktop/B4iBuildServer/UploadedProjects/<user id>/build/B4iProject.build/Release-iphonesimulator/B4iProject.build/Objects-normal/x86_64/b4i_datalayer.d --serialize-diagnostics /Users/development/Desktop/B4iBuildServer/UploadedProjects/<user id>/build/B4iProject.build/Release-iphonesimulator/B4iProject.build/Objects-normal/x86_64/b4i_datalayer.dia -c /Users/development/Desktop/B4iBuildServer/UploadedProjects/<user id>/B4iProject/b4i_datalayer.m -o /Users/development/Desktop/B4iBuildServer/UploadedProjects/<user id>/build/B4iProject.build/Release-iphonesimulator/B4iProject.build/Objects-normal/x86_64/b4i_datalayer.o
In file included from /Users/development/Desktop/B4iBuildServer/UploadedProjects/<user id>/B4iProject/b4i_datalayer.m:2:
/Users/development/Desktop/B4iBuildServer/UploadedProjects/<user id>/B4iProject/b4i_datalayer.h:10:9: fatal error: 'iAlertView.h' file not found
#import "iAlertView.h"
^
CompileC build/B4iProject.build/Release-iphonesimulator/B4iProject.build/Objects-normal/x86_64/b4i_home.o B4iProject/b4i_home.m normal x86_64 objective-c com.apple.compilers.llvm.clang.1_0.compiler
cd /Users/development/Desktop/B4iBuildServer/UploadedProjects/<user id>
export LANG=en_US.US-ASCII
export PATH="/Applications/Xcode.app/Contents/Developer/Platforms/iPhoneSimulator.platform/Developer/usr/bin:/Applications/Xcode.app/Contents/Developer/usr/bin:/usr/local/bin:/usr/bin:/bin:/usr/sbin:/sbin"
/Applications/Xcode.app/Contents/Developer/Toolchains/XcodeDefault.xctoolchain/usr/bin/clang -x objective-c -arch x86_64 -fmessage-length=0 -fdiagnostics-show-note-include-stack -fmacro-backtrace-limit=0 -std=gnu99 -fobjc-arc -fmodules -gmodules -fmodules-prune-interval=86400 -fmodules-prune-after=345600 -fbuild-session-file=/var/folders/_h/tkdvr6x50m1bdsp6spsdz32w0000gn/C/org.llvm.clang/ModuleCache/Session.modulevalidation -fmodules-validate-once-per-build-session -Wnon-modular-include-in-framework-module -Werror=non-modular-include-in-framework-module -Wno-trigraphs -fpascal-strings -O0 -Wno-missing-field-initializers -Wno-missing-prototypes -Werror=return-type -Wno-implicit-atomic-properties -Werror=deprecated-objc-isa-usage -Werror=objc-root-class -Wno-arc-repeated-use-of-weak -Wduplicate-method-match -Wno-missing-braces -Wparentheses -Wswitch -Wunused-function -Wno-unused-label -Wno-unused-parameter -Wunused-variable -Wunused-value -Wempty-body -Wuninitialized -Wconditional-uninitialized -Wno-unknown-pragmas -Wno-shadow -Wno-four-char-constants -Wno-conversion -Wconstant-conversion -Wint-conversion -Wbool-conversion -Wenum-conversion -Wshorten-64-to-32 -Wpointer-sign -Wno-newline-eof -Wno-selector -Wno-strict-selector-match -Wundeclared-selector -Wno-deprecated-implementations -DNS_BLOCK_ASSERTIONS=1 -isysroot /Applications/Xcode.app/Contents/Developer/Platforms/iPhoneSimulator.platform/Developer/SDKs/iPhoneSimulator10.3.sdk -fasm-blocks -fstrict-aliasing -Wprotocol -Wdeprecated-declarations -mios-simulator-version-min=10.0 -fvisibility=hidden -Wno-sign-conversion -Wno-infinite-recursion -fobjc-abi-version=2 -fobjc-legacy-dispatch -iquote /Users/development/Desktop/B4iBuildServer/UploadedProjects/<user id>/build/B4iProject.build/Release-iphonesimulator/B4iProject.build/Unify\ Mobile-generated-files.hmap -I/Users/development/Desktop/B4iBuildServer/UploadedProjects/<user id>/build/B4iProject.build/Release-iphonesimulator/B4iProject.build/Unify\ Mobile-own-target-headers.hmap -I/Users/development/Desktop/B4iBuildServer/UploadedProjects/<user id>/build/B4iProject.build/Release-iphonesimulator/B4iProject.build/Unify\ Mobile-all-target-headers.hmap -iquote /Users/development/Desktop/B4iBuildServer/UploadedProjects/<user id>/build/B4iProject.build/Release-iphonesimulator/B4iProject.build/Unify\ Mobile-project-headers.hmap -I/Users/development/Desktop/B4iBuildServer/UploadedProjects/<user id>/Payload/include -I/Users/development/Desktop/B4iBuildServer/UploadedProjects/<user id>/build/B4iProject.build/Release-iphonesimulator/B4iProject.build/DerivedSources/x86_64 -I/Users/development/Desktop/B4iBuildServer/UploadedProjects/<user id>/build/B4iProject.build/Release-iphonesimulator/B4iProject.build/DerivedSources -F/Users/development/Desktop/B4iBuildServer/UploadedProjects/<user id>/Payload -F../../Libs -MMD -MT dependencies -MF /Users/development/Desktop/B4iBuildServer/UploadedProjects/<user id>/build/B4iProject.build/Release-iphonesimulator/B4iProject.build/Objects-normal/x86_64/b4i_home.d --serialize-diagnostics /Users/development/Desktop/B4iBuildServer/UploadedProjects/<user id>/build/B4iProject.build/Release-iphonesimulator/B4iProject.build/Objects-normal/x86_64/b4i_home.dia -c /Users/development/Desktop/B4iBuildServer/UploadedProjects/<user id>/B4iProject/b4i_home.m -o /Users/development/Desktop/B4iBuildServer/UploadedProjects/<user id>/build/B4iProject.build/Release-iphonesimulator/B4iProject.build/Objects-normal/x86_64/b4i_home.o
In file included from /Users/development/Desktop/B4iBuildServer/UploadedProjects/<user id>/B4iProject/b4i_home.m:2:
/Users/development/Desktop/B4iBuildServer/UploadedProjects/<user id>/B4iProject/b4i_home.h:10:9: fatal error: 'iAlertView.h' file not found
#import "iAlertView.h"
^
Error: ** BUILD FAILED **
The following build commands failed:
CompileC build/B4iProject.build/Release-iphonesimulator/B4iProject.build/Objects-normal/x86_64/b4i_contactsutils.o B4iProject/b4i_contactsutils.m normal x86_64 objective-c com.apple.compilers.llvm.clang.1_0.compiler
(1 failure)
Well-Known Member
Licensed User
Longtime User
Hi,
you have to put the iAlertView library files into the Lib folder of your build server.
Jan
After Putting the iAlertView in the Library I am getting the following Error. (Attached the TXT Doc)
Well-Known Member
Licensed User
Longtime User
Hi,
probably you are using iTableView(2), which doesn't contain the x86_64 architecture.
Use iUI8 instead, it includes the TableView object too. iTableView only still exists to support iOS 7.
Jan