iOS Question Compiling Error

Chris Guanzon

Active Member
Licensed User
I cannot compile my app in debug mode after successfully compiled it as release app. Here's the error:

B4X:
B4i Version: 7.20
Parsing code.    (0.31s)
Building folders structure.    (0.10s)
Compiling code.    (0.60s)
Compiling layouts code.    (0.07s)
Compiling debugger engine code.    (0.04s)
Building Xcode project.    (0.10s)
Preparing project for builder.    (0.27s)
    Project size: 1.07 MB
Sending data to remote compiler.    Error
Out: Command line invocation:
    /Applications/Xcode.app/Contents/Developer/usr/bin/xcodebuild -configuration Release "PRODUCT_NAME=All Access Mobile" CONFIGURATION_BUILD_DIR=/Users/arthurgalenzoga/UploadedProjects/<user id>/Payload "CODE_SIGN_IDENTITY=iPhone Distribution: All Access Gateway Inc (S22872KDWH)" "OTHER_CODE_SIGN_FLAGS=--keychain <user id>" PROVISIONING_PROFILE=ac145dcb-aa02-43b7-850f-927eedff1deb -arch arm64

Build settings from command line:
    ARCHS = arm64
    CODE_SIGN_IDENTITY = iPhone Distribution: All Access Gateway Inc (S22872KDWH)
    CONFIGURATION_BUILD_DIR = /Users/arthurgalenzoga/UploadedProjects/<user id>/Payload
    OTHER_CODE_SIGN_FLAGS = --keychain <user id>
    PRODUCT_NAME = All Access Mobile
    PROVISIONING_PROFILE = ac145dcb-aa02-43b7-850f-927eedff1deb

note: Using new build system
note: Planning build
note: Constructing build description
CreateBuildDirectory /Users/arthurgalenzoga/UploadedProjects/<user id>/build (in target 'B4iProject' from project 'B4iProject')
    cd /Users/arthurgalenzoga/UploadedProjects/<user id>
    builtin-create-build-directory /Users/arthurgalenzoga/UploadedProjects/<user id>/build

MkDir /Users/arthurgalenzoga/UploadedProjects/<user id>/Payload/All\ Access\ Mobile.app (in target 'B4iProject' from project 'B4iProject')
    cd /Users/arthurgalenzoga/UploadedProjects/<user id>
    /bin/mkdir -p /Users/arthurgalenzoga/UploadedProjects/<user id>/Payload/All\ Access\ Mobile.app

ProcessProductPackaging /Users/arthurgalenzoga/Library/MobileDevice/Provisioning\ Profiles/ac145dcb-aa02-43b7-850f-927eedff1deb.mobileprovision /Users/arthurgalenzoga/UploadedProjects/<user id>/Payload/All\ Access\ Mobile.app/embedded.mobileprovision (in target 'B4iProject' from project 'B4iProject')
    cd /Users/arthurgalenzoga/UploadedProjects/<user id>
    builtin-productPackagingUtility /Users/arthurgalenzoga/Library/MobileDevice/Provisioning\ Profiles/ac145dcb-aa02-43b7-850f-927eedff1deb.mobileprovision -o /Users/arthurgalenzoga/UploadedProjects/<user id>/Payload/All\ Access\ Mobile.app/embedded.mobileprovision

WriteAuxiliaryFile /Users/arthurgalenzoga/UploadedProjects/<user id>/build/B4iProject.build/Release-iphoneos/B4iProject.build/DerivedSources/Entitlements.plist (in target 'B4iProject' from project 'B4iProject')
    cd /Users/arthurgalenzoga/UploadedProjects/<user id>
    write-file /Users/arthurgalenzoga/UploadedProjects/<user id>/build/B4iProject.build/Release-iphoneos/B4iProject.build/DerivedSources/Entitlements.plist

ProcessProductPackaging "" /Users/arthurgalenzoga/UploadedProjects/<user id>/build/B4iProject.build/Release-iphoneos/B4iProject.build/All\ Access\ Mobile.app.xcent (in target 'B4iProject' from project 'B4iProject')
    cd /Users/arthurgalenzoga/UploadedProjects/<user id>
    

Entitlements:

{
    "application-identifier" = "S22872KDWH.<user id>.aam3.crg";
    "com.apple.developer.team-identifier" = S22872KDWH;
    "get-task-allow" = 0;
}


    builtin-productPackagingUtility -entitlements -format xml -o /Users/arthurgalenzoga/UploadedProjects/<user id>/build/B4iProject.build/Release-iphoneos/B4iProject.build/All\ Access\ Mobile.app.xcent

WriteAuxiliaryFile /Users/arthurgalenzoga/UploadedProjects/<user id>/build/B4iProject.build/Release-iphoneos/B4iProject.build/all-product-headers.yaml (in target 'B4iProject' from project 'B4iProject')
    cd /Users/arthurgalenzoga/UploadedProjects/<user id>
    write-file /Users/arthurgalenzoga/UploadedProjects/<user id>/build/B4iProject.build/Release-iphoneos/B4iProject.build/all-product-headers.yaml

WriteAuxiliaryFile /Users/arthurgalenzoga/UploadedProjects/<user id>/build/B4iProject.build/Release-iphoneos/B4iProject.build/All\ Access\ Mobile-project-headers.hmap (in target 'B4iProject' from project 'B4iProject')
    cd /Users/arthurgalenzoga/UploadedProjects/<user id>
    write-file /Users/arthurgalenzoga/UploadedProjects/<user id>/build/B4iProject.build/Release-iphoneos/B4iProject.build/All\ Access\ Mobile-project-headers.hmap

WriteAuxiliaryFile /Users/arthurgalenzoga/UploadedProjects/<user id>/build/B4iProject.build/Release-iphoneos/B4iProject.build/All\ Access\ Mobile.hmap (in target 'B4iProject' from project 'B4iProject')
    cd /Users/arthurgalenzoga/UploadedProjects/<user id>
    write-file /Users/arthurgalenzoga/UploadedProjects/<user id>/build/B4iProject.build/Release-iphoneos/B4iProject.build/All\ Access\ Mobile.hmap

WriteAuxiliaryFile /Users/arthurgalenzoga/UploadedProjects/<user id>/build/B4iProject.build/Release-iphoneos/B4iProject.build/All\ Access\ Mobile-own-target-headers.hmap (in target 'B4iProject' from project 'B4iProject')
    cd /Users/arthurgalenzoga/UploadedProjects/<user id>
    write-file /Users/arthurgalenzoga/UploadedProjects/<user id>/build/B4iProject.build/Release-iphoneos/B4iProject.build/All\ Access\ Mobile-own-target-headers.hmap

WriteAuxiliaryFile /Users/arthurgalenzoga/UploadedProjects/<user id>/build/B4iProject.build/Release-iphoneos/B4iProject.build/All\ Access\ Mobile-generated-files.hmap (in target 'B4iProject' from project 'B4iProject')
    cd /Users/arthurgalenzoga/UploadedProjects/<user id>
    write-file /Users/arthurgalenzoga/UploadedProjects/<user id>/build/B4iProject.build/Release-iphoneos/B4iProject.build/All\ Access\ Mobile-generated-files.hmap

WriteAuxiliaryFile /Users/arthurgalenzoga/UploadedProjects/<user id>/build/B4iProject.build/Release-iphoneos/B4iProject.build/All\ Access\ Mobile-all-target-headers.hmap (in target 'B4iProject' from project 'B4iProject')
    cd /Users/arthurgalenzoga/UploadedProjects/<user id>
    write-file /Users/arthurgalenzoga/UploadedProjects/<user id>/build/B4iProject.build/Release-iphoneos/B4iProject.build/All\ Access\ Mobile-all-target-headers.hmap

WriteAuxiliaryFile /Users/arthurgalenzoga/UploadedProjects/<user id>/build/B4iProject.build/Release-iphoneos/B4iProject.build/All\ Access\ Mobile-all-non-framework-target-headers.hmap (in target 'B4iProject' from project 'B4iProject')
    cd /Users/arthurgalenzoga/UploadedProjects/<user id>
    write-file /Users/arthurgalenzoga/UploadedProjects/<user id>/build/B4iProject.build/Release-iphoneos/B4iProject.build/All\ Access\ Mobile-all-non-framework-target-headers.hmap

CompileC /Users/arthurgalenzoga/UploadedProjects/<user id>/build/B4iProject.build/Release-iphoneos/B4iProject.build/Objects-normal/arm64/b4i_wallet_transfer.o /Users/arthurgalenzoga/UploadedProjects/<user id>/B4iProject/b4i_wallet_transfer.m normal arm64 objective-c com.apple.compilers.llvm.clang.1_0.compiler (in target 'B4iProject' from project 'B4iProject')
    cd /Users/arthurgalenzoga/UploadedProjects/<user id>
    export LANG=en_US.US-ASCII
    /Applications/Xcode.app/Contents/Developer/Toolchains/XcodeDefault.xctoolchain/usr/bin/clang -x objective-c -target arm64-apple-ios8.0 -fmessage-length=0 -fdiagnostics-show-note-include-stack -fmacro-backtrace-limit=0 -std=gnu99 -fobjc-arc -fmodules -gmodules -fmodules-prune-interval=86400 -fmodules-prune-after=345600 -fbuild-session-file=/var/folders/0t/12ty0rv13053d0qmb4k2c7180000gn/C/org.llvm.clang/ModuleCache.noindex/Session.modulevalidation -fmodules-validate-once-per-build-session -Wnon-modular-include-in-framework-module -Werror=non-modular-include-in-framework-module -Wno-trigraphs -fpascal-strings -O0 -Wno-missing-field-initializers -Wno-missing-prototypes -Werror=return-type -Wno-implicit-atomic-properties -Werror=deprecated-objc-isa-usage -Wno-objc-interface-ivars -Werror=objc-root-class -Wno-arc-repeated-use-of-weak -Wduplicate-method-match -Wno-missing-braces -Wparentheses -Wswitch -Wunused-function -Wno-unused-label -Wno-unused-parameter -Wunused-variable -Wunused-value -Wempty-body -Wuninitialized -Wconditional-uninitialized -Wno-unknown-pragmas -Wno-shadow -Wno-four-char-constants -Wno-conversion -Wconstant-conversion -Wint-conversion -Wbool-conversion -Wenum-conversion -Wno-float-conversion -Wno-non-literal-null-conversion -Wno-objc-literal-conversion -Wshorten-64-to-32 -Wpointer-sign -Wno-newline-eof -Wno-selector -Wno-strict-selector-match -Wundeclared-selector -Wno-deprecated-implementations -DB4I_VERSION=13 -DNS_BLOCK_ASSERTIONS=1 -DOBJC_OLD_DISPATCH_PROTOTYPES=1 -isysroot /Applications/Xcode.app/Contents/Developer/Platforms/iPhoneOS.platform/Developer/SDKs/iPhoneOS13.5.sdk -fstrict-aliasing -Wprotocol -Wdeprecated-declarations -fvisibility=hidden -Wno-sign-conversion -Wno-infinite-recursion -Wno-comma -Wno-block-capture-autoreleasing -Wno-strict-prototypes -Wno-semicolon-before-method-body -iquote /Users/arthurgalenzoga/UploadedProjects/<user id>/build/B4iProject.build/Release-iphoneos/B4iProject.build/All\ Access\ Mobile-generated-files.hmap -I/Users/arthurgalenzoga/UploadedProjects/<user id>/build/B4iProject.build/Release-iphoneos/B4iProject.build/All\ Access\ Mobile-own-target-headers.hmap -I/Users/arthurgalenzoga/UploadedProjects/<user id>/build/B4iProject.build/Release-iphoneos/B4iProject.build/All\ Access\ Mobile-all-target-headers.hmap -iquote /Users/arthurgalenzoga/UploadedProjects/<user id>/build/B4iProject.build/Release-iphoneos/B4iProject.build/All\ Access\ Mobile-project-headers.hmap -I/Users/arthurgalenzoga/UploadedProjects/<user id>/Payload/include -I/Users/arthurgalenzoga/UploadedProjects/<user id>/build/B4iProject.build/Release-iphoneos/B4iProject.build/DerivedSources-normal/arm64 -I/Users/arthurgalenzoga/UploadedProjects/<user id>/build/B4iProject.build/Release-iphoneos/B4iProject.build/DerivedSources/arm64 -I/Users/arthurgalenzoga/UploadedProjects/<user id>/build/B4iProject.build/Release-iphoneos/B4iProject.build/DerivedSources -F/Users/arthurgalenzoga/UploadedProjects/<user id>/Payload -F../../Libs -MMD -MT dependencies -MF /Users/arthurgalenzoga/UploadedProjects/<user id>/build/B4iProject.build/Release-iphoneos/B4iProject.build/Objects-normal/arm64/b4i_wallet_transfer.d --serialize-diagnostics /Users/arthurgalenzoga/UploadedProjects/<user id>/build/B4iProject.build/Release-iphoneos/B4iProject.build/Objects-normal/arm64/b4i_wallet_transfer.dia -c /Users/arthurgalenzoga/UploadedProjects/<user id>/B4iProject/b4i_wallet_transfer.m -o /Users/arthurgalenzoga/UploadedProjects/<user id>/build/B4iProject.build/Release-iphoneos/B4iProject.build/Objects-normal/arm64/b4i_wallet_transfer.o
In file included from /Users/arthurgalenzoga/UploadedProjects/<user id>/B4iProject/b4i_wallet_transfer.m:2:
/Users/arthurgalenzoga/UploadedProjects/<user id>/B4iProject/b4i_wallet_transfer.h:1:9: fatal error: 'iBarcode.h' file not found
#import "iBarcode.h"
        ^~~~~~~~~~~~
1 error generated.

CompileC /Users/arthurgalenzoga/UploadedProjects/<user id>/build/B4iProject.build/Release-iphoneos/B4iProject.build/Objects-normal/arm64/b4i_xuiviewsutils.o /Users/arthurgalenzoga/UploadedProjects/<user id>/B4iProject/b4i_xuiviewsutils.m normal arm64 objective-c com.apple.compilers.llvm.clang.1_0.compiler (in target 'B4iProject' from project 'B4iProject')
    cd /Users/arthurgalenzoga/UploadedProjects/<user id>
    export LANG=en_US.US-ASCII
    /Applications/Xcode.app/Contents/Developer/Toolchains/XcodeDefault.xctoolchain/usr/bin/clang -x objective-c -target arm64-apple-ios8.0 -fmessage-length=0 -fdiagnostics-show-note-include-stack -fmacro-backtrace-limit=0 -std=gnu99 -fobjc-arc -fmodules -gmodules -fmodules-prune-interval=86400 -fmodules-prune-after=345600 -fbuild-session-file=/var/folders/0t/12ty0rv13053d0qmb4k2c7180000gn/C/org.llvm.clang/ModuleCache.noindex/Session.modulevalidation -fmodules-validate-once-per-build-session -Wnon-modular-include-in-framework-module -Werror=non-modular-include-in-framework-module -Wno-trigraphs -fpascal-strings -O0 -Wno-missing-field-initializers -Wno-missing-prototypes -Werror=return-type -Wno-implicit-atomic-properties -Werror=deprecated-objc-isa-usage -Wno-objc-interface-ivars -Werror=objc-root-class -Wno-arc-repeated-use-of-weak -Wduplicate-method-match -Wno-missing-braces -Wparentheses -Wswitch -Wunused-function -Wno-unused-label -Wno-unused-parameter -Wunused-variable -Wunused-value -Wempty-body -Wuninitialized -Wconditional-uninitialized -Wno-unknown-pragmas -Wno-shadow -Wno-four-char-constants -Wno-conversion -Wconstant-conversion -Wint-conversion -Wbool-conversion -Wenum-conversion -Wno-float-conversion -Wno-non-literal-null-conversion -Wno-objc-literal-conversion -Wshorten-64-to-32 -Wpointer-sign -Wno-newline-eof -Wno-selector -Wno-strict-selector-match -Wundeclared-selector -Wno-deprecated-implementations -DB4I_VERSION=13 -DNS_BLOCK_ASSERTIONS=1 -DOBJC_OLD_DISPATCH_PROTOTYPES=1 -isysroot /Applications/Xcode.app/Contents/Developer/Platforms/iPhoneOS.platform/Developer/SDKs/iPhoneOS13.5.sdk -fstrict-aliasing -Wprotocol -Wdeprecated-declarations -fvisibility=hidden -Wno-sign-conversion -Wno-infinite-recursion -Wno-comma -Wno-block-capture-autoreleasing -Wno-strict-prototypes -Wno-semicolon-before-method-body -iquote /Users/arthurgalenzoga/UploadedProjects/<user id>/build/B4iProject.build/Release-iphoneos/B4iProject.build/All\ Access\ Mobile-generated-files.hmap -I/Users/arthurgalenzoga/UploadedProjects/<user id>/build/B4iProject.build/Release-iphoneos/B4iProject.build/All\ Access\ Mobile-own-target-headers.hmap -I/Users/arthurgalenzoga/UploadedProjects/<user id>/build/B4iProject.build/Release-iphoneos/B4iProject.build/All\ Access\ Mobile-all-target-headers.hmap -iquote /Users/arthurgalenzoga/UploadedProjects/<user id>/build/B4iProject.build/Release-iphoneos/B4iProject.build/All\ Access\ Mobile-project-headers.hmap -I/Users/arthurgalenzoga/UploadedProjects/<user id>/Payload/include -I/Users/arthurgalenzoga/UploadedProjects/<user id>/build/B4iProject.build/Release-iphoneos/B4iProject.build/DerivedSources-normal/arm64 -I/Users/arthurgalenzoga/UploadedProjects/<user id>/build/B4iProject.build/Release-iphoneos/B4iProject.build/DerivedSources/arm64 -I/Users/arthurgalenzoga/UploadedProjects/<user id>/build/B4iProject.build/Release-iphoneos/B4iProject.build/DerivedSources -F/Users/arthurgalenzoga/UploadedProjects/<user id>/Payload -F../../Libs -MMD -MT dependencies -MF /Users/arthurgalenzoga/UploadedProjects/<user id>/build/B4iProject.build/Release-iphoneos/B4iProject.build/Objects-normal/arm64/b4i_xuiviewsutils.d --serialize-diagnostics /Users/arthurgalenzoga/UploadedProjects/<user id>/build/B4iProject.build/Release-iphoneos/B4iProject.build/Objects-normal/arm64/b4i_xuiviewsutils.dia -c /Users/arthurgalenzoga/UploadedProjects/<user id>/B4iProject/b4i_xuiviewsutils.m -o /Users/arthurgalenzoga/UploadedProjects/<user id>/build/B4iProject.build/Release-iphoneos/B4iProject.build/Objects-normal/arm64/b4i_xuiviewsutils.o
In file included from /Users/arthurgalenzoga/UploadedProjects/<user id>/B4iProject/b4i_xuiviewsutils.m:2:
/Users/arthurgalenzoga/UploadedProjects/<user id>/B4iProject/b4i_xuiviewsutils.h:1:9: fatal error: 'iBarcode.h' file not found
#import "iBarcode.h"
        ^~~~~~~~~~~~
1 error generated.

CompileC /Users/arthurgalenzoga/UploadedProjects/<user id>/build/B4iProject.build/Release-iphoneos/B4iProject.build/Objects-normal/arm64/main.o /Users/arthurgalenzoga/UploadedProjects/<user id>/B4iProject/main.m normal arm64 objective-c com.apple.compilers.llvm.clang.1_0.compiler (in target 'B4iProject' from project 'B4iProject')
    cd /Users/arthurgalenzoga/UploadedProjects/<user id>
    export LANG=en_US.US-ASCII
    /Applications/Xcode.app/Contents/Developer/Toolchains/XcodeDefault.xctoolchain/usr/bin/clang -x objective-c -target arm64-apple-ios8.0 -fmessage-length=0 -fdiagnostics-show-note-include-stack -fmacro-backtrace-limit=0 -std=gnu99 -fobjc-arc -fmodules -gmodules -fmodules-prune-interval=86400 -fmodules-prune-after=345600 -fbuild-session-file=/var/folders/0t/12ty0rv13053d0qmb4k2c7180000gn/C/org.llvm.clang/ModuleCache.noindex/Session.modulevalidation -fmodules-validate-once-per-build-session -Wnon-modular-include-in-framework-module -Werror=non-modular-include-in-framework-module -Wno-trigraphs -fpascal-strings -O0 -Wno-missing-field-initializers -Wno-missing-prototypes -Werror=return-type -Wno-implicit-atomic-properties -Werror=deprecated-objc-isa-usage -Wno-objc-interface-ivars -Werror=objc-root-class -Wno-arc-repeated-use-of-weak -Wduplicate-method-match -Wno-missing-braces -Wparentheses -Wswitch -Wunused-function -Wno-unused-label -Wno-unused-parameter -Wunused-variable -Wunused-value -Wempty-body -Wuninitialized -Wconditional-uninitialized -Wno-unknown-pragmas -Wno-shadow -Wno-four-char-constants -Wno-conversion -Wconstant-conversion -Wint-conversion -Wbool-conversion -Wenum-conversion -Wno-float-conversion -Wno-non-literal-null-conversion -Wno-objc-literal-conversion -Wshorten-64-to-32 -Wpointer-sign -Wno-newline-eof -Wno-selector -Wno-strict-selector-match -Wundeclared-selector -Wno-deprecated-implementations -DB4I_VERSION=13 -DNS_BLOCK_ASSERTIONS=1 -DOBJC_OLD_DISPATCH_PROTOTYPES=1 -isysroot /Applications/Xcode.app/Contents/Developer/Platforms/iPhoneOS.platform/Developer/SDKs/iPhoneOS13.5.sdk -fstrict-aliasing -Wprotocol -Wdeprecated-declarations -fvisibility=hidden -Wno-sign-conversion -Wno-infinite-recursion -Wno-comma -Wno-block-capture-autoreleasing -Wno-strict-prototypes -Wno-semicolon-before-method-body -iquote /Users/arthurgalenzoga/UploadedProjects/<user id>/build/B4iProject.build/Release-iphoneos/B4iProject.build/All\ Access\ Mobile-generated-files.hmap -I/Users/arthurgalenzoga/UploadedProjects/<user id>/build/B4iProject.build/Release-iphoneos/B4iProject.build/All\ Access\ Mobile-own-target-headers.hmap -I/Users/arthurgalenzoga/UploadedProjects/<user id>/build/B4iProject.build/Release-iphoneos/B4iProject.build/All\ Access\ Mobile-all-target-headers.hmap -iquote /Users/arthurgalenzoga/UploadedProjects/<user id>/build/B4iProject.build/Release-iphoneos/B4iProject.build/All\ Access\ Mobile-project-headers.hmap -I/Users/arthurgalenzoga/UploadedProjects/<user id>/Payload/include -I/Users/arthurgalenzoga/UploadedProjects/<user id>/build/B4iProject.build/Release-iphoneos/B4iProject.build/DerivedSources-normal/arm64 -I/Users/arthurgalenzoga/UploadedProjects/<user id>/build/B4iProject.build/Release-iphoneos/B4iProject.build/DerivedSources/arm64 -I/Users/arthurgalenzoga/UploadedProjects/<user id>/build/B4iProject.build/Release-iphoneos/B4iProject.build/DerivedSources -F/Users/arthurgalenzoga/UploadedProjects/<user id>/Payload -F../../Libs -MMD -MT dependencies -MF /Users/arthurgalenzoga/UploadedProjects/<user id>/build/B4iProject.build/Release-iphoneos/B4iProject.build/Objects-normal/arm64/main.d --serialize-diagnostics /Users/arthurgalenzoga/UploadedProjects/<user id>/build/B4iProject.build/Release-iphoneos/B4iProject.build/Objects-normal/arm64/main.dia -c /Users/arthurgalenzoga/UploadedProjects/<user id>/B4iProject/main.m -o /Users/arthurgalenzoga/UploadedProjects/<user id>/build/B4iProject.build/Release-iphoneos/B4iProject.build/Objects-normal/arm64/main.o
warning: Could not read serialized diagnostics file: Cannot Load File: Failed to open diagnostics file (in target 'B4iProject' from project 'B4iProject')

CompileC /Users/arthurgalenzoga/UploadedProjects/<user id>/build/B4iProject.build/Release-iphoneos/B4iProject.build/Objects-normal/arm64/b4i_wobblemenu.o /Users/arthurgalenzoga/UploadedProjects/<user id>/B4iProject/b4i_wobblemenu.m normal arm64 objective-c com.apple.compilers.llvm.clang.1_0.compiler (in target 'B4iProject' from project 'B4iProject')
    cd /Users/arthurgalenzoga/UploadedProjects/<user id>
    export LANG=en_US.US-ASCII
    /Applications/Xcode.app/Contents/Developer/Toolchains/XcodeDefault.xctoolchain/usr/bin/clang -x objective-c -target arm64-apple-ios8.0 -fmessage-length=0 -fdiagnostics-show-note-include-stack -fmacro-backtrace-limit=0 -std=gnu99 -fobjc-arc -fmodules -gmodules -fmodules-prune-interval=86400 -fmodules-prune-after=345600 -fbuild-session-file=/var/folders/0t/12ty0rv13053d0qmb4k2c7180000gn/C/org.llvm.clang/ModuleCache.noindex/Session.modulevalidation -fmodules-validate-once-per-build-session -Wnon-modular-include-in-framework-module -Werror=non-modular-include-in-framework-module -Wno-trigraphs -fpascal-strings -O0 -Wno-missing-field-initializers -Wno-missing-prototypes -Werror=return-type -Wno-implicit-atomic-properties -Werror=deprecated-objc-isa-usage -Wno-objc-interface-ivars -Werror=objc-root-class -Wno-arc-repeated-use-of-weak -Wduplicate-method-match -Wno-missing-braces -Wparentheses -Wswitch -Wunused-function -Wno-unused-label -Wno-unused-parameter -Wunused-variable -Wunused-value -Wempty-body -Wuninitialized -Wconditional-uninitialized -Wno-unknown-pragmas -Wno-shadow -Wno-four-char-constants -Wno-conversion -Wconstant-conversion -Wint-conversion -Wbool-conversion -Wenum-conversion -Wno-float-conversion -Wno-non-literal-null-conversion -Wno-objc-literal-conversion -Wshorten-64-to-32 -Wpointer-sign -Wno-newline-eof -Wno-selector -Wno-strict-selector-match -Wundeclared-selector -Wno-deprecated-implementations -DB4I_VERSION=13 -DNS_BLOCK_ASSERTIONS=1 -DOBJC_OLD_DISPATCH_PROTOTYPES=1 -isysroot /Applications/Xcode.app/Contents/Developer/Platforms/iPhoneOS.platform/Developer/SDKs/iPhoneOS13.5.sdk -fstrict-aliasing -Wprotocol -Wdeprecated-declarations -fvisibility=hidden -Wno-sign-conversion -Wno-infinite-recursion -Wno-comma -Wno-block-capture-autoreleasing -Wno-strict-prototypes -Wno-semicolon-before-method-body -iquote /Users/arthurgalenzoga/UploadedProjects/<user id>/build/B4iProject.build/Release-iphoneos/B4iProject.build/All\ Access\ Mobile-generated-files.hmap -I/Users/arthurgalenzoga/UploadedProjects/<user id>/build/B4iProject.build/Release-iphoneos/B4iProject.build/All\ Access\ Mobile-own-target-headers.hmap -I/Users/arthurgalenzoga/UploadedProjects/<user id>/build/B4iProject.build/Release-iphoneos/B4iProject.build/All\ Access\ Mobile-all-target-headers.hmap -iquote /Users/arthurgalenzoga/UploadedProjects/<user id>/build/B4iProject.build/Release-iphoneos/B4iProject.build/All\ Access\ Mobile-project-headers.hmap -I/Users/arthurgalenzoga/UploadedProjects/<user id>/Payload/include -I/Users/arthurgalenzoga/UploadedProjects/<user id>/build/B4iProject.build/Release-iphoneos/B4iProject.build/DerivedSources-normal/arm64 -I/Users/arthurgalenzoga/UploadedProjects/<user id>/build/B4iProject.build/Release-iphoneos/B4iProject.build/DerivedSources/arm64 -I/Users/arthurgalenzoga/UploadedProjects/<user id>/build/B4iProject.build/Release-iphoneos/B4iProject.build/DerivedSources -F/Users/arthurgalenzoga/UploadedProjects/<user id>/Payload -F../../Libs -MMD -MT dependencies -MF /Users/arthurgalenzoga/UploadedProjects/<user id>/build/B4iProject.build/Release-iphoneos/B4iProject.build/Objects-normal/arm64/b4i_wobblemenu.d --serialize-diagnostics /Users/arthurgalenzoga/UploadedProjects/<user id>/build/B4iProject.build/Release-iphoneos/B4iProject.build/Objects-normal/arm64/b4i_wobblemenu.dia -c /Users/arthurgalenzoga/UploadedProjects/<user id>/B4iProject/b4i_wobblemenu.m -o /Users/arthurgalenzoga/UploadedProjects/<user id>/build/B4iProject.build/Release-iphoneos/B4iProject.build/Objects-normal/arm64/b4i_wobblemenu.o
In file included from /Users/arthurgalenzoga/UploadedProjects/<user id>/B4iProject/b4i_wobblemenu.m:2:
/Users/arthurgalenzoga/UploadedProjects/<user id>/B4iProject/b4i_wobblemenu.h:1:9: fatal error: 'iBarcode.h' file not found
#import "iBarcode.h"
        ^~~~~~~~~~~~
1 error generated.


Error: ** BUILD FAILED **


The following build commands failed:
    CompileC /Users/arthurgalenzoga/UploadedProjects/<user id>/build/B4iProject.build/Release-iphoneos/B4iProject.build/Objects-normal/arm64/b4i_wallet_transfer.o /Users/arthurgalenzoga/UploadedProjects/<user id>/B4iProject/b4i_wallet_transfer.m normal arm64 objective-c com.apple.compilers.llvm.clang.1_0.compiler
    CompileC /Users/arthurgalenzoga/UploadedProjects/<user id>/build/B4iProject.build/Release-iphoneos/B4iProject.build/Objects-normal/arm64/b4i_xuiviewsutils.o /Users/arthurgalenzoga/UploadedProjects/<user id>/B4iProject/b4i_xuiviewsutils.m normal arm64 objective-c com.apple.compilers.llvm.clang.1_0.compiler
    CompileC /Users/arthurgalenzoga/UploadedProjects/<user id>/build/B4iProject.build/Release-iphoneos/B4iProject.build/Objects-normal/arm64/b4i_wobblemenu.o /Users/arthurgalenzoga/UploadedProjects/<user id>/B4iProject/b4i_wobblemenu.m normal arm64 objective-c com.apple.compilers.llvm.clang.1_0.compiler
(3 failures)
 

Chris Guanzon

Active Member
Licensed User
It looks like it is missing from your Mac.

Maybe you started the builder from the wrong path.

If you have a hosted builder account then please try it.
Thank you sir @Erel now it's working. I cd to my buildserver location then run the java -jar and now it's working. Thank you so much! :)
 
Top