Spanish Error de compilacion

Buenas tardes.
Hace varios días vengo luchando con este error. Vengo a pedir su ayuda.

Estoy migrando una aplicación de Android a iOS. Necito integrar varias librerías, entre ellas: JavaObject, WebViewExtras, WebViewExtras, WebViewExtras2.
Si agrego cualquiera de estas librerias me retorna error. (Lo adjunto al final) Si no agrego ninguna de la lista el programa compila correctamente.

Tengo b4i v7.
Certificados "developer.apple.com" actualizados, creados siguiendo el tutorial.
-Probe creando un identificador y perfil explicito enves de comodin. retorna otro error. Erel lo recomienda en una pregunta del foro "iOS Question Compile-Problem with Xcode 11"

Necesito su ayuda. Desde ya, gracias.

B4i Versión: 7.00
Parseando código. (0.52s)
Building folders structure. (0.13s)
Compilando código. (2.10s)
Compilado códigos de diseños. (0.04s)
Compilando el código del motor de depuración. (7.88s)
Compilando proyecto Xcode. (0.48s)
Preparing project for builder. (0.41s)
Project size: 0.60 MB
Enviando datos al compilador remoto. Error
Out: Command line invocation:
/Applications/Xcode.app/Contents/Developer/usr/bin/xcodebuild -configuration Release PRODUCT_NAME=nameapp CONFIGURATION_BUILD_DIR=/Users/erel/Documents/UploadedProjects/<user id>/Payload "CODE_SIGN_IDENTITY=iPhone Distribution: Name(code)" "OTHER_CODE_SIGN_FLAGS=--keychain <user id>" PROVISIONING_PROFILE=825a77db-59df-435b-9d16-fbc8ac6c632c -arch arm64

Build settings from command line:
ARCHS = arm64
CODE_SIGN_IDENTITY = iPhone Distribution: Name(code)
CONFIGURATION_BUILD_DIR = /Users/erel/Documents/UploadedProjects/<user id>/Payload
OTHER_CODE_SIGN_FLAGS = --keychain <user id>
PRODUCT_NAME = nameapp
PROVISIONING_PROFILE = 825a77db-59df-435b-9d16-fbc8ac6c632c

note: Using new build system
note: Using codesigning identity override: iPhone Distribution: Name(code)
note: Planning build
note: Constructing build description
warning: The iOS deployment target 'IPHONEOS_DEPLOYMENT_TARGET' is set to 8.0, but the range of supported deployment target versions is 9.0 to 14.3.99. (in target 'B4iProject' from project 'B4iProject')
warning: AddressBook is deprecated. Consider migrating to Contacts instead. (in target 'B4iProject' from project 'B4iProject')
CreateBuildDirectory /Users/erel/Documents/UploadedProjects/<user id>/build (in target 'B4iProject' from project 'B4iProject')
cd /Users/erel/Documents/UploadedProjects/<user id>
builtin-create-build-directory /Users/erel/Documents/UploadedProjects/<user id>/build

MkDir /Users/erel/Documents/UploadedProjects/<user id>/Payload/nameapp.app (in target 'B4iProject' from project 'B4iProject')
cd /Users/erel/Documents/UploadedProjects/<user id>
/bin/mkdir -p /Users/erel/Documents/UploadedProjects/<user id>/Payload/nameapp.app

ProcessProductPackaging /Users/erel/Library/MobileDevice/Provisioning\ Profiles/825a77db-59df-435b-9d16-fbc8ac6c632c.mobileprovision /Users/erel/Documents/UploadedProjects/<user id>/Payload/nameapp.app/embedded.mobileprovision (in target 'B4iProject' from project 'B4iProject')
cd /Users/erel/Documents/UploadedProjects/<user id>
builtin-productPackagingUtility /Users/erel/Library/MobileDevice/Provisioning\ Profiles/825a77db-59df-435b-9d16-fbc8ac6c632c.mobileprovision -o /Users/erel/Documents/UploadedProjects/<user id>/Payload/nameapp.app/embedded.mobileprovision

WriteAuxiliaryFile /Users/erel/Documents/UploadedProjects/<user id>/build/B4iProject.build/Release-iphoneos/B4iProject.build/DerivedSources/Entitlements.plist (in target 'B4iProject' from project 'B4iProject')
cd /Users/erel/Documents/UploadedProjects/<user id>
write-file /Users/erel/Documents/UploadedProjects/<user id>/build/B4iProject.build/Release-iphoneos/B4iProject.build/DerivedSources/Entitlements.plist

ProcessProductPackaging "" /Users/erel/Documents/UploadedProjects/<user id>/build/B4iProject.build/Release-iphoneos/B4iProject.build/nameapp.app.xcent (in target 'B4iProject' from project 'B4iProject')
cd /Users/erel/Documents/UploadedProjects/<user id>


Entitlements:

{
"application-identifier" = "ASQN8ZKLWF.b4i.nameapp";
"com.apple.developer.team-identifier" = ASQN8ZKLWF;
"get-task-allow" = 0;
}


builtin-productPackagingUtility -entitlements -format xml -o /Users/erel/Documents/UploadedProjects/<user id>/build/B4iProject.build/Release-iphoneos/B4iProject.build/nameapp.app.xcent

WriteAuxiliaryFile /Users/erel/Documents/UploadedProjects/<user id>/build/B4iProject.build/Release-iphoneos/B4iProject.build/all-product-headers.yaml (in target 'B4iProject' from project 'B4iProject')
cd /Users/erel/Documents/UploadedProjects/<user id>
write-file /Users/erel/Documents/UploadedProjects/<user id>/build/B4iProject.build/Release-iphoneos/B4iProject.build/all-product-headers.yaml

WriteAuxiliaryFile /Users/erel/Documents/UploadedProjects/<user id>/build/B4iProject.build/Release-iphoneos/B4iProject.build/nameapp.hmap (in target 'B4iProject' from project 'B4iProject')
cd /Users/erel/Documents/UploadedProjects/<user id>
write-file /Users/erel/Documents/UploadedProjects/<user id>/build/B4iProject.build/Release-iphoneos/B4iProject.build/nameapp.hmap

WriteAuxiliaryFile /Users/erel/Documents/UploadedProjects/<user id>/build/B4iProject.build/Release-iphoneos/B4iProject.build/nameapp-project-headers.hmap (in target 'B4iProject' from project 'B4iProject')
cd /Users/erel/Documents/UploadedProjects/<user id>
write-file /Users/erel/Documents/UploadedProjects/<user id>/build/B4iProject.build/Release-iphoneos/B4iProject.build/nameapp-project-headers.hmap

WriteAuxiliaryFile /Users/erel/Documents/UploadedProjects/<user id>/build/B4iProject.build/Release-iphoneos/B4iProject.build/nameapp-all-non-framework-target-headers.hmap (in target 'B4iProject' from project 'B4iProject')
cd /Users/erel/Documents/UploadedProjects/<user id>
write-file /Users/erel/Documents/UploadedProjects/<user id>/build/B4iProject.build/Release-iphoneos/B4iProject.build/nameapp-all-non-framework-target-headers.hmap

WriteAuxiliaryFile /Users/erel/Documents/UploadedProjects/<user id>/build/B4iProject.build/Release-iphoneos/B4iProject.build/nameapp-all-target-headers.hmap (in target 'B4iProject' from project 'B4iProject')
cd /Users/erel/Documents/UploadedProjects/<user id>
write-file /Users/erel/Documents/UploadedProjects/<user id>/build/B4iProject.build/Release-iphoneos/B4iProject.build/nameapp-all-target-headers.hmap

WriteAuxiliaryFile /Users/erel/Documents/UploadedProjects/<user id>/build/B4iProject.build/Release-iphoneos/B4iProject.build/nameapp-generated-files.hmap (in target 'B4iProject' from project 'B4iProject')
cd /Users/erel/Documents/UploadedProjects/<user id>
write-file /Users/erel/Documents/UploadedProjects/<user id>/build/B4iProject.build/Release-iphoneos/B4iProject.build/nameapp-generated-files.hmap

WriteAuxiliaryFile /Users/erel/Documents/UploadedProjects/<user id>/build/B4iProject.build/Release-iphoneos/B4iProject.build/nameapp-own-target-headers.hmap (in target 'B4iProject' from project 'B4iProject')
cd /Users/erel/Documents/UploadedProjects/<user id>
write-file /Users/erel/Documents/UploadedProjects/<user id>/build/B4iProject.build/Release-iphoneos/B4iProject.build/nameapp-own-target-headers.hmap

CompileC /Users/erel/Documents/UploadedProjects/<user id>/build/B4iProject.build/Release-iphoneos/B4iProject.build/Objects-normal/arm64/b4i_roundslider.o /Users/erel/Documents/UploadedProjects/<user id>/B4iProject/b4i_roundslider.m normal arm64 objective-c com.apple.compilers.llvm.clang.1_0.compiler (in target 'B4iProject' from project 'B4iProject')
cd /Users/erel/Documents/UploadedProjects/<user id>
export LANG\=en_US.US-ASCII
/Applications/Xcode.app/Contents/Developer/Toolchains/XcodeDefault.xctoolchain/usr/bin/clang -x objective-c -target arm64-apple-ios8.0 -fmessage-length\=0 -fdiagnostics-show-note-include-stack -fmacro-backtrace-limit\=0 -std\=gnu99 -fobjc-arc -fmodules -gmodules -fmodules-prune-interval\=86400 -fmodules-prune-after\=345600 -fbuild-session-file\=/var/folders/p6/mldl3_gx44qfvmp9tc1b4g8c0000gp/C/org.llvm.clang/ModuleCache.noindex/Session.modulevalidation -fmodules-validate-once-per-build-session -Wnon-modular-include-in-framework-module -Werror\=non-modular-include-in-framework-module -Wno-trigraphs -fpascal-strings -O0 -Wno-missing-field-initializers -Wno-missing-prototypes -Werror\=return-type -Wno-implicit-atomic-properties -Werror\=deprecated-objc-isa-usage -Wno-objc-interface-ivars -Werror\=objc-root-class -Wno-arc-repeated-use-of-weak -Wduplicate-method-match -Wno-missing-braces -Wparentheses -Wswitch -Wunused-function -Wno-unused-label -Wno-unused-parameter -Wunused-variable -Wunused-value -Wempty-body -Wuninitialized -Wconditional-uninitialized -Wno-unknown-pragmas -Wno-shadow -Wno-four-char-constants -Wno-conversion -Wconstant-conversion -Wint-conversion -Wbool-conversion -Wenum-conversion -Wno-float-conversion -Wno-non-literal-null-conversion -Wno-objc-literal-conversion -Wshorten-64-to-32 -Wpointer-sign -Wno-newline-eof -Wno-selector -Wno-strict-selector-match -Wundeclared-selector -Wno-deprecated-implementations -DB4I_VERSION\=12 -DNS_BLOCK_ASSERTIONS\=1 -DOBJC_OLD_DISPATCH_PROTOTYPES\=1 -isysroot /Applications/Xcode.app/Contents/Developer/Platforms/iPhoneOS.platform/Developer/SDKs/iPhoneOS14.3.sdk -fstrict-aliasing -Wprotocol -Wdeprecated-declarations -fvisibility\=hidden -Wno-sign-conversion -Wno-infinite-recursion -Wno-comma -Wno-block-capture-autoreleasing -Wno-strict-prototypes -Wno-semicolon-before-method-body -iquote /Users/erel/Documents/UploadedProjects/<user id>/build/B4iProject.build/Release-iphoneos/B4iProject.build/nameapp-generated-files.hmap -I/Users/erel/Documents/UploadedProjects/<user id>/build/B4iProject.build/Release-iphoneos/B4iProject.build/nameapp-own-target-headers.hmap -I/Users/erel/Documents/UploadedProjects/<user id>/build/B4iProject.build/Release-iphoneos/B4iProject.build/nameapp-all-target-headers.hmap -iquote /Users/erel/Documents/UploadedProjects/<user id>/build/B4iProject.build/Release-iphoneos/B4iProject.build/nameapp-project-headers.hmap -I/Users/erel/Documents/UploadedProjects/<user id>/Payload/include -I/Users/erel/Documents/UploadedProjects/<user id>/build/B4iProject.build/Release-iphoneos/B4iProject.build/DerivedSources-normal/arm64 -I/Users/erel/Documents/UploadedProjects/<user id>/build/B4iProject.build/Release-iphoneos/B4iProject.build/DerivedSources/arm64 -I/Users/erel/Documents/UploadedProjects/<user id>/build/B4iProject.build/Release-iphoneos/B4iProject.build/DerivedSources -F/Users/erel/Documents/UploadedProjects/<user id>/Payload -F../../Libs -MMD -MT dependencies -MF /Users/erel/Documents/UploadedProjects/<user id>/build/B4iProject.build/Release-iphoneos/B4iProject.build/Objects-normal/arm64/b4i_roundslider.d --serialize-diagnostics /Users/erel/Documents/UploadedProjects/<user id>/build/B4iProject.build/Release-iphoneos/B4iProject.build/Objects-normal/arm64/b4i_roundslider.dia -c /Users/erel/Documents/UploadedProjects/<user id>/B4iProject/b4i_roundslider.m -o /Users/erel/Documents/UploadedProjects/<user id>/build/B4iProject.build/Release-iphoneos/B4iProject.build/Objects-normal/arm64/b4i_roundslider.o
In file included from /Users/erel/Documents/UploadedProjects/<user id>/B4iProject/b4i_roundslider.m:2:
/Users/erel/Documents/UploadedProjects/<user id>/B4iProject/b4i_roundslider.h:16:9: fatal error: 'JavaObject.h' file not found
#import "JavaObject.h"
^~~~~~~~~~~~~~
1 error generated.

CompileC /Users/erel/Documents/UploadedProjects/<user id>/build/B4iProject.build/Release-iphoneos/B4iProject.build/Objects-normal/arm64/b4i_swiftbutton.o /Users/erel/Documents/UploadedProjects/<user id>/B4iProject/b4i_swiftbutton.m normal arm64 objective-c com.apple.compilers.llvm.clang.1_0.compiler (in target 'B4iProject' from project 'B4iProject')
cd /Users/erel/Documents/UploadedProjects/<user id>
export LANG\=en_US.US-ASCII
/Applications/Xcode.app/Contents/Developer/Toolchains/XcodeDefault.xctoolchain/usr/bin/clang -x objective-c -target arm64-apple-ios8.0 -fmessage-length\=0 -fdiagnostics-show-note-include-stack -fmacro-backtrace-limit\=0 -std\=gnu99 -fobjc-arc -fmodules -gmodules -fmodules-prune-interval\=86400 -fmodules-prune-after\=345600 -fbuild-session-file\=/var/folders/p6/mldl3_gx44qfvmp9tc1b4g8c0000gp/C/org.llvm.clang/ModuleCache.noindex/Session.modulevalidation -fmodules-validate-once-per-build-session -Wnon-modular-include-in-framework-module -Werror\=non-modular-include-in-framework-module -Wno-trigraphs -fpascal-strings -O0 -Wno-missing-field-initializers -Wno-missing-prototypes -Werror\=return-type -Wno-implicit-atomic-properties -Werror\=deprecated-objc-isa-usage -Wno-objc-interface-ivars -Werror\=objc-root-class -Wno-arc-repeated-use-of-weak -Wduplicate-method-match -Wno-missing-braces -Wparentheses -Wswitch -Wunused-function -Wno-unused-label -Wno-unused-parameter -Wunused-variable -Wunused-value -Wempty-body -Wuninitialized -Wconditional-uninitialized -Wno-unknown-pragmas -Wno-shadow -Wno-four-char-constants -Wno-conversion -Wconstant-conversion -Wint-conversion -Wbool-conversion -Wenum-conversion -Wno-float-conversion -Wno-non-literal-null-conversion -Wno-objc-literal-conversion -Wshorten-64-to-32 -Wpointer-sign -Wno-newline-eof -Wno-selector -Wno-strict-selector-match -Wundeclared-selector -Wno-deprecated-implementations -DB4I_VERSION\=12 -DNS_BLOCK_ASSERTIONS\=1 -DOBJC_OLD_DISPATCH_PROTOTYPES\=1 -isysroot /Applications/Xcode.app/Contents/Developer/Platforms/iPhoneOS.platform/Developer/SDKs/iPhoneOS14.3.sdk -fstrict-aliasing -Wprotocol -Wdeprecated-declarations -fvisibility\=hidden -Wno-sign-conversion -Wno-infinite-recursion -Wno-comma -Wno-block-capture-autoreleasing -Wno-strict-prototypes -Wno-semicolon-before-method-body -iquote /Users/erel/Documents/UploadedProjects/<user id>/build/B4iProject.build/Release-iphoneos/B4iProject.build/nameapp-generated-files.hmap -I/Users/erel/Documents/UploadedProjects/<user id>/build/B4iProject.build/Release-iphoneos/B4iProject.build/nameapp-own-target-headers.hmap -I/Users/erel/Documents/UploadedProjects/<user id>/build/B4iProject.build/Release-iphoneos/B4iProject.build/nameapp-all-target-headers.hmap -iquote /Users/erel/Documents/UploadedProjects/<user id>/build/B4iProject.build/Release-iphoneos/B4iProject.build/nameapp-project-headers.hmap -I/Users/erel/Documents/UploadedProjects/<user id>/Payload/include -I/Users/erel/Documents/UploadedProjects/<user id>/build/B4iProject.build/Release-iphoneos/B4iProject.build/DerivedSources-normal/arm64 -I/Users/erel/Documents/UploadedProjects/<user id>/build/B4iProject.build/Release-iphoneos/B4iProject.build/DerivedSources/arm64 -I/Users/erel/Documents/UploadedProjects/<user id>/build/B4iProject.build/Release-iphoneos/B4iProject.build/DerivedSources -F/Users/erel/Documents/UploadedProjects/<user id>/Payload -F../../Libs -MMD -MT dependencies -MF /Users/erel/Documents/UploadedProjects/<user id>/build/B4iProject.build/Release-iphoneos/B4iProject.build/Objects-normal/arm64/b4i_swiftbutton.d --serialize-diagnostics /Users/erel/Documents/UploadedProjects/<user id>/build/B4iProject.build/Release-iphoneos/B4iProject.build/Objects-normal/arm64/b4i_swiftbutton.dia -c /Users/erel/Documents/UploadedProjects/<user id>/B4iProject/b4i_swiftbutton.m -o /Users/erel/Documents/UploadedProjects/<user id>/build/B4iProject.build/Release-iphoneos/B4iProject.build/Objects-normal/arm64/b4i_swiftbutton.o
In file included from /Users/erel/Documents/UploadedProjects/<user id>/B4iProject/b4i_swiftbutton.m:2:
/Users/erel/Documents/UploadedProjects/<user id>/B4iProject/b4i_swiftbutton.h:16:9: fatal error: 'JavaObject.h' file not found
#import "JavaObject.h"
^~~~~~~~~~~~~~
1 error generated.

CompileC /Users/erel/Documents/UploadedProjects/<user id>/build/B4iProject.build/Release-iphoneos/B4iProject.build/Objects-normal/arm64/LS_floadinginit.o /Users/erel/Documents/UploadedProjects/<user id>/B4iProject/LS_floadinginit.m normal arm64 objective-c com.apple.compilers.llvm.clang.1_0.compiler (in target 'B4iProject' from project 'B4iProject')
cd /Users/erel/Documents/UploadedProjects/<user id>
export LANG\=en_US.US-ASCII
/Applications/Xcode.app/Contents/Developer/Toolchains/XcodeDefault.xctoolchain/usr/bin/clang -x objective-c -target arm64-apple-ios8.0 -fmessage-length\=0 -fdiagnostics-show-note-include-stack -fmacro-backtrace-limit\=0 -std\=gnu99 -fobjc-arc -fmodules -gmodules -fmodules-prune-interval\=86400 -fmodules-prune-after\=345600 -fbuild-session-file\=/var/folders/p6/mldl3_gx44qfvmp9tc1b4g8c0000gp/C/org.llvm.clang/ModuleCache.noindex/Session.modulevalidation -fmodules-validate-once-per-build-session -Wnon-modular-include-in-framework-module -Werror\=non-modular-include-in-framework-module -Wno-trigraphs -fpascal-strings -O0 -Wno-missing-field-initializers -Wno-missing-prototypes -Werror\=return-type -Wno-implicit-atomic-properties -Werror\=deprecated-objc-isa-usage -Wno-objc-interface-ivars -Werror\=objc-root-class -Wno-arc-repeated-use-of-weak -Wduplicate-method-match -Wno-missing-braces -Wparentheses -Wswitch -Wunused-function -Wno-unused-label -Wno-unused-parameter -Wunused-variable -Wunused-value -Wempty-body -Wuninitialized -Wconditional-uninitialized -Wno-unknown-pragmas -Wno-shadow -Wno-four-char-constants -Wno-conversion -Wconstant-conversion -Wint-conversion -Wbool-conversion -Wenum-conversion -Wno-float-conversion -Wno-non-literal-null-conversion -Wno-objc-literal-conversion -Wshorten-64-to-32 -Wpointer-sign -Wno-newline-eof -Wno-selector -Wno-strict-selector-match -Wundeclared-selector -Wno-deprecated-implementations -DB4I_VERSION\=12 -DNS_BLOCK_ASSERTIONS\=1 -DOBJC_OLD_DISPATCH_PROTOTYPES\=1 -isysroot /Applications/Xcode.app/Contents/Developer/Platforms/iPhoneOS.platform/Developer/SDKs/iPhoneOS14.3.sdk -fstrict-aliasing -Wprotocol -Wdeprecated-declarations -fvisibility\=hidden -Wno-sign-conversion -Wno-infinite-recursion -Wno-comma -Wno-block-capture-autoreleasing -Wno-strict-prototypes -Wno-semicolon-before-method-body -iquote /Users/erel/Documents/UploadedProjects/<user id>/build/B4iProject.build/Release-iphoneos/B4iProject.build/nameapp-generated-files.hmap -I/Users/erel/Documents/UploadedProjects/<user id>/build/B4iProject.build/Release-iphoneos/B4iProject.build/nameapp-own-target-headers.hmap -I/Users/erel/Documents/UploadedProjects/<user id>/build/B4iProject.build/Release-iphoneos/B4iProject.build/nameapp-all-target-headers.hmap -iquote /Users/erel/Documents/UploadedProjects/<user id>/build/B4iProject.build/Release-iphoneos/B4iProject.build/nameapp-project-headers.hmap -I/Users/erel/Documents/UploadedProjects/<user id>/Payload/include -I/Users/erel/Documents/UploadedProjects/<user id>/build/B4iProject.build/Release-iphoneos/B4iProject.build/DerivedSources-normal/arm64 -I/Users/erel/Documents/UploadedProjects/<user id>/build/B4iProject.build/Release-iphoneos/B4iProject.build/DerivedSources/arm64 -I/Users/erel/Documents/UploadedProjects/<user id>/build/B4iProject.build/Release-iphoneos/B4iProject.build/DerivedSources -F/Users/erel/Documents/UploadedProjects/<user id>/Payload -F../../Libs -MMD -MT dependencies -MF /Users/erel/Documents/UploadedProjects/<user id>/build/B4iProject.build/Release-iphoneos/B4iProject.build/Objects-normal/arm64/LS_floadinginit.d --serialize-diagnostics /Users/erel/Documents/UploadedProjects/<user id>/build/B4iProject.build/Release-iphoneos/B4iProject.build/Objects-normal/arm64/LS_floadinginit.dia -c /Users/erel/Documents/UploadedProjects/<user id>/B4iProject/LS_floadinginit.m -o /Users/erel/Documents/UploadedProjects/<user id>/build/B4iProject.build/Release-iphoneos/B4iProject.build/Objects-normal/arm64/LS_floadinginit.o

CompileC /Users/erel/Documents/UploadedProjects/<user id>/build/B4iProject.build/Release-iphoneos/B4iProject.build/Objects-normal/arm64/LS_fstart.o /Users/erel/Documents/UploadedProjects/<user id>/B4iProject/LS_fstart.m normal arm64 objective-c com.apple.compilers.llvm.clang.1_0.compiler (in target 'B4iProject' from project 'B4iProject')
cd /Users/erel/Documents/UploadedProjects/<user id>
export LANG\=en_US.US-ASCII
/Applications/Xcode.app/Contents/Developer/Toolchains/XcodeDefault.xctoolchain/usr/bin/clang -x objective-c -target arm64-apple-ios8.0 -fmessage-length\=0 -fdiagnostics-show-note-include-stack -fmacro-backtrace-limit\=0 -std\=gnu99 -fobjc-arc -fmodules -gmodules -fmodules-prune-interval\=86400 -fmodules-prune-after\=345600 -fbuild-session-file\=/var/folders/p6/mldl3_gx44qfvmp9tc1b4g8c0000gp/C/org.llvm.clang/ModuleCache.noindex/Session.modulevalidation -fmodules-validate-once-per-build-session -Wnon-modular-include-in-framework-module -Werror\=non-modular-include-in-framework-module -Wno-trigraphs -fpascal-strings -O0 -Wno-missing-field-initializers -Wno-missing-prototypes -Werror\=return-type -Wno-implicit-atomic-properties -Werror\=deprecated-objc-isa-usage -Wno-objc-interface-ivars -Werror\=objc-root-class -Wno-arc-repeated-use-of-weak -Wduplicate-method-match -Wno-missing-braces -Wparentheses -Wswitch -Wunused-function -Wno-unused-label -Wno-unused-parameter -Wunused-variable -Wunused-value -Wempty-body -Wuninitialized -Wconditional-uninitialized -Wno-unknown-pragmas -Wno-shadow -Wno-four-char-constants -Wno-conversion -Wconstant-conversion -Wint-conversion -Wbool-conversion -Wenum-conversion -Wno-float-conversion -Wno-non-literal-null-conversion -Wno-objc-literal-conversion -Wshorten-64-to-32 -Wpointer-sign -Wno-newline-eof -Wno-selector -Wno-strict-selector-match -Wundeclared-selector -Wno-deprecated-implementations -DB4I_VERSION\=12 -DNS_BLOCK_ASSERTIONS\=1 -DOBJC_OLD_DISPATCH_PROTOTYPES\=1 -isysroot /Applications/Xcode.app/Contents/Developer/Platforms/iPhoneOS.platform/Developer/SDKs/iPhoneOS14.3.sdk -fstrict-aliasing -Wprotocol -Wdeprecated-declarations -fvisibility\=hidden -Wno-sign-conversion -Wno-infinite-recursion -Wno-comma -Wno-block-capture-autoreleasing -Wno-strict-prototypes -Wno-semicolon-before-method-body -iquote /Users/erel/Documents/UploadedProjects/<user id>/build/B4iProject.build/Release-iphoneos/B4iProject.build/nameapp-generated-files.hmap -I/Users/erel/Documents/UploadedProjects/<user id>/build/B4iProject.build/Release-iphoneos/B4iProject.build/nameapp-own-target-headers.hmap -I/Users/erel/Documents/UploadedProjects/<user id>/build/B4iProject.build/Release-iphoneos/B4iProject.build/nameapp-all-target-headers.hmap -iquote /Users/erel/Documents/UploadedProjects/<user id>/build/B4iProject.build/Release-iphoneos/B4iProject.build/nameapp-project-headers.hmap -I/Users/erel/Documents/UploadedProjects/<user id>/Payload/include -I/Users/erel/Documents/UploadedProjects/<user id>/build/B4iProject.build/Release-iphoneos/B4iProject.build/DerivedSources-normal/arm64 -I/Users/erel/Documents/UploadedProjects/<user id>/build/B4iProject.build/Release-iphoneos/B4iProject.build/DerivedSources/arm64 -I/Users/erel/Documents/UploadedProjects/<user id>/build/B4iProject.build/Release-iphoneos/B4iProject.build/DerivedSources -F/Users/erel/Documents/UploadedProjects/<user id>/Payload -F../../Libs -MMD -MT dependencies -MF /Users/erel/Documents/UploadedProjects/<user id>/build/B4iProject.build/Release-iphoneos/B4iProject.build/Objects-normal/arm64/LS_fstart.d --serialize-diagnostics /Users/erel/Documents/UploadedProjects/<user id>/build/B4iProject.build/Release-iphoneos/B4iProject.build/Objects-normal/arm64/LS_fstart.dia -c /Users/erel/Documents/UploadedProjects/<user id>/B4iProject/LS_fstart.m -o /Users/erel/Documents/UploadedProjects/<user id>/build/B4iProject.build/Release-iphoneos/B4iProject.build/Objects-normal/arm64/LS_fstart.o

CompileC /Users/erel/Documents/UploadedProjects/<user id>/build/B4iProject.build/Release-iphoneos/B4iProject.build/Objects-normal/arm64/main.o /Users/erel/Documents/UploadedProjects/<user id>/B4iProject/main.m normal arm64 objective-c com.apple.compilers.llvm.clang.1_0.compiler (in target 'B4iProject' from project 'B4iProject')
cd /Users/erel/Documents/UploadedProjects/<user id>
export LANG\=en_US.US-ASCII
/Applications/Xcode.app/Contents/Developer/Toolchains/XcodeDefault.xctoolchain/usr/bin/clang -x objective-c -target arm64-apple-ios8.0 -fmessage-length\=0 -fdiagnostics-show-note-include-stack -fmacro-backtrace-limit\=0 -std\=gnu99 -fobjc-arc -fmodules -gmodules -fmodules-prune-interval\=86400 -fmodules-prune-after\=345600 -fbuild-session-file\=/var/folders/p6/mldl3_gx44qfvmp9tc1b4g8c0000gp/C/org.llvm.clang/ModuleCache.noindex/Session.modulevalidation -fmodules-validate-once-per-build-session -Wnon-modular-include-in-framework-module -Werror\=non-modular-include-in-framework-module -Wno-trigraphs -fpascal-strings -O0 -Wno-missing-field-initializers -Wno-missing-prototypes -Werror\=return-type -Wno-implicit-atomic-properties -Werror\=deprecated-objc-isa-usage -Wno-objc-interface-ivars -Werror\=objc-root-class -Wno-arc-repeated-use-of-weak -Wduplicate-method-match -Wno-missing-braces -Wparentheses -Wswitch -Wunused-function -Wno-unused-label -Wno-unused-parameter -Wunused-variable -Wunused-value -Wempty-body -Wuninitialized -Wconditional-uninitialized -Wno-unknown-pragmas -Wno-shadow -Wno-four-char-constants -Wno-conversion -Wconstant-conversion -Wint-conversion -Wbool-conversion -Wenum-conversion -Wno-float-conversion -Wno-non-literal-null-conversion -Wno-objc-literal-conversion -Wshorten-64-to-32 -Wpointer-sign -Wno-newline-eof -Wno-selector -Wno-strict-selector-match -Wundeclared-selector -Wno-deprecated-implementations -DB4I_VERSION\=12 -DNS_BLOCK_ASSERTIONS\=1 -DOBJC_OLD_DISPATCH_PROTOTYPES\=1 -isysroot /Applications/Xcode.app/Contents/Developer/Platforms/iPhoneOS.platform/Developer/SDKs/iPhoneOS14.3.sdk -fstrict-aliasing -Wprotocol -Wdeprecated-declarations -fvisibility\=hidden -Wno-sign-conversion -Wno-infinite-recursion -Wno-comma -Wno-block-capture-autoreleasing -Wno-strict-prototypes -Wno-semicolon-before-method-body -iquote /Users/erel/Documents/UploadedProjects/<user id>/build/B4iProject.build/Release-iphoneos/B4iProject.build/nameapp-generated-files.hmap -I/Users/erel/Documents/UploadedProjects/<user id>/build/B4iProject.build/Release-iphoneos/B4iProject.build/nameapp-own-target-headers.hmap -I/Users/erel/Documents/UploadedProjects/<user id>/build/B4iProject.build/Release-iphoneos/B4iProject.build/nameapp-all-target-headers.hmap -iquote /Users/erel/Documents/UploadedProjects/<user id>/build/B4iProject.build/Release-iphoneos/B4iProject.build/nameapp-project-headers.hmap -I/Users/erel/Documents/UploadedProjects/<user id>/Payload/include -I/Users/erel/Documents/UploadedProjects/<user id>/build/B4iProject.build/Release-iphoneos/B4iProject.build/DerivedSources-normal/arm64 -I/Users/erel/Documents/UploadedProjects/<user id>/build/B4iProject.build/Release-iphoneos/B4iProject.build/DerivedSources/arm64 -I/Users/erel/Documents/UploadedProjects/<user id>/build/B4iProject.build/Release-iphoneos/B4iProject.build/DerivedSources -F/Users/erel/Documents/UploadedProjects/<user id>/Payload -F../../Libs -MMD -MT dependencies -MF /Users/erel/Documents/UploadedProjects/<user id>/build/B4iProject.build/Release-iphoneos/B4iProject.build/Objects-normal/arm64/main.d --serialize-diagnostics /Users/erel/Documents/UploadedProjects/<user id>/build/B4iProject.build/Release-iphoneos/B4iProject.build/Objects-normal/arm64/main.dia -c /Users/erel/Documents/UploadedProjects/<user id>/B4iProject/main.m -o /Users/erel/Documents/UploadedProjects/<user id>/build/B4iProject.build/Release-iphoneos/B4iProject.build/Objects-normal/arm64/main.o

CompileC /Users/erel/Documents/UploadedProjects/<user id>/build/B4iProject.build/Release-iphoneos/B4iProject.build/Objects-normal/arm64/b4i_scrollinglabel.o /Users/erel/Documents/UploadedProjects/<user id>/B4iProject/b4i_scrollinglabel.m normal arm64 objective-c com.apple.compilers.llvm.clang.1_0.compiler (in target 'B4iProject' from project 'B4iProject')
cd /Users/erel/Documents/UploadedProjects/<user id>
export LANG\=en_US.US-ASCII
/Applications/Xcode.app/Contents/Developer/Toolchains/XcodeDefault.xctoolchain/usr/bin/clang -x objective-c -target arm64-apple-ios8.0 -fmessage-length\=0 -fdiagnostics-show-note-include-stack -fmacro-backtrace-limit\=0 -std\=gnu99 -fobjc-arc -fmodules -gmodules -fmodules-prune-interval\=86400 -fmodules-prune-after\=345600 -fbuild-session-file\=/var/folders/p6/mldl3_gx44qfvmp9tc1b4g8c0000gp/C/org.llvm.clang/ModuleCache.noindex/Session.modulevalidation -fmodules-validate-once-per-build-session -Wnon-modular-include-in-framework-module -Werror\=non-modular-include-in-framework-module -Wno-trigraphs -fpascal-strings -O0 -Wno-missing-field-initializers -Wno-missing-prototypes -Werror\=return-type -Wno-implicit-atomic-properties -Werror\=deprecated-objc-isa-usage -Wno-objc-interface-ivars -Werror\=objc-root-class -Wno-arc-repeated-use-of-weak -Wduplicate-method-match -Wno-missing-braces -Wparentheses -Wswitch -Wunused-function -Wno-unused-label -Wno-unused-parameter -Wunused-variable -Wunused-value -Wempty-body -Wuninitialized -Wconditional-uninitialized -Wno-unknown-pragmas -Wno-shadow -Wno-four-char-constants -Wno-conversion -Wconstant-conversion -Wint-conversion -Wbool-conversion -Wenum-conversion -Wno-float-conversion -Wno-non-literal-null-conversion -Wno-objc-literal-conversion -Wshorten-64-to-32 -Wpointer-sign -Wno-newline-eof -Wno-selector -Wno-strict-selector-match -Wundeclared-selector -Wno-deprecated-implementations -DB4I_VERSION\=12 -DNS_BLOCK_ASSERTIONS\=1 -DOBJC_OLD_DISPATCH_PROTOTYPES\=1 -isysroot /Applications/Xcode.app/Contents/Developer/Platforms/iPhoneOS.platform/Developer/SDKs/iPhoneOS14.3.sdk -fstrict-aliasing -Wprotocol -Wdeprecated-declarations -fvisibility\=hidden -Wno-sign-conversion -Wno-infinite-recursion -Wno-comma -Wno-block-capture-autoreleasing -Wno-strict-prototypes -Wno-semicolon-before-method-body -iquote /Users/erel/Documents/UploadedProjects/<user id>/build/B4iProject.build/Release-iphoneos/B4iProject.build/nameapp-generated-files.hmap -I/Users/erel/Documents/UploadedProjects/<user id>/build/B4iProject.build/Release-iphoneos/B4iProject.build/nameapp-own-target-headers.hmap -I/Users/erel/Documents/UploadedProjects/<user id>/build/B4iProject.build/Release-iphoneos/B4iProject.build/nameapp-all-target-headers.hmap -iquote /Users/erel/Documents/UploadedProjects/<user id>/build/B4iProject.build/Release-iphoneos/B4iProject.build/nameapp-project-headers.hmap -I/Users/erel/Documents/UploadedProjects/<user id>/Payload/include -I/Users/erel/Documents/UploadedProjects/<user id>/build/B4iProject.build/Release-iphoneos/B4iProject.build/DerivedSources-normal/arm64 -I/Users/erel/Documents/UploadedProjects/<user id>/build/B4iProject.build/Release-iphoneos/B4iProject.build/DerivedSources/arm64 -I/Users/erel/Documents/UploadedProjects/<user id>/build/B4iProject.build/Release-iphoneos/B4iProject.build/DerivedSources -F/Users/erel/Documents/UploadedProjects/<user id>/Payload -F../../Libs -MMD -MT dependencies -MF /Users/erel/Documents/UploadedProjects/<user id>/build/B4iProject.build/Release-iphoneos/B4iProject.build/Objects-normal/arm64/b4i_scrollinglabel.d --serialize-diagnostics /Users/erel/Documents/UploadedProjects/<user id>/build/B4iProject.build/Release-iphoneos/B4iProject.build/Objects-normal/arm64/b4i_scrollinglabel.dia -c /Users/erel/Documents/UploadedProjects/<user id>/B4iProject/b4i_scrollinglabel.m -o /Users/erel/Documents/UploadedProjects/<user id>/build/B4iProject.build/Release-iphoneos/B4iProject.build/Objects-normal/arm64/b4i_scrollinglabel.o
In file included from /Users/erel/Documents/UploadedProjects/<user id>/B4iProject/b4i_scrollinglabel.m:2:
/Users/erel/Documents/UploadedProjects/<user id>/B4iProject/b4i_scrollinglabel.h:16:9: fatal error: 'JavaObject.h' file not found
#import "JavaObject.h"
^~~~~~~~~~~~~~
1 error generated.

CompileC /Users/erel/Documents/UploadedProjects/<user id>/build/B4iProject.build/Release-iphoneos/B4iProject.build/Objects-normal/arm64/LS_searchtemplate.o /Users/erel/Documents/UploadedProjects/<user id>/B4iProject/LS_searchtemplate.m normal arm64 objective-c com.apple.compilers.llvm.clang.1_0.compiler (in target 'B4iProject' from project 'B4iProject')
cd /Users/erel/Documents/UploadedProjects/<user id>
export LANG\=en_US.US-ASCII
/Applications/Xcode.app/Contents/Developer/Toolchains/XcodeDefault.xctoolchain/usr/bin/clang -x objective-c -target arm64-apple-ios8.0 -fmessage-length\=0 -fdiagnostics-show-note-include-stack -fmacro-backtrace-limit\=0 -std\=gnu99 -fobjc-arc -fmodules -gmodules -fmodules-prune-interval\=86400 -fmodules-prune-after\=345600 -fbuild-session-file\=/var/folders/p6/mldl3_gx44qfvmp9tc1b4g8c0000gp/C/org.llvm.clang/ModuleCache.noindex/Session.modulevalidation -fmodules-validate-once-per-build-session -Wnon-modular-include-in-framework-module -Werror\=non-modular-include-in-framework-module -Wno-trigraphs -fpascal-strings -O0 -Wno-missing-field-initializers -Wno-missing-prototypes -Werror\=return-type -Wno-implicit-atomic-properties -Werror\=deprecated-objc-isa-usage -Wno-objc-interface-ivars -Werror\=objc-root-class -Wno-arc-repeated-use-of-weak -Wduplicate-method-match -Wno-missing-braces -Wparentheses -Wswitch -Wunused-function -Wno-unused-label -Wno-unused-parameter -Wunused-variable -Wunused-value -Wempty-body -Wuninitialized -Wconditional-uninitialized -Wno-unknown-pragmas -Wno-shadow -Wno-four-char-constants -Wno-conversion -Wconstant-conversion -Wint-conversion -Wbool-conversion -Wenum-conversion -Wno-float-conversion -Wno-non-literal-null-conversion -Wno-objc-literal-conversion -Wshorten-64-to-32 -Wpointer-sign -Wno-newline-eof -Wno-selector -Wno-strict-selector-match -Wundeclared-selector -Wno-deprecated-implementations -DB4I_VERSION\=12 -DNS_BLOCK_ASSERTIONS\=1 -DOBJC_OLD_DISPATCH_PROTOTYPES\=1 -isysroot /Applications/Xcode.app/Contents/Developer/Platforms/iPhoneOS.platform/Developer/SDKs/iPhoneOS14.3.sdk -fstrict-aliasing -Wprotocol -Wdeprecated-declarations -fvisibility\=hidden -Wno-sign-conversion -Wno-infinite-recursion -Wno-comma -Wno-block-capture-autoreleasing -Wno-strict-prototypes -Wno-semicolon-before-method-body -iquote /Users/erel/Documents/UploadedProjects/<user id>/build/B4iProject.build/Release-iphoneos/B4iProject.build/nameapp-generated-files.hmap -I/Users/erel/Documents/UploadedProjects/<user id>/build/B4iProject.build/Release-iphoneos/B4iProject.build/nameapp-own-target-headers.hmap -I/Users/erel/Documents/UploadedProjects/<user id>/build/B4iProject.build/Release-iphoneos/B4iProject.build/nameapp-all-target-headers.hmap -iquote /Users/erel/Documents/UploadedProjects/<user id>/build/B4iProject.build/Release-iphoneos/B4iProject.build/nameapp-project-headers.hmap -I/Users/erel/Documents/UploadedProjects/<user id>/Payload/include -I/Users/erel/Documents/UploadedProjects/<user id>/build/B4iProject.build/Release-iphoneos/B4iProject.build/DerivedSources-normal/arm64 -I/Users/erel/Documents/UploadedProjects/<user id>/build/B4iProject.build/Release-iphoneos/B4iProject.build/DerivedSources/arm64 -I/Users/erel/Documents/UploadedProjects/<user id>/build/B4iProject.build/Release-iphoneos/B4iProject.build/DerivedSources -F/Users/erel/Documents/UploadedProjects/<user id>/Payload -F../../Libs -MMD -MT dependencies -MF /Users/erel/Documents/UploadedProjects/<user id>/build/B4iProject.build/Release-iphoneos/B4iProject.build/Objects-normal/arm64/LS_searchtemplate.d --serialize-diagnostics /Users/erel/Documents/UploadedProjects/<user id>/build/B4iProject.build/Release-iphoneos/B4iProject.build/Objects-normal/arm64/LS_searchtemplate.dia -c /Users/erel/Documents/UploadedProjects/<user id>/B4iProject/LS_searchtemplate.m -o /Users/erel/Documents/UploadedProjects/<user id>/build/B4iProject.build/Release-iphoneos/B4iProject.build/Objects-normal/arm64/LS_searchtemplate.o

CompileC /Users/erel/Documents/UploadedProjects/<user id>/build/B4iProject.build/Release-iphoneos/B4iProject.build/Objects-normal/arm64/LS_page1.o /Users/erel/Documents/UploadedProjects/<user id>/B4iProject/LS_page1.m normal arm64 objective-c com.apple.compilers.llvm.clang.1_0.compiler (in target 'B4iProject' from project 'B4iProject')
cd /Users/erel/Documents/UploadedProjects/<user id>
export LANG\=en_US.US-ASCII
/Applications/Xcode.app/Contents/Developer/Toolchains/XcodeDefault.xctoolchain/usr/bin/clang -x objective-c -target arm64-apple-ios8.0 -fmessage-length\=0 -fdiagnostics-show-note-include-stack -fmacro-backtrace-limit\=0 -std\=gnu99 -fobjc-arc -fmodules -gmodules -fmodules-prune-interval\=86400 -fmodules-prune-after\=345600 -fbuild-session-file\=/var/folders/p6/mldl3_gx44qfvmp9tc1b4g8c0000gp/C/org.llvm.clang/ModuleCache.noindex/Session.modulevalidation -fmodules-validate-once-per-build-session -Wnon-modular-include-in-framework-module -Werror\=non-modular-include-in-framework-module -Wno-trigraphs -fpascal-strings -O0 -Wno-missing-field-initializers -Wno-missing-prototypes -Werror\=return-type -Wno-implicit-atomic-properties -Werror\=deprecated-objc-isa-usage -Wno-objc-interface-ivars -Werror\=objc-root-class -Wno-arc-repeated-use-of-weak -Wduplicate-method-match -Wno-missing-braces -Wparentheses -Wswitch -Wunused-function -Wno-unused-label -Wno-unused-parameter -Wunused-variable -Wunused-value -Wempty-body -Wuninitialized -Wconditional-uninitialized -Wno-unknown-pragmas -Wno-shadow -Wno-four-char-constants -Wno-conversion -Wconstant-conversion -Wint-conversion -Wbool-conversion -Wenum-conversion -Wno-float-conversion -Wno-non-literal-null-conversion -Wno-objc-literal-conversion -Wshorten-64-to-32 -Wpointer-sign -Wno-newline-eof -Wno-selector -Wno-strict-selector-match -Wundeclared-selector -Wno-deprecated-implementations -DB4I_VERSION\=12 -DNS_BLOCK_ASSERTIONS\=1 -DOBJC_OLD_DISPATCH_PROTOTYPES\=1 -isysroot /Applications/Xcode.app/Contents/Developer/Platforms/iPhoneOS.platform/Developer/SDKs/iPhoneOS14.3.sdk -fstrict-aliasing -Wprotocol -Wdeprecated-declarations -fvisibility\=hidden -Wno-sign-conversion -Wno-infinite-recursion -Wno-comma -Wno-block-capture-autoreleasing -Wno-strict-prototypes -Wno-semicolon-before-method-body -iquote /Users/erel/Documents/UploadedProjects/<user id>/build/B4iProject.build/Release-iphoneos/B4iProject.build/nameapp-generated-files.hmap -I/Users/erel/Documents/UploadedProjects/<user id>/build/B4iProject.build/Release-iphoneos/B4iProject.build/nameapp-own-target-headers.hmap -I/Users/erel/Documents/UploadedProjects/<user id>/build/B4iProject.build/Release-iphoneos/B4iProject.build/nameapp-all-target-headers.hmap -iquote /Users/erel/Documents/UploadedProjects/<user id>/build/B4iProject.build/Release-iphoneos/B4iProject.build/nameapp-project-headers.hmap -I/Users/erel/Documents/UploadedProjects/<user id>/Payload/include -I/Users/erel/Documents/UploadedProjects/<user id>/build/B4iProject.build/Release-iphoneos/B4iProject.build/DerivedSources-normal/arm64 -I/Users/erel/Documents/UploadedProjects/<user id>/build/B4iProject.build/Release-iphoneos/B4iProject.build/DerivedSources/arm64 -I/Users/erel/Documents/UploadedProjects/<user id>/build/B4iProject.build/Release-iphoneos/B4iProject.build/DerivedSources -F/Users/erel/Documents/UploadedProjects/<user id>/Payload -F../../Libs -MMD -MT dependencies -MF /Users/erel/Documents/UploadedProjects/<user id>/build/B4iProject.build/Release-iphoneos/B4iProject.build/Objects-normal/arm64/LS_page1.d --serialize-diagnostics /Users/erel/Documents/UploadedProjects/<user id>/build/B4iProject.build/Release-iphoneos/B4iProject.build/Objects-normal/arm64/LS_page1.dia -c /Users/erel/Documents/UploadedProjects/<user id>/B4iProject/LS_page1.m -o /Users/erel/Documents/UploadedProjects/<user id>/build/B4iProject.build/Release-iphoneos/B4iProject.build/Objects-normal/arm64/LS_page1.o


/*
-----------------------TUVE QUE RECORTAR ESTA PARTE----------------------
*/

CompileC /Users/erel/Documents/UploadedProjects/<user id>/build/B4iProject.build/Release-iphoneos/B4iProject.build/Objects-normal/arm64/b4i_cliploadingsector.o /Users/erel/Documents/UploadedProjects/<user id>/B4iProject/b4i_cliploadingsector.m normal arm64 objective-c com.apple.compilers.llvm.clang.1_0.compiler (in target 'B4iProject' from project 'B4iProject')
cd /Users/erel/Documents/UploadedProjects/<user id>
export LANG\=en_US.US-ASCII
/Applications/Xcode.app/Contents/Developer/Toolchains/XcodeDefault.xctoolchain/usr/bin/clang -x objective-c -target arm64-apple-ios8.0 -fmessage-length\=0 -fdiagnostics-show-note-include-stack -fmacro-backtrace-limit\=0 -std\=gnu99 -fobjc-arc -fmodules -gmodules -fmodules-prune-interval\=86400 -fmodules-prune-after\=345600 -fbuild-session-file\=/var/folders/p6/mldl3_gx44qfvmp9tc1b4g8c0000gp/C/org.llvm.clang/ModuleCache.noindex/Session.modulevalidation -fmodules-validate-once-per-build-session -Wnon-modular-include-in-framework-module -Werror\=non-modular-include-in-framework-module -Wno-trigraphs -fpascal-strings -O0 -Wno-missing-field-initializers -Wno-missing-prototypes -Werror\=return-type -Wno-implicit-atomic-properties -Werror\=deprecated-objc-isa-usage -Wno-objc-interface-ivars -Werror\=objc-root-class -Wno-arc-repeated-use-of-weak -Wduplicate-method-match -Wno-missing-braces -Wparentheses -Wswitch -Wunused-function -Wno-unused-label -Wno-unused-parameter -Wunused-variable -Wunused-value -Wempty-body -Wuninitialized -Wconditional-uninitialized -Wno-unknown-pragmas -Wno-shadow -Wno-four-char-constants -Wno-conversion -Wconstant-conversion -Wint-conversion -Wbool-conversion -Wenum-conversion -Wno-float-conversion -Wno-non-literal-null-conversion -Wno-objc-literal-conversion -Wshorten-64-to-32 -Wpointer-sign -Wno-newline-eof -Wno-selector -Wno-strict-selector-match -Wundeclared-selector -Wno-deprecated-implementations -DB4I_VERSION\=12 -DNS_BLOCK_ASSERTIONS\=1 -DOBJC_OLD_DISPATCH_PROTOTYPES\=1 -isysroot /Applications/Xcode.app/Contents/Developer/Platforms/iPhoneOS.platform/Developer/SDKs/iPhoneOS14.3.sdk -fstrict-aliasing -Wprotocol -Wdeprecated-declarations -fvisibility\=hidden -Wno-sign-conversion -Wno-infinite-recursion -Wno-comma -Wno-block-capture-autoreleasing -Wno-strict-prototypes -Wno-semicolon-before-method-body -iquote /Users/erel/Documents/UploadedProjects/<user id>/build/B4iProject.build/Release-iphoneos/B4iProject.build/nameapp-generated-files.hmap -I/Users/erel/Documents/UploadedProjects/<user id>/build/B4iProject.build/Release-iphoneos/B4iProject.build/nameapp-own-target-headers.hmap -I/Users/erel/Documents/UploadedProjects/<user id>/build/B4iProject.build/Release-iphoneos/B4iProject.build/nameapp-all-target-headers.hmap -iquote /Users/erel/Documents/UploadedProjects/<user id>/build/B4iProject.build/Release-iphoneos/B4iProject.build/nameapp-project-headers.hmap -I/Users/erel/Documents/UploadedProjects/<user id>/Payload/include -I/Users/erel/Documents/UploadedProjects/<user id>/build/B4iProject.build/Release-iphoneos/B4iProject.build/DerivedSources-normal/arm64 -I/Users/erel/Documents/UploadedProjects/<user id>/build/B4iProject.build/Release-iphoneos/B4iProject.build/DerivedSources/arm64 -I/Users/erel/Documents/UploadedProjects/<user id>/build/B4iProject.build/Release-iphoneos/B4iProject.build/DerivedSources -F/Users/erel/Documents/UploadedProjects/<user id>/Payload -F../../Libs -MMD -MT dependencies -MF /Users/erel/Documents/UploadedProjects/<user id>/build/B4iProject.build/Release-iphoneos/B4iProject.build/Objects-normal/arm64/b4i_cliploadingsector.d --serialize-diagnostics /Users/erel/Documents/UploadedProjects/<user id>/build/B4iProject.build/Release-iphoneos/B4iProject.build/Objects-normal/arm64/b4i_cliploadingsector.dia -c /Users/erel/Documents/UploadedProjects/<user id>/B4iProject/b4i_cliploadingsector.m -o /Users/erel/Documents/UploadedProjects/<user id>/build/B4iProject.build/Release-iphoneos/B4iProject.build/Objects-normal/arm64/b4i_cliploadingsector.o


Error: ** BUILD FAILED **


The following build commands failed:
CompileC /Users/erel/Documents/UploadedProjects/<user id>/build/B4iProject.build/Release-iphoneos/B4iProject.build/Objects-normal/arm64/b4i_roundslider.o /Users/erel/Documents/UploadedProjects/<user id>/B4iProject/b4i_roundslider.m normal arm64 objective-c com.apple.compilers.llvm.clang.1_0.compiler
(1 failure)
 
I Reassign variables from JavaObject to NativeObject .. Not many. See the manual "B4XJavaObject_NativeObject".
The program keeps returning the same error.

Any more ideas what it might be?
Thanks
 

Attachments

  • 2.PNG
    2.PNG
    9.4 KB · Views: 37
Top