iOS Question Builder Problem Occurs

mbayik

Member
Licensed User
Hi, im new at b4i. i've local mac and already b4ibuildserver running with port 51041. the xcode version is 9.2. b4i is 4.81

iget this error
B4i Version: 4.81
Parsing code. (0.00s)
Compiling code. (0.31s)
Compiling layouts code. (0.00s)
Compiling debugger engine code. (0.89s)
Building Xcode project (0.23s)
Sending data to remote compiler. Error
Out: Build settings from command line:
ARCHS = x86_64
CODE_SIGNING_REQUIRED = NO
CONFIGURATION_BUILD_DIR = /Users/mehmet/UploadedProjects/<user id>/Payload
PRODUCT_NAME = B4i Example
SDKROOT = iphonesimulator11.2

=== BUILD TARGET B4iProject OF PROJECT B4iProject WITH CONFIGURATION Release ===

Check dependencies

Create product structure
/bin/mkdir -p /Users/mehmet/UploadedProjects/<user id>/Payload/B4i\ Example.app

CompileC build/B4iProject.build/Release-iphonesimulator/B4iProject.build/Objects-normal/x86_64/main.o B4iProject/main.m normal x86_64 objective-c com.apple.compilers.llvm.clang.1_0.compiler
cd /Users/mehmet/UploadedProjects/<user id>
export LANG=en_US.US-ASCII
export PATH="/Applications/Xcode.app/Contents/Developer/Platforms/iPhoneSimulator.platform/Developer/usr/bin:/Applications/Xcode.app/Contents/Developer/usr/bin:/usr/bin:/bin:/usr/sbin:/sbin:/usr/local/bin"
/Applications/Xcode.app/Contents/Developer/Toolchains/XcodeDefault.xctoolchain/usr/bin/clang -x objective-c -arch x86_64 -fmessage-length=0 -fdiagnostics-show-note-include-stack -fmacro-backtrace-limit=0 -std=gnu99 -fobjc-arc -fmodules -gmodules -fmodules-prune-interval=86400 -fmodules-prune-after=345600 -fbuild-session-file=/var/folders/b5/_zyhnx_x04jcyc_2wlvs10nh0000gp/C/org.llvm.clang/ModuleCache/Session.modulevalidation -fmodules-validate-once-per-build-session -Wnon-modular-include-in-framework-module -Werror=non-modular-include-in-framework-module -Wno-trigraphs -fpascal-strings -O0 -Wno-missing-field-initializers -Wno-missing-prototypes -Werror=return-type -Wno-implicit-atomic-properties -Werror=deprecated-objc-isa-usage -Werror=objc-root-class -Wno-arc-repeated-use-of-weak -Wduplicate-method-match -Wno-missing-braces -Wparentheses -Wswitch -Wunused-function -Wno-unused-label -Wno-unused-parameter -Wunused-variable -Wunused-value -Wempty-body -Wuninitialized -Wconditional-uninitialized -Wno-unknown-pragmas -Wno-shadow -Wno-four-char-constants -Wno-conversion -Wconstant-conversion -Wint-conversion -Wbool-conversion -Wenum-conversion -Wno-float-conversion -Wno-non-literal-null-conversion -Wno-objc-literal-conversion -Wshorten-64-to-32 -Wpointer-sign -Wno-newline-eof -Wno-selector -Wno-strict-selector-match -Wundeclared-selector -Wno-deprecated-implementations -DNS_BLOCK_ASSERTIONS=1 -isysroot /Applications/Xcode.app/Contents/Developer/Platforms/iPhoneSimulator.platform/Developer/SDKs/iPhoneSimulator11.2.sdk -fasm-blocks -fstrict-aliasing -Wprotocol -Wdeprecated-declarations -mios-simulator-version-min=7.0 -fvisibility=hidden -Wno-sign-conversion -Wno-infinite-recursion -Wno-comma -Wno-block-capture-autoreleasing -Wno-strict-prototypes -fobjc-abi-version=2 -fobjc-legacy-dispatch -iquote /Users/mehmet/UploadedProjects/<user id>/build/B4iProject.build/Release-iphonesimulator/B4iProject.build/B4i\ Example-generated-files.hmap -I/Users/mehmet/UploadedProjects/<user id>/build/B4iProject.build/Release-iphonesimulator/B4iProject.build/B4i\ Example-own-target-headers.hmap -I/Users/mehmet/UploadedProjects/<user id>/build/B4iProject.build/Release-iphonesimulator/B4iProject.build/B4i\ Example-all-target-headers.hmap -iquote /Users/mehmet/UploadedProjects/<user id>/build/B4iProject.build/Release-iphonesimulator/B4iProject.build/B4i\ Example-project-headers.hmap -I/Users/mehmet/UploadedProjects/<user id>/Payload/include -I/Users/mehmet/UploadedProjects/<user id>/build/B4iProject.build/Release-iphonesimulator/B4iProject.build/DerivedSources/x86_64 -I/Users/mehmet/UploadedProjects/<user id>/build/B4iProject.build/Release-iphonesimulator/B4iProject.build/DerivedSources -F/Users/mehmet/UploadedProjects/<user id>/Payload -F../../Libs -MMD -MT dependencies -MF /Users/mehmet/UploadedProjects/<user id>/build/B4iProject.build/Release-iphonesimulator/B4iProject.build/Objects-normal/x86_64/main.d --serialize-diagnostics /Users/mehmet/UploadedProjects/<user id>/build/B4iProject.build/Release-iphonesimulator/B4iProject.build/Objects-normal/x86_64/main.dia -c /Users/mehmet/UploadedProjects/<user id>/B4iProject/main.m -o /Users/mehmet/UploadedProjects/<user id>/build/B4iProject.build/Release-iphonesimulator/B4iProject.build/Objects-normal/x86_64/main.o

CompileC build/B4iProject.build/Release-iphonesimulator/B4iProject.build/Objects-normal/x86_64/b4i_main.o B4iProject/b4i_main.m normal x86_64 objective-c com.apple.compilers.llvm.clang.1_0.compiler
cd /Users/mehmet/UploadedProjects/<user id>
export LANG=en_US.US-ASCII
export PATH="/Applications/Xcode.app/Contents/Developer/Platforms/iPhoneSimulator.platform/Developer/usr/bin:/Applications/Xcode.app/Contents/Developer/usr/bin:/usr/bin:/bin:/usr/sbin:/sbin:/usr/local/bin"
/Applications/Xcode.app/Contents/Developer/Toolchains/XcodeDefault.xctoolchain/usr/bin/clang -x objective-c -arch x86_64 -fmessage-length=0 -fdiagnostics-show-note-include-stack -fmacro-backtrace-limit=0 -std=gnu99 -fobjc-arc -fmodules -gmodules -fmodules-prune-interval=86400 -fmodules-prune-after=345600 -fbuild-session-file=/var/folders/b5/_zyhnx_x04jcyc_2wlvs10nh0000gp/C/org.llvm.clang/ModuleCache/Session.modulevalidation -fmodules-validate-once-per-build-session -Wnon-modular-include-in-framework-module -Werror=non-modular-include-in-framework-module -Wno-trigraphs -fpascal-strings -O0 -Wno-missing-field-initializers -Wno-missing-prototypes -Werror=return-type -Wno-implicit-atomic-properties -Werror=deprecated-objc-isa-usage -Werror=objc-root-class -Wno-arc-repeated-use-of-weak -Wduplicate-method-match -Wno-missing-braces -Wparentheses -Wswitch -Wunused-function -Wno-unused-label -Wno-unused-parameter -Wunused-variable -Wunused-value -Wempty-body -Wuninitialized -Wconditional-uninitialized -Wno-unknown-pragmas -Wno-shadow -Wno-four-char-constants -Wno-conversion -Wconstant-conversion -Wint-conversion -Wbool-conversion -Wenum-conversion -Wno-float-conversion -Wno-non-literal-null-conversion -Wno-objc-literal-conversion -Wshorten-64-to-32 -Wpointer-sign -Wno-newline-eof -Wno-selector -Wno-strict-selector-match -Wundeclared-selector -Wno-deprecated-implementations -DNS_BLOCK_ASSERTIONS=1 -isysroot /Applications/Xcode.app/Contents/Developer/Platforms/iPhoneSimulator.platform/Developer/SDKs/iPhoneSimulator11.2.sdk -fasm-blocks -fstrict-aliasing -Wprotocol -Wdeprecated-declarations -mios-simulator-version-min=7.0 -fvisibility=hidden -Wno-sign-conversion -Wno-infinite-recursion -Wno-comma -Wno-block-capture-autoreleasing -Wno-strict-prototypes -fobjc-abi-version=2 -fobjc-legacy-dispatch -iquote /Users/mehmet/UploadedProjects/<user id>/build/B4iProject.build/Release-iphonesimulator/B4iProject.build/B4i\ Example-generated-files.hmap -I/Users/mehmet/UploadedProjects/<user id>/build/B4iProject.build/Release-iphonesimulator/B4iProject.build/B4i\ Example-own-target-headers.hmap -I/Users/mehmet/UploadedProjects/<user id>/build/B4iProject.build/Release-iphonesimulator/B4iProject.build/B4i\ Example-all-target-headers.hmap -iquote /Users/mehmet/UploadedProjects/<user id>/build/B4iProject.build/Release-iphonesimulator/B4iProject.build/B4i\ Example-project-headers.hmap -I/Users/mehmet/UploadedProjects/<user id>/Payload/include -I/Users/mehmet/UploadedProjects/<user id>/build/B4iProject.build/Release-iphonesimulator/B4iProject.build/DerivedSources/x86_64 -I/Users/mehmet/UploadedProjects/<user id>/build/B4iProject.build/Release-iphonesimulator/B4iProject.build/DerivedSources -F/Users/mehmet/UploadedProjects/<user id>/Payload -F../../Libs -MMD -MT dependencies -MF /Users/mehmet/UploadedProjects/<user id>/build/B4iProject.build/Release-iphonesimulator/B4iProject.build/Objects-normal/x86_64/b4i_main.d --serialize-diagnostics /Users/mehmet/UploadedProjects/<user id>/build/B4iProject.build/Release-iphonesimulator/B4iProject.build/Objects-normal/x86_64/b4i_main.dia -c /Users/mehmet/UploadedProjects/<user id>/B4iProject/b4i_main.m -o /Users/mehmet/UploadedProjects/<user id>/build/B4iProject.build/Release-iphonesimulator/B4iProject.build/Objects-normal/x86_64/b4i_main.o
In file included from /Users/mehmet/UploadedProjects/<user id>/B4iProject/b4i_main.m:2:
/Users/mehmet/UploadedProjects/<user id>/B4iProject/b4i_main.h:1:9: fatal error: 'iCore.h' file not found
#import "iCore.h"
^~~~~~~~~
1 error generated.


Error: ** BUILD FAILED **


The following build commands failed:
CompileC build/B4iProject.build/Release-iphonesimulator/B4iProject.build/Objects-normal/x86_64/b4i_main.o B4iProject/b4i_main.m normal x86_64 objective-c com.apple.compilers.llvm.clang.1_0.compiler
(1 failure)
 

mbayik

Member
Licensed User
Good. It is always easier to first compile with the hosted builder.

Based on the error message the Libs folder is missing on your Mac.
Thank you, hosted builder very useful and easy but i want to use my local builder.i check the libs folder on my mac, its located on b4ibridge folder.it seems its fine
 
Upvote 0

mbayik

Member
Licensed User
of course, here are the screen shots.
 

Attachments

  • screen1.png
    screen1.png
    234 KB · Views: 139
  • screen_2.png
    screen_2.png
    278.1 KB · Views: 129
Upvote 0

mbayik

Member
Licensed User
hi, sorry about delay. the error log showed below.there is no file in the uploadedProjects folder on my local mac.
i upgrade the os 10.13.3 thank you


B4i Version: 4.81
Parsing code. (0.00s)
Compiling code. (0.03s)
Compiling layouts code. (0.00s)
Compiling debugger engine code. (1.01s)
Building Xcode project (0.23s)
Sending data to remote compiler. Error
Out: Build settings from command line:
ARCHS = x86_64
CODE_SIGNING_REQUIRED = NO
CONFIGURATION_BUILD_DIR = /Users/mehmet/UploadedProjects/<user id>/Payload
PRODUCT_NAME = result
SDKROOT = iphonesimulator11.2

=== BUILD TARGET B4iProject OF PROJECT B4iProject WITH CONFIGURATION Release ===

Check dependencies

Write auxiliary files
write-file /Users/mehmet/UploadedProjects/<user id>/build/B4iProject.build/Release-iphonesimulator/B4iProject.build/result-all-non-framework-target-headers.hmap
write-file /Users/mehmet/UploadedProjects/<user id>/build/B4iProject.build/Release-iphonesimulator/B4iProject.build/result-all-target-headers.hmap
write-file /Users/mehmet/UploadedProjects/<user id>/build/B4iProject.build/Release-iphonesimulator/B4iProject.build/result-project-headers.hmap
write-file /Users/mehmet/UploadedProjects/<user id>/build/B4iProject.build/Release-iphonesimulator/B4iProject.build/result.hmap
write-file /Users/mehmet/UploadedProjects/<user id>/build/B4iProject.build/Release-iphonesimulator/B4iProject.build/result-generated-files.hmap
/bin/mkdir -p /Users/mehmet/UploadedProjects/<user id>/build/B4iProject.build/Release-iphonesimulator/B4iProject.build/Objects-normal/x86_64
write-file /Users/mehmet/UploadedProjects/<user id>/build/B4iProject.build/Release-iphonesimulator/B4iProject.build/Objects-normal/x86_64/result.LinkFileList
write-file /Users/mehmet/UploadedProjects/<user id>/build/B4iProject.build/Release-iphonesimulator/B4iProject.build/result-own-target-headers.hmap

Create product structure
/bin/mkdir -p /Users/mehmet/UploadedProjects/<user id>/Payload/result.app

ProcessProductPackaging "" build/B4iProject.build/Release-iphonesimulator/B4iProject.build/result.app.xcent
cd /Users/mehmet/UploadedProjects/<user id>
export PATH="/Applications/Xcode.app/Contents/Developer/Platforms/iPhoneSimulator.platform/Developer/usr/bin:/Applications/Xcode.app/Contents/Developer/usr/bin:/usr/bin:/bin:/usr/sbin:/sbin:/usr/local/bin"
builtin-productPackagingUtility -entitlements -format xml -o /Users/mehmet/UploadedProjects/<user id>/build/B4iProject.build/Release-iphonesimulator/B4iProject.build/result.app.xcent

CompileC build/B4iProject.build/Release-iphonesimulator/B4iProject.build/Objects-normal/x86_64/main.o B4iProject/main.m normal x86_64 objective-c com.apple.compilers.llvm.clang.1_0.compiler
cd /Users/mehmet/UploadedProjects/<user id>
export LANG=en_US.US-ASCII
export PATH="/Applications/Xcode.app/Contents/Developer/Platforms/iPhoneSimulator.platform/Developer/usr/bin:/Applications/Xcode.app/Contents/Developer/usr/bin:/usr/bin:/bin:/usr/sbin:/sbin:/usr/local/bin"
/Applications/Xcode.app/Contents/Developer/Toolchains/XcodeDefault.xctoolchain/usr/bin/clang -x objective-c -arch x86_64 -fmessage-length=0 -fdiagnostics-show-note-include-stack -fmacro-backtrace-limit=0 -std=gnu99 -fobjc-arc -fmodules -gmodules -fmodules-prune-interval=86400 -fmodules-prune-after=345600 -fbuild-session-file=/var/folders/b5/_zyhnx_x04jcyc_2wlvs10nh0000gp/C/org.llvm.clang/ModuleCache/Session.modulevalidation -fmodules-validate-once-per-build-session -Wnon-modular-include-in-framework-module -Werror=non-modular-include-in-framework-module -Wno-trigraphs -fpascal-strings -O0 -Wno-missing-field-initializers -Wno-missing-prototypes -Werror=return-type -Wno-implicit-atomic-properties -Werror=deprecated-objc-isa-usage -Werror=objc-root-class -Wno-arc-repeated-use-of-weak -Wduplicate-method-match -Wno-missing-braces -Wparentheses -Wswitch -Wunused-function -Wno-unused-label -Wno-unused-parameter -Wunused-variable -Wunused-value -Wempty-body -Wuninitialized -Wconditional-uninitialized -Wno-unknown-pragmas -Wno-shadow -Wno-four-char-constants -Wno-conversion -Wconstant-conversion -Wint-conversion -Wbool-conversion -Wenum-conversion -Wno-float-conversion -Wno-non-literal-null-conversion -Wno-objc-literal-conversion -Wshorten-64-to-32 -Wpointer-sign -Wno-newline-eof -Wno-selector -Wno-strict-selector-match -Wundeclared-selector -Wno-deprecated-implementations -DNS_BLOCK_ASSERTIONS=1 -isysroot /Applications/Xcode.app/Contents/Developer/Platforms/iPhoneSimulator.platform/Developer/SDKs/iPhoneSimulator11.2.sdk -fasm-blocks -fstrict-aliasing -Wprotocol -Wdeprecated-declarations -mios-simulator-version-min=7.0 -fvisibility=hidden -Wno-sign-conversion -Wno-infinite-recursion -Wno-comma -Wno-block-capture-autoreleasing -Wno-strict-prototypes -fobjc-abi-version=2 -fobjc-legacy-dispatch -iquote /Users/mehmet/UploadedProjects/<user id>/build/B4iProject.build/Release-iphonesimulator/B4iProject.build/result-generated-files.hmap -I/Users/mehmet/UploadedProjects/<user id>/build/B4iProject.build/Release-iphonesimulator/B4iProject.build/result-own-target-headers.hmap -I/Users/mehmet/UploadedProjects/<user id>/build/B4iProject.build/Release-iphonesimulator/B4iProject.build/result-all-target-headers.hmap -iquote /Users/mehmet/UploadedProjects/<user id>/build/B4iProject.build/Release-iphonesimulator/B4iProject.build/result-project-headers.hmap -I/Users/mehmet/UploadedProjects/<user id>/Payload/include -I/Users/mehmet/UploadedProjects/<user id>/build/B4iProject.build/Release-iphonesimulator/B4iProject.build/DerivedSources/x86_64 -I/Users/mehmet/UploadedProjects/<user id>/build/B4iProject.build/Release-iphonesimulator/B4iProject.build/DerivedSources -F/Users/mehmet/UploadedProjects/<user id>/Payload -F../../Libs -MMD -MT dependencies -MF /Users/mehmet/UploadedProjects/<user id>/build/B4iProject.build/Release-iphonesimulator/B4iProject.build/Objects-normal/x86_64/main.d --serialize-diagnostics /Users/mehmet/UploadedProjects/<user id>/build/B4iProject.build/Release-iphonesimulator/B4iProject.build/Objects-normal/x86_64/main.dia -c /Users/mehmet/UploadedProjects/<user id>/B4iProject/main.m -o /Users/mehmet/UploadedProjects/<user id>/build/B4iProject.build/Release-iphonesimulator/B4iProject.build/Objects-normal/x86_64/main.o

CompileC build/B4iProject.build/Release-iphonesimulator/B4iProject.build/Objects-normal/x86_64/b4i_main.o B4iProject/b4i_main.m normal x86_64 objective-c com.apple.compilers.llvm.clang.1_0.compiler
cd /Users/mehmet/UploadedProjects/<user id>
export LANG=en_US.US-ASCII
export PATH="/Applications/Xcode.app/Contents/Developer/Platforms/iPhoneSimulator.platform/Developer/usr/bin:/Applications/Xcode.app/Contents/Developer/usr/bin:/usr/bin:/bin:/usr/sbin:/sbin:/usr/local/bin"
/Applications/Xcode.app/Contents/Developer/Toolchains/XcodeDefault.xctoolchain/usr/bin/clang -x objective-c -arch x86_64 -fmessage-length=0 -fdiagnostics-show-note-include-stack -fmacro-backtrace-limit=0 -std=gnu99 -fobjc-arc -fmodules -gmodules -fmodules-prune-interval=86400 -fmodules-prune-after=345600 -fbuild-session-file=/var/folders/b5/_zyhnx_x04jcyc_2wlvs10nh0000gp/C/org.llvm.clang/ModuleCache/Session.modulevalidation -fmodules-validate-once-per-build-session -Wnon-modular-include-in-framework-module -Werror=non-modular-include-in-framework-module -Wno-trigraphs -fpascal-strings -O0 -Wno-missing-field-initializers -Wno-missing-prototypes -Werror=return-type -Wno-implicit-atomic-properties -Werror=deprecated-objc-isa-usage -Werror=objc-root-class -Wno-arc-repeated-use-of-weak -Wduplicate-method-match -Wno-missing-braces -Wparentheses -Wswitch -Wunused-function -Wno-unused-label -Wno-unused-parameter -Wunused-variable -Wunused-value -Wempty-body -Wuninitialized -Wconditional-uninitialized -Wno-unknown-pragmas -Wno-shadow -Wno-four-char-constants -Wno-conversion -Wconstant-conversion -Wint-conversion -Wbool-conversion -Wenum-conversion -Wno-float-conversion -Wno-non-literal-null-conversion -Wno-objc-literal-conversion -Wshorten-64-to-32 -Wpointer-sign -Wno-newline-eof -Wno-selector -Wno-strict-selector-match -Wundeclared-selector -Wno-deprecated-implementations -DNS_BLOCK_ASSERTIONS=1 -isysroot /Applications/Xcode.app/Contents/Developer/Platforms/iPhoneSimulator.platform/Developer/SDKs/iPhoneSimulator11.2.sdk -fasm-blocks -fstrict-aliasing -Wprotocol -Wdeprecated-declarations -mios-simulator-version-min=7.0 -fvisibility=hidden -Wno-sign-conversion -Wno-infinite-recursion -Wno-comma -Wno-block-capture-autoreleasing -Wno-strict-prototypes -fobjc-abi-version=2 -fobjc-legacy-dispatch -iquote /Users/mehmet/UploadedProjects/<user id>/build/B4iProject.build/Release-iphonesimulator/B4iProject.build/result-generated-files.hmap -I/Users/mehmet/UploadedProjects/<user id>/build/B4iProject.build/Release-iphonesimulator/B4iProject.build/result-own-target-headers.hmap -I/Users/mehmet/UploadedProjects/<user id>/build/B4iProject.build/Release-iphonesimulator/B4iProject.build/result-all-target-headers.hmap -iquote /Users/mehmet/UploadedProjects/<user id>/build/B4iProject.build/Release-iphonesimulator/B4iProject.build/result-project-headers.hmap -I/Users/mehmet/UploadedProjects/<user id>/Payload/include -I/Users/mehmet/UploadedProjects/<user id>/build/B4iProject.build/Release-iphonesimulator/B4iProject.build/DerivedSources/x86_64 -I/Users/mehmet/UploadedProjects/<user id>/build/B4iProject.build/Release-iphonesimulator/B4iProject.build/DerivedSources -F/Users/mehmet/UploadedProjects/<user id>/Payload -F../../Libs -MMD -MT dependencies -MF /Users/mehmet/UploadedProjects/<user id>/build/B4iProject.build/Release-iphonesimulator/B4iProject.build/Objects-normal/x86_64/b4i_main.d --serialize-diagnostics /Users/mehmet/UploadedProjects/<user id>/build/B4iProject.build/Release-iphonesimulator/B4iProject.build/Objects-normal/x86_64/b4i_main.dia -c /Users/mehmet/UploadedProjects/<user id>/B4iProject/b4i_main.m -o /Users/mehmet/UploadedProjects/<user id>/build/B4iProject.build/Release-iphonesimulator/B4iProject.build/Objects-normal/x86_64/b4i_main.o
In file included from /Users/mehmet/UploadedProjects/<user id>/B4iProject/b4i_main.m:2:
/Users/mehmet/UploadedProjects/<user id>/B4iProject/b4i_main.h:1:9: fatal error: 'iCore.h' file not found
#import "iCore.h"
^~~~~~~~~
1 error generated.


Error: ** BUILD FAILED **


The following build commands failed:
CompileC build/B4iProject.build/Release-iphonesimulator/B4iProject.build/Objects-normal/x86_64/b4i_main.o B4iProject/b4i_main.m normal x86_64 objective-c com.apple.compilers.llvm.clang.1_0.compiler
(1 failure)
 
Upvote 0

mbayik

Member
Licensed User
here is the Xcode errors
 

Attachments

  • error.png
    error.png
    65.8 KB · Views: 148
  • error2.png
    error2.png
    227 KB · Views: 128
  • error3.png
    error3.png
    191.7 KB · Views: 131
Upvote 0

mbayik

Member
Licensed User
hi erel, i think i solved that problem. when i first installed b4iBuildServer to user directory than something was wrong than i moved all dir to root. when you inform me today i open with xcode the project than i see the icore.h is in root\b4iBuildServer\Libs at the end problem was here. i move all directories to \user\mehmet\ .. now it seems working. thank you for your interest and help:):)
 
Upvote 0
Top