iOS Question No longer able to use local builder

marcick

Well-Known Member
Licensed User
Longtime User
I don't know what's happened or what i did, but ... (title)

Is it correct running Java -jar build.jar to have this in the terminal ?

B4X:
Last login: Wed Jun  6 14:47:43 on ttys000
iMac-di-Marco:~ EB$ cd desktop
iMac-di-Marco:desktop EB$ cd builder
iMac-di-Marco:builder EB$ java -jar build.jar
Build server version: 4.6
~~~~~~~~~~~~~~~~~~~~~~~~~~~~~~~~~~~~~
2018-06-06 15:02:47.392:INFO::main: Logging initialized @7614ms to org.eclipse.jetty.util.log.StdErrLog
Loading default configuration file.
AppPath=/Users/EB/Desktop/builder
Mac version: 10.13.4
Xcode path: /Applications/Xcode.app/Contents/Developer
Xcode version: Xcode 9.2
Build version 9C40b

2018-06-06 15:02:55.073:INFO:oejs.Server:main: jetty-9.4.z-SNAPSHOT
2018-06-06 15:02:56.674:INFO:oejs.session:main: DefaultSessionIdManager workerName=node0
2018-06-06 15:02:56.675:INFO:oejs.session:main: No SessionScavenger set, using defaults
2018-06-06 15:02:56.765:INFO:oejs.session:main: Scavenging every 600000ms
2018-06-06 15:02:57.114:INFO:oejsh.ContextHandler:main: Started o.e.j.s.ServletContextHandler@57fffcd7{/,file:///Users/EB/Desktop/builder/www,AVAILABLE}
2018-06-06 15:02:57.708:INFO:oejs.AbstractNCSARequestLog:main: Opened /Users/EB/Desktop/builder/logs/b4j-2018_06_06.request.log
2018-06-06 15:02:58.456:INFO:oejs.AbstractConnector:main: Started ServerConnector@66ef7c5a{HTTP/1.1,[http/1.1]}{0.0.0.0:51041}
main._appstart (java line: 130)
java.lang.IllegalStateException: no valid keystore
    at org.eclipse.jetty.util.security.CertificateUtils.getKeyStore(CertificateUtils.java:48)
    at org.eclipse.jetty.util.ssl.SslContextFactory.loadKeyStore(SslContextFactory.java:1018)
    at org.eclipse.jetty.util.ssl.SslContextFactory.load(SslContextFactory.java:253)
    at org.eclipse.jetty.util.ssl.SslContextFactory.doStart(SslContextFactory.java:220)
    at org.eclipse.jetty.util.component.AbstractLifeCycle.start(AbstractLifeCycle.java:68)
    at org.eclipse.jetty.util.component.ContainerLifeCycle.start(ContainerLifeCycle.java:131)
    at org.eclipse.jetty.util.component.ContainerLifeCycle.doStart(ContainerLifeCycle.java:113)
    at org.eclipse.jetty.server.SslConnectionFactory.doStart(SslConnectionFactory.java:72)
    at org.eclipse.jetty.util.component.AbstractLifeCycle.start(AbstractLifeCycle.java:68)
    at org.eclipse.jetty.util.component.ContainerLifeCycle.start(ContainerLifeCycle.java:131)
    at org.eclipse.jetty.util.component.ContainerLifeCycle.doStart(ContainerLifeCycle.java:113)
    at org.eclipse.jetty.server.AbstractConnector.doStart(AbstractConnector.java:270)
    at org.eclipse.jetty.server.AbstractNetworkConnector.doStart(AbstractNetworkConnector.java:81)
    at org.eclipse.jetty.server.ServerConnector.doStart(ServerConnector.java:236)
    at org.eclipse.jetty.util.component.AbstractLifeCycle.start(AbstractLifeCycle.java:68)
    at org.eclipse.jetty.server.Server.doStart(Server.java:431)
    at org.eclipse.jetty.util.component.AbstractLifeCycle.start(AbstractLifeCycle.java:68)
    at anywheresoftware.b4j.object.ServerWrapper.Start(ServerWrapper.java:211)
    at b4j.example.main._appstart(main.java:130)
    at sun.reflect.NativeMethodAccessorImpl.invoke0(Native Method)
    at sun.reflect.NativeMethodAccessorImpl.invoke(NativeMethodAccessorImpl.java:62)
    at sun.reflect.DelegatingMethodAccessorImpl.invoke(DelegatingMethodAccessorImpl.java:43)
    at java.lang.reflect.Method.invoke(Method.java:498)
    at anywheresoftware.b4a.BA.raiseEvent2(BA.java:90)
    at anywheresoftware.b4a.BA.raiseEvent(BA.java:77)
    at b4j.example.main.main(main.java:29)

main.main (java line: 29)
java.lang.RuntimeException: java.lang.IllegalStateException: no valid keystore
    at anywheresoftware.b4a.BA.raiseEvent2(BA.java:119)
    at anywheresoftware.b4a.BA.raiseEvent(BA.java:77)
    at b4j.example.main.main(main.java:29)
Caused by: java.lang.IllegalStateException: no valid keystore
    at org.eclipse.jetty.util.security.CertificateUtils.getKeyStore(CertificateUtils.java:48)
    at org.eclipse.jetty.util.ssl.SslContextFactory.loadKeyStore(SslContextFactory.java:1018)
    at org.eclipse.jetty.util.ssl.SslContextFactory.load(SslContextFactory.java:253)
    at org.eclipse.jetty.util.ssl.SslContextFactory.doStart(SslContextFactory.java:220)
    at org.eclipse.jetty.util.component.AbstractLifeCycle.start(AbstractLifeCycle.java:68)
    at org.eclipse.jetty.util.component.ContainerLifeCycle.start(ContainerLifeCycle.java:131)
    at org.eclipse.jetty.util.component.ContainerLifeCycle.doStart(ContainerLifeCycle.java:113)
    at org.eclipse.jetty.server.SslConnectionFactory.doStart(SslConnectionFactory.java:72)
    at org.eclipse.jetty.util.component.AbstractLifeCycle.start(AbstractLifeCycle.java:68)
    at org.eclipse.jetty.util.component.ContainerLifeCycle.start(ContainerLifeCycle.java:131)
    at org.eclipse.jetty.util.component.ContainerLifeCycle.doStart(ContainerLifeCycle.java:113)
    at org.eclipse.jetty.server.AbstractConnector.doStart(AbstractConnector.java:270)
    at org.eclipse.jetty.server.AbstractNetworkConnector.doStart(AbstractNetworkConnector.java:81)
    at org.eclipse.jetty.server.ServerConnector.doStart(ServerConnector.java:236)
    at org.eclipse.jetty.util.component.AbstractLifeCycle.start(AbstractLifeCycle.java:68)
    at org.eclipse.jetty.server.Server.doStart(Server.java:431)
    at org.eclipse.jetty.util.component.AbstractLifeCycle.start(AbstractLifeCycle.java:68)
    at anywheresoftware.b4j.object.ServerWrapper.Start(ServerWrapper.java:211)
    at b4j.example.main._appstart(main.java:130)
    at sun.reflect.NativeMethodAccessorImpl.invoke0(Native Method)
    at sun.reflect.NativeMethodAccessorImpl.invoke(NativeMethodAccessorImpl.java:62)
    at sun.reflect.DelegatingMethodAccessorImpl.invoke(DelegatingMethodAccessorImpl.java:43)
    at java.lang.reflect.Method.invoke(Method.java:498)
    at anywheresoftware.b4a.BA.raiseEvent2(BA.java:90)
    ... 2 more

success: true, 1

If I run from windows "192.168.1.3:51041/test" I get this

B4X:
B4i Build Server
Build server is running.
Version: 4.6
Server time: 15:15:44
Mac SSL Key
Error reading key
SSL port: 51042
h files
iAd: 1.00
iAdMob: 1.60
iAnalytics: 1.0
iArchiver: 1.20
iBarcode: 1.20
iBLE: 2.00
iCallSubUtils
iComboBox: 1.04
iContacts: 1.00
iCore: 4.80
iCustomDialog: 1.00
iCustomListView
iDateUtils
iDebug: 1.60
iDebug2: 1.60
iDesigner: 1.20
iDropboxSync: 1.00
iEncryption: 1.02
iEventKit: 1.00
iFacebook: 1.00
iFirebaseAnalytics: 1.00
iFirebaseAuth: 1.02
iFirebaseNotifications: 1.00
iFirebaseStorage: 1.10
iGameCenter: 1.01
iGameView: 1.0
iGoogleMaps: 1.40
iHttp: 1.01
iHttpUtils2
iHUD: 1.00
iJSON: 1.0
iLeadbolt: 2.00
iLocation: 1.20
iMedia: 1.22
iMQTT: 1.0
iNet: 1.70
iNetwork: 1.32
iNFC
iPhone: 2.00
iRandomAccessFile: 1.72
iReleaseLogger: 1.00
iRSA: 1.0
iSideMenu: 1.01
iSpeechRecognition: 1.00
iSQL: 1.50
iStore: 1.20
iStringUtils: 1.01
iSVG: 1.20
iTableView: 1.21
iTabStrip: 1.00
iUI8: 1.50
iUI9: 1.0
iWebSocket: 1.10
iXmlBuilder: 1.00
iXmlSax: 1.10
iXUI: 1.50
a files
libAdapterInMobi, size=1,125,360, modified=05/04/2017 10:19:34
libCore, size=3,799,648, modified=01/09/2018 15:12:32
libiAd, size=39,072, modified=08/17/2017 13:02:12
libiAdMob, size=492,088, modified=05/24/2018 09:56:00
libiAnalytics, size=39,392, modified=08/17/2017 13:02:16
libiArchiver, size=463,088, modified=08/17/2017 13:02:18
libiBarcode, size=249,056, modified=08/17/2017 13:02:20
libiBLE, size=228,216, modified=08/17/2017 13:02:22
libiCallSubUtils, size=126,952, modified=08/17/2017 13:33:06
libiComboBox, size=663,200, modified=02/05/2016 13:50:34
libiContacts, size=142,816, modified=08/17/2017 13:02:24
libiCustomDialog, size=2,720,512, modified=08/17/2017 13:02:32
libiCustomListView, size=316,424, modified=08/27/2017 16:51:10
libiDateUtils, size=257,440, modified=10/18/2017 11:21:58
libiDebug2, size=1,094,272, modified=08/17/2017 14:41:24
libiDesigner, size=939,304, modified=08/17/2017 13:57:22
libiDropboxSync, size=80,960, modified=05/04/2017 10:19:36
libiEncryption, size=66,512, modified=08/17/2017 13:02:34
libiEventKit, size=330,256, modified=08/17/2017 13:56:26
libiFacebook, size=93,392, modified=08/17/2017 13:02:40
libiFirebaseAnalytics, size=33,880, modified=08/17/2017 13:02:42
libiFirebaseAuth, size=161,512, modified=08/17/2017 13:02:44
libiFirebaseNotifications, size=66,600, modified=08/17/2017 13:02:46
libiFirebaseStorage, size=140,832, modified=12/06/2017 09:57:10
libiGameCenter, size=158,080, modified=11/06/2017 06:50:46
libiGameView, size=4,089,072, modified=08/17/2017 13:03:00
libiGoogleMaps, size=170,512, modified=12/08/2017 08:59:56
libiHttp, size=122,656, modified=08/17/2017 13:03:04
libiHttpUtils2, size=362,888, modified=08/17/2017 13:31:02
libiHUD, size=291,472, modified=08/17/2017 13:03:06
libiJSON, size=52,960, modified=08/17/2017 13:03:10
libiLeadbolt, size=21,440, modified=05/04/2017 10:19:36
libiLocation, size=125,184, modified=08/17/2017 13:03:14
libiMedia, size=259,208, modified=10/25/2017 06:40:54
libiMQTT, size=1,703,608, modified=08/17/2017 13:03:24
libiNet, size=550,208, modified=10/09/2017 14:33:34
libiNetwork, size=267,336, modified=11/19/2017 11:13:02
libiNFC, size=40,424, modified=10/08/2017 15:48:28
libiPhone, size=326,664, modified=08/17/2017 13:03:34
libiRandomAccessFile, size=399,912, modified=08/17/2017 13:03:38
libiReleaseLogger, size=50,136, modified=08/17/2017 12:03:40
libiRSA, size=145,648, modified=09/03/2017 10:01:38
libiSideMenu, size=505,920, modified=08/17/2017 13:03:44
libiSpeechRecognition, size=168,816, modified=08/17/2017 13:03:50
libiSQL, size=408,088, modified=08/17/2017 13:03:54
libiStore, size=75,448, modified=08/23/2017 10:13:14
libiStringUtils, size=55,272, modified=04/11/2018 10:22:52
libiSVG, size=83,312, modified=08/17/2017 13:56:48
libiTableView, size=194,152, modified=05/04/2017 10:19:36
libiTabStrip, size=1,335,904, modified=08/17/2017 13:56:58
libiUI8, size=569,896, modified=11/28/2017 17:05:34
libiUI9, size=107,056, modified=08/17/2017 13:04:04
libiWebSocket, size=401,984, modified=01/15/2018 13:53:58
libiXmlBuilder, size=151,384, modified=08/17/2017 13:04:08
libiXmlSax, size=62,976, modified=08/17/2017 13:04:12
libiXUI, size=669,264, modified=12/07/2017 10:15:54

but B4I is not able to connect (timeout) and Build server settings looks ok
 

Attachments

  • Cattura.JPG
    Cattura.JPG
    22.6 KB · Views: 188

marcick

Well-Known Member
Licensed User
Longtime User
B4X:
Last login: Wed Jun  6 15:02:16 on ttys000
iMac-di-Marco:~ EB$ java -version
java version "1.8.0_152"
Java(TM) SE Runtime Environment (build 1.8.0_152-b16)
Java HotSpot(TM) 64-Bit Server VM (build 25.152-b16, mixed mode)
iMac-di-Marco:~ EB$
 
Upvote 0

marcick

Well-Known Member
Licensed User
Longtime User
Nothing to do ...
If I delete the key folder I see it is recreated when I start the build server but it is empty.
Key.txt contains the correct IP
Test command from windows works as above (suppose correct unless for the unvalid keystore message).
But B4I can't connect.
I tried also to move to ethernet instead of wifi but no success.
It has always worked, I don't know what's happened now.
 
Upvote 0

marcick

Well-Known Member
Licensed User
Longtime User
Ok. Delething both now B4I can connect and compile.
In the meanwhile I have also installed xcode 9.4 but the compilation fails (I had similar errore with 9.3, still have to try with 9.2)

B4X:
B4i Version: 5.00
Parsing code.    (0.16s)
Compiling code.    (0.90s)
Compiling layouts code.    (0.07s)
Building Xcode project    (2.10s)
Sending data to remote compiler.    Error
B4i line: 24
CallSub(mModule,mTaskname & \
'b4i_backgroundtask' does not have a member named '___c'

Out: Build settings from command line:
    ARCHS = x86_64
    CODE_SIGNING_REQUIRED = NO
    CONFIGURATION_BUILD_DIR = /Users/EB/Desktop/builder/UploadedProjects/<user id>/Payload
    PRODUCT_NAME = Bmap4E
    SDKROOT = iphonesimulator11.4

=== BUILD TARGET B4iProject OF PROJECT B4iProject WITH CONFIGURATION Release ===

Check dependencies

Write auxiliary files
write-file /Users/EB/Desktop/builder/UploadedProjects/<user id>/build/B4iProject.build/Release-iphonesimulator/B4iProject.build/Bmap4E-project-headers.hmap
write-file /Users/EB/Desktop/builder/UploadedProjects/<user id>/build/B4iProject.build/Release-iphonesimulator/B4iProject.build/Bmap4E.hmap

Create product structure
/bin/mkdir -p /Users/EB/Desktop/builder/UploadedProjects/<user id>/Payload/Bmap4E.app

CompileC build/B4iProject.build/Release-iphonesimulator/B4iProject.build/Objects-normal/x86_64/b4i_backgroundtask.o B4iProject/b4i_backgroundtask.m normal x86_64 objective-c com.apple.compilers.llvm.clang.1_0.compiler
    cd /Users/EB/Desktop/builder/UploadedProjects/<user id>
    export LANG=en_US.US-ASCII
    export PATH="/Applications/Xcode.app/Contents/Developer/Platforms/iPhoneSimulator.platform/Developer/usr/bin:/Applications/Xcode.app/Contents/Developer/usr/bin:/usr/local/bin:/usr/bin:/bin:/usr/sbin:/sbin"
    /Applications/Xcode.app/Contents/Developer/Toolchains/XcodeDefault.xctoolchain/usr/bin/clang -x objective-c -arch x86_64 -fmessage-length=0 -fdiagnostics-show-note-include-stack -fmacro-backtrace-limit=0 -std=gnu99 -fobjc-arc -fmodules -gmodules -fmodules-prune-interval=86400 -fmodules-prune-after=345600 -fbuild-session-file=/var/folders/4k/h9zmwgw96zz4744408wq6ltw0000gn/C/org.llvm.clang/ModuleCache.noindex/Session.modulevalidation -fmodules-validate-once-per-build-session -Wnon-modular-include-in-framework-module -Werror=non-modular-include-in-framework-module -Wno-trigraphs -fpascal-strings -O0 -Wno-missing-field-initializers -Wno-missing-prototypes -Werror=return-type -Wno-implicit-atomic-properties -Werror=deprecated-objc-isa-usage -Werror=objc-root-class -Wno-arc-repeated-use-of-weak -Wduplicate-method-match -Wno-missing-braces -Wparentheses -Wswitch -Wunused-function -Wno-unused-label -Wno-unused-parameter -Wunused-variable -Wunused-value -Wempty-body -Wuninitialized -Wconditional-uninitialized -Wno-unknown-pragmas -Wno-shadow -Wno-four-char-constants -Wno-conversion -Wconstant-conversion -Wint-conversion -Wbool-conversion -Wenum-conversion -Wno-float-conversion -Wno-non-literal-null-conversion -Wno-objc-literal-conversion -Wshorten-64-to-32 -Wpointer-sign -Wno-newline-eof -Wno-selector -Wno-strict-selector-match -Wundeclared-selector -Wno-deprecated-implementations -DB4I_VERSION=9 -DNS_BLOCK_ASSERTIONS=1 -DOBJC_OLD_DISPATCH_PROTOTYPES=1 -isysroot /Applications/Xcode.app/Contents/Developer/Platforms/iPhoneSimulator.platform/Developer/SDKs/iPhoneSimulator11.4.sdk -fasm-blocks -fstrict-aliasing -Wprotocol -Wdeprecated-declarations -mios-simulator-version-min=9.3 -g -fvisibility=hidden -Wno-sign-conversion -Wno-infinite-recursion -Wno-comma -Wno-block-capture-autoreleasing -Wno-strict-prototypes -fobjc-abi-version=2 -fobjc-legacy-dispatch -iquote /Users/EB/Desktop/builder/UploadedProjects/<user id>/build/B4iProject.build/Release-iphonesimulator/B4iProject.build/Bmap4E-generated-files.hmap -I/Users/EB/Desktop/builder/UploadedProjects/<user id>/build/B4iProject.build/Release-iphonesimulator/B4iProject.build/Bmap4E-own-target-headers.hmap -I/Users/EB/Desktop/builder/UploadedProjects/<user id>/build/B4iProject.build/Release-iphonesimulator/B4iProject.build/Bmap4E-all-target-headers.hmap -iquote /Users/EB/Desktop/builder/UploadedProjects/<user id>/build/B4iProject.build/Release-iphonesimulator/B4iProject.build/Bmap4E-project-headers.hmap -I/Users/EB/Desktop/builder/UploadedProjects/<user id>/Payload/include -I/Users/EB/Desktop/builder/UploadedProjects/<user id>/build/B4iProject.build/Release-iphonesimulator/B4iProject.build/DerivedSources/x86_64 -I/Users/EB/Desktop/builder/UploadedProjects/<user id>/build/B4iProject.build/Release-iphonesimulator/B4iProject.build/DerivedSources -F/Users/EB/Desktop/builder/UploadedProjects/<user id>/Payload -F../../Libs -MMD -MT dependencies -MF /Users/EB/Desktop/builder/UploadedProjects/<user id>/build/B4iProject.build/Release-iphonesimulator/B4iProject.build/Objects-normal/x86_64/b4i_backgroundtask.d --serialize-diagnostics /Users/EB/Desktop/builder/UploadedProjects/<user id>/build/B4iProject.build/Release-iphonesimulator/B4iProject.build/Objects-normal/x86_64/b4i_backgroundtask.dia -c /Users/EB/Desktop/builder/UploadedProjects/<user id>/B4iProject/b4i_backgroundtask.m -o /Users/EB/Desktop/builder/UploadedProjects/<user id>/build/B4iProject.build/Release-iphonesimulator/B4iProject.build/Objects-normal/x86_64/b4i_backgroundtask.o
/Users/EB/Desktop/builder/UploadedProjects/<user id>/B4iProject/b4i_backgroundtask.m:39:8: error: 'b4i_backgroundtask' does not have a member named '___c'
[self->___c CallSub:self.bi :self->__mmodule :[@[self->__mtaskname,@"_Done"] componentsJoinedByString:@""]];
 ~~~~  ^

CompileC build/B4iProject.build/Release-iphonesimulator/B4iProject.build/Objects-normal/x86_64/b4i_clstoastmsg.o B4iProject/b4i_clstoastmsg.m normal x86_64 objective-c com.apple.compilers.llvm.clang.1_0.compiler
    cd /Users/EB/Desktop/builder/UploadedProjects/<user id>
    export LANG=en_US.US-ASCII
    export PATH="/Applications/Xcode.app/Contents/Developer/Platforms/iPhoneSimulator.platform/Developer/usr/bin:/Applications/Xcode.app/Contents/Developer/usr/bin:/usr/local/bin:/usr/bin:/bin:/usr/sbin:/sbin"
    /Applications/Xcode.app/Contents/Developer/Toolchains/XcodeDefault.xctoolchain/usr/bin/clang -x objective-c -arch x86_64 -fmessage-length=0 -fdiagnostics-show-note-include-stack -fmacro-backtrace-limit=0 -std=gnu99 -fobjc-arc -fmodules -gmodules -fmodules-prune-interval=86400 -fmodules-prune-after=345600 -fbuild-session-file=/var/folders/4k/h9zmwgw96zz4744408wq6ltw0000gn/C/org.llvm.clang/ModuleCache.noindex/Session.modulevalidation -fmodules-validate-once-per-build-session -Wnon-modular-include-in-framework-module -Werror=non-modular-include-in-framework-module -Wno-trigraphs -fpascal-strings -O0 -Wno-missing-field-initializers -Wno-missing-prototypes -Werror=return-type -Wno-implicit-atomic-properties -Werror=deprecated-objc-isa-usage -Werror=objc-root-class -Wno-arc-repeated-use-of-weak -Wduplicate-method-match -Wno-missing-braces -Wparentheses -Wswitch -Wunused-function -Wno-unused-label -Wno-unused-parameter -Wunused-variable -Wunused-value -Wempty-body -Wuninitialized -Wconditional-uninitialized -Wno-unknown-pragmas -Wno-shadow -Wno-four-char-constants -Wno-conversion -Wconstant-conversion -Wint-conversion -Wbool-conversion -Wenum-conversion -Wno-float-conversion -Wno-non-literal-null-conversion -Wno-objc-literal-conversion -Wshorten-64-to-32 -Wpointer-sign -Wno-newline-eof -Wno-selector -Wno-strict-selector-match -Wundeclared-selector -Wno-deprecated-implementations -DB4I_VERSION=9 -DNS_BLOCK_ASSERTIONS=1 -DOBJC_OLD_DISPATCH_PROTOTYPES=1 -isysroot /Applications/Xcode.app/Contents/Developer/Platforms/iPhoneSimulator.platform/Developer/SDKs/iPhoneSimulator11.4.sdk -fasm-blocks -fstrict-aliasing -Wprotocol -Wdeprecated-declarations -mios-simulator-version-min=9.3 -g -fvisibility=hidden -Wno-sign-conversion -Wno-infinite-recursion -Wno-comma -Wno-block-capture-autoreleasing -Wno-strict-prototypes -fobjc-abi-version=2 -fobjc-legacy-dispatch -iquote /Users/EB/Desktop/builder/UploadedProjects/<user id>/build/B4iProject.build/Release-iphonesimulator/B4iProject.build/Bmap4E-generated-files.hmap -I/Users/EB/Desktop/builder/UploadedProjects/<user id>/build/B4iProject.build/Release-iphonesimulator/B4iProject.build/Bmap4E-own-target-headers.hmap -I/Users/EB/Desktop/builder/UploadedProjects/<user id>/build/B4iProject.build/Release-iphonesimulator/B4iProject.build/Bmap4E-all-target-headers.hmap -iquote /Users/EB/Desktop/builder/UploadedProjects/<user id>/build/B4iProject.build/Release-iphonesimulator/B4iProject.build/Bmap4E-project-headers.hmap -I/Users/EB/Desktop/builder/UploadedProjects/<user id>/Payload/include -I/Users/EB/Desktop/builder/UploadedProjects/<user id>/build/B4iProject.build/Release-iphonesimulator/B4iProject.build/DerivedSources/x86_64 -I/Users/EB/Desktop/builder/UploadedProjects/<user id>/build/B4iProject.build/Release-iphonesimulator/B4iProject.build/DerivedSources -F/Users/EB/Desktop/builder/UploadedProjects/<user id>/Payload -F../../Libs -MMD -MT dependencies -MF /Users/EB/Desktop/builder/UploadedProjects/<user id>/build/B4iProject.build/Release-iphonesimulator/B4iProject.build/Objects-normal/x86_64/b4i_clstoastmsg.d --serialize-diagnostics /Users/EB/Desktop/builder/UploadedProjects/<user id>/build/B4iProject.build/Release-iphonesimulator/B4iProject.build/Objects-normal/x86_64/b4i_clstoastmsg.dia -c /Users/EB/Desktop/builder/UploadedProjects/<user id>/B4iProject/b4i_clstoastmsg.m -o /Users/EB/Desktop/builder/UploadedProjects/<user id>/build/B4iProject.build/Release-iphonesimulator/B4iProject.build/Objects-normal/x86_64/b4i_clstoastmsg.o
/Users/EB/Desktop/builder/UploadedProjects/<user id>/B4iProject/b4i_clstoastmsg.m:90:38: error: 'b4i_clstoastmsg' does not have a member named '___c'
[self->__pnlmessage setColor:[[self->___c Colors] ARGB:(int) (200) :(int) (0) :(int) (0) :(int) (0)]];
                               ~~~~  ^
/Users/EB/Desktop/builder/UploadedProjects/<user id>/B4iProject/b4i_clstoastmsg.m:94:42: error: 'b4i_clstoastmsg' does not have a member named '___c'
[self->__lblmessage setTextColor:[[self->___c Colors] White]];
                                   ~~~~  ^
/Users/EB/Desktop/builder/UploadedProjects/<user id>/B4iProject/b4i_clstoastmsg.m:98:37: error: 'b4i_clstoastmsg' does not have a member named '___c'
[self->__lblmessage setFont:[[self->___c Font] CreateNew:_textsize]];
                              ~~~~  ^
/Users/EB/Desktop/builder/UploadedProjects/<user id>/B4iProject/b4i_clstoastmsg.m:104:52: error: 'b4i_clstoastmsg' does not have a member named '___c'
[self->__pnlmessage SetBorder:(float) (0) :[[self->___c Colors] Black] :(float) (10)];
                                             ~~~~  ^
/Users/EB/Desktop/builder/UploadedProjects/<user id>/B4iProject/b4i_clstoastmsg.m:110:39: error: 'b4i_clstoastmsg' does not have a member named '___c'
[self->__pnlmessage SetShadow:[[self->___c Colors] Black] :(float) (0) :(float) (0) :(float) (0.8) :false];
                                ~~~~  ^
5 errors generated.

CompileC build/B4iProject.build/Release-iphonesimulator/B4iProject.build/Objects-normal/x86_64/main.o B4iProject/main.m normal x86_64 objective-c com.apple.compilers.llvm.clang.1_0.compiler
    cd /Users/EB/Desktop/builder/UploadedProjects/<user id>
    export LANG=en_US.US-ASCII
    export PATH="/Applications/Xcode.app/Contents/Developer/Platforms/iPhoneSimulator.platform/Developer/usr/bin:/Applications/Xcode.app/Contents/Developer/usr/bin:/usr/local/bin:/usr/bin:/bin:/usr/sbin:/sbin"
    /Applications/Xcode.app/Contents/Developer/Toolchains/XcodeDefault.xctoolchain/usr/bin/clang -x objective-c -arch x86_64 -fmessage-length=0 -fdiagnostics-show-note-include-stack -fmacro-backtrace-limit=0 -std=gnu99 -fobjc-arc -fmodules -gmodules -fmodules-prune-interval=86400 -fmodules-prune-after=345600 -fbuild-session-file=/var/folders/4k/h9zmwgw96zz4744408wq6ltw0000gn/C/org.llvm.clang/ModuleCache.noindex/Session.modulevalidation -fmodules-validate-once-per-build-session -Wnon-modular-include-in-framework-module -Werror=non-modular-include-in-framework-module -Wno-trigraphs -fpascal-strings -O0 -Wno-missing-field-initializers -Wno-missing-prototypes -Werror=return-type -Wno-implicit-atomic-properties -Werror=deprecated-objc-isa-usage -Werror=objc-root-class -Wno-arc-repeated-use-of-weak -Wduplicate-method-match -Wno-missing-braces -Wparentheses -Wswitch -Wunused-function -Wno-unused-label -Wno-unused-parameter -Wunused-variable -Wunused-value -Wempty-body -Wuninitialized -Wconditional-uninitialized -Wno-unknown-pragmas -Wno-shadow -Wno-four-char-constants -Wno-conversion -Wconstant-conversion -Wint-conversion -Wbool-conversion -Wenum-conversion -Wno-float-conversion -Wno-non-literal-null-conversion -Wno-objc-literal-conversion -Wshorten-64-to-32 -Wpointer-sign -Wno-newline-eof -Wno-selector -Wno-strict-selector-match -Wundeclared-selector -Wno-deprecated-implementations -DB4I_VERSION=9 -DNS_BLOCK_ASSERTIONS=1 -DOBJC_OLD_DISPATCH_PROTOTYPES=1 -isysroot /Applications/Xcode.app/Contents/Developer/Platforms/iPhoneSimulator.platform/Developer/SDKs/iPhoneSimulator11.4.sdk -fasm-blocks -fstrict-aliasing -Wprotocol -Wdeprecated-declarations -mios-simulator-version-min=9.3 -g -fvisibility=hidden -Wno-sign-conversion -Wno-infinite-recursion -Wno-comma -Wno-block-capture-autoreleasing -Wno-strict-prototypes -fobjc-abi-version=2 -fobjc-legacy-dispatch -iquote /Users/EB/Desktop/builder/UploadedProjects/<user id>/build/B4iProject.build/Release-iphonesimulator/B4iProject.build/Bmap4E-generated-files.hmap -I/Users/EB/Desktop/builder/UploadedProjects/<user id>/build/B4iProject.build/Release-iphonesimulator/B4iProject.build/Bmap4E-own-target-headers.hmap -I/Users/EB/Desktop/builder/UploadedProjects/<user id>/build/B4iProject.build/Release-iphonesimulator/B4iProject.build/Bmap4E-all-target-headers.hmap -iquote /Users/EB/Desktop/builder/UploadedProjects/<user id>/build/B4iProject.build/Release-iphonesimulator/B4iProject.build/Bmap4E-project-headers.hmap -I/Users/EB/Desktop/builder/UploadedProjects/<user id>/Payload/include -I/Users/EB/Desktop/builder/UploadedProjects/<user id>/build/B4iProject.build/Release-iphonesimulator/B4iProject.build/DerivedSources/x86_64 -I/Users/EB/Desktop/builder/UploadedProjects/<user id>/build/B4iProject.build/Release-iphonesimulator/B4iProject.build/DerivedSources -F/Users/EB/Desktop/builder/UploadedProjects/<user id>/Payload -F../../Libs -MMD -MT dependencies -MF /Users/EB/Desktop/builder/UploadedProjects/<user id>/build/B4iProject.build/Release-iphonesimulator/B4iProject.build/Objects-normal/x86_64/main.d --serialize-diagnostics /Users/EB/Desktop/builder/UploadedProjects/<user id>/build/B4iProject.build/Release-iphonesimulator/B4iProject.build/Objects-normal/x86_64/main.dia -c /Users/EB/Desktop/builder/UploadedProjects/<user id>/B4iProject/main.m -o /Users/EB/Desktop/builder/UploadedProjects/<user id>/build/B4iProject.build/Release-iphonesimulator/B4iProject.build/Objects-normal/x86_64/main.o

CompileC build/B4iProject.build/Release-iphonesimulator/B4iProject.build/Objects-normal/x86_64/b4i_configmodulesimless.o B4iProject/b4i_configmodulesimless.m normal x86_64 objective-c com.apple.compilers.llvm.clang.1_0.compiler
    cd /Users/EB/Desktop/builder/UploadedProjects/<user id>
    export LANG=en_US.US-ASCII
    export PATH="/Applications/Xcode.app/Contents/Developer/Platforms/iPhoneSimulator.platform/Developer/usr/bin:/Applications/Xcode.app/Contents/Developer/usr/bin:/usr/local/bin:/usr/bin:/bin:/usr/sbin:/sbin"
    /Applications/Xcode.app/Contents/Developer/Toolchains/XcodeDefault.xctoolchain/usr/bin/clang -x objective-c -arch x86_64 -fmessage-length=0 -fdiagnostics-show-note-include-stack -fmacro-backtrace-limit=0 -std=gnu99 -fobjc-arc -fmodules -gmodules -fmodules-prune-interval=86400 -fmodules-prune-after=345600 -fbuild-session-file=/var/folders/4k/h9zmwgw96zz4744408wq6ltw0000gn/C/org.llvm.clang/ModuleCache.noindex/Session.modulevalidation -fmodules-validate-once-per-build-session -Wnon-modular-include-in-framework-module -Werror=non-modular-include-in-framework-module -Wno-trigraphs -fpascal-strings -O0 -Wno-missing-field-initializers -Wno-missing-prototypes -Werror=return-type -Wno-implicit-atomic-properties -Werror=deprecated-objc-isa-usage -Werror=objc-root-class -Wno-arc-repeated-use-of-weak -Wduplicate-method-match -Wno-missing-braces -Wparentheses -Wswitch -Wunused-function -Wno-unused-label -Wno-unused-parameter -Wunused-variable -Wunused-value -Wempty-body -Wuninitialized -Wconditional-uninitialized -Wno-unknown-pragmas -Wno-shadow -Wno-four-char-constants -Wno-conversion -Wconstant-conversion -Wint-conversion -Wbool-conversion -Wenum-conversion -Wno-float-conversion -Wno-non-literal-null-conversion -Wno-objc-literal-conversion -Wshorten-64-to-32 -Wpointer-sign -Wno-newline-eof -Wno-selector -Wno-strict-selector-match -Wundeclared-selector -Wno-deprecated-implementations -DB4I_VERSION=9 -DNS_BLOCK_ASSERTIONS=1 -DOBJC_OLD_DISPATCH_PROTOTYPES=1 -isysroot /Applications/Xcode.app/Contents/Developer/Platforms/iPhoneSimulator.platform/Developer/SDKs/iPhoneSimulator11.4.sdk -fasm-blocks -fstrict-aliasing -Wprotocol -Wdeprecated-declarations -mios-simulator-version-min=9.3 -g -fvisibility=hidden -Wno-sign-conversion -Wno-infinite-recursion -Wno-comma -Wno-block-capture-autoreleasing -Wno-strict-prototypes -fobjc-abi-version=2 -fobjc-legacy-dispatch -iquote /Users/EB/Desktop/builder/UploadedProjects/<user id>/build/B4iProject.build/Release-iphonesimulator/B4iProject.build/Bmap4E-generated-files.hmap -I/Users/EB/Desktop/builder/UploadedProjects/<user id>/build/B4iProject.build/Release-iphonesimulator/B4iProject.build/Bmap4E-own-target-headers.hmap -I/Users/EB/Desktop/builder/UploadedProjects/<user id>/build/B4iProject.build/Release-iphonesimulator/B4iProject.build/Bmap4E-all-target-headers.hmap -iquote /Users/EB/Desktop/builder/UploadedProjects/<user id>/build/B4iProject.build/Release-iphonesimulator/B4iProject.build/Bmap4E-project-headers.hmap -I/Users/EB/Desktop/builder/UploadedProjects/<user id>/Payload/include -I/Users/EB/Desktop/builder/UploadedProjects/<user id>/build/B4iProject.build/Release-iphonesimulator/B4iProject.build/DerivedSources/x86_64 -I/Users/EB/Desktop/builder/UploadedProjects/<user id>/build/B4iProject.build/Release-iphonesimulator/B4iProject.build/DerivedSources -F/Users/EB/Desktop/builder/UploadedProjects/<user id>/Payload -F../../Libs -MMD -MT dependencies -MF /Users/EB/Desktop/builder/UploadedProjects/<user id>/build/B4iProject.build/Release-iphonesimulator/B4iProject.build/Objects-normal/x86_64/b4i_configmodulesimless.d --serialize-diagnostics /Users/EB/Desktop/builder/UploadedProjects/<user id>/build/B4iProject.build/Release-iphonesimulator/B4iProject.build/Objects-normal/x86_64/b4i_configmodulesimless.dia -c /Users/EB/Desktop/builder/UploadedProjects/<user id>/B4iProject/b4i_configmodulesimless.m -o /Users/EB/Desktop/builder/UploadedProjects/<user id>/build/B4iProject.build/Release-iphonesimulator/B4iProject.build/Objects-normal/x86_64/b4i_configmodulesimless.o
/Users/EB/Desktop/builder/UploadedProjects/<user id>/B4iProject/b4i_configmodulesimless.m:50:23: error: 'ResumableSub_configmodulesimless_AskConfig' does not have a member named '_state'
        switch (self->_state) {
                ~~~~  ^
/Users/EB/Desktop/builder/UploadedProjects/<user id>/B4iProject/b4i_configmodulesimless.m:443:23: error: 'ResumableSub_configmodulesimless_BtnSendConfig_Click' does not have a member named '_state'
        switch (self->_state) {
                ~~~~  ^

CompileC build/B4iProject.build/Release-iphonesimulator/B4iProject.build/Objects-normal/x86_64/b4i_customlistview.o B4iProject/b4i_customlistview.m normal x86_64 objective-c com.apple.compilers.llvm.clang.1_0.compiler
    cd /Users/EB/Desktop/builder/UploadedProjects/<user id>
    export LANG=en_US.US-ASCII
    export PATH="/Applications/Xcode.app/Contents/Developer/Platforms/iPhoneSimulator.platform/Developer/usr/bin:/Applications/Xcode.app/Contents/Developer/usr/bin:/usr/local/bin:/usr/bin:/bin:/usr/sbin:/sbin"
    /Applications/Xcode.app/Contents/Developer/Toolchains/XcodeDefault.xctoolchain/usr/bin/clang -x objective-c -arch x86_64 -fmessage-length=0 -fdiagnostics-show-note-include-stack -fmacro-backtrace-limit=0 -std=gnu99 -fobjc-arc -fmodules -gmodules -fmodules-prune-interval=86400 -fmodules-prune-after=345600 -fbuild-session-file=/var/folders/4k/h9zmwgw96zz4744408wq6ltw0000gn/C/org.llvm.clang/ModuleCache.noindex/Session.modulevalidation -fmodules-validate-once-per-build-session -Wnon-modular-include-in-framework-module -Werror=non-modular-include-in-framework-module -Wno-trigraphs -fpascal-strings -O0 -Wno-missing-field-initializers -Wno-missing-prototypes -Werror=return-type -Wno-implicit-atomic-properties -Werror=deprecated-objc-isa-usage -Werror=objc-root-class -Wno-arc-repeated-use-of-weak -Wduplicate-method-match -Wno-missing-braces -Wparentheses -Wswitch -Wunused-function -Wno-unused-label -Wno-unused-parameter -Wunused-variable -Wunused-value -Wempty-body -Wuninitialized -Wconditional-uninitialized -Wno-unknown-pragmas -Wno-shadow -Wno-four-char-constants -Wno-conversion -Wconstant-conversion -Wint-conversion -Wbool-conversion -Wenum-conversion -Wno-float-conversion -Wno-non-literal-null-conversion -Wno-objc-literal-conversion -Wshorten-64-to-32 -Wpointer-sign -Wno-newline-eof -Wno-selector -Wno-strict-selector-match -Wundeclared-selector -Wno-deprecated-implementations -DB4I_VERSION=9 -DNS_BLOCK_ASSERTIONS=1 -DOBJC_OLD_DISPATCH_PROTOTYPES=1 -isysroot /Applications/Xcode.app/Contents/Developer/Platforms/iPhoneSimulator.platform/Developer/SDKs/iPhoneSimulator11.4.sdk -fasm-blocks -fstrict-aliasing -Wprotocol -Wdeprecated-declarations -mios-simulator-version-min=9.3 -g -fvisibility=hidden -Wno-sign-conversion -Wno-infinite-recursion -Wno-comma -Wno-block-capture-autoreleasing -Wno-strict-prototypes -fobjc-abi-version=2 -fobjc-legacy-dispatch -iquote /Users/EB/Desktop/builder/UploadedProjects/<user id>/build/B4iProject.build/Release-iphonesimulator/B4iProject.build/Bmap4E-generated-files.hmap -I/Users/EB/Desktop/builder/UploadedProjects/<user id>/build/B4iProject.build/Release-iphonesimulator/B4iProject.build/Bmap4E-own-target-headers.hmap -I/Users/EB/Desktop/builder/UploadedProjects/<user id>/build/B4iProject.build/Release-iphonesimulator/B4iProject.build/Bmap4E-all-target-headers.hmap -iquote /Users/EB/Desktop/builder/UploadedProjects/<user id>/build/B4iProject.build/Release-iphonesimulator/B4iProject.build/Bmap4E-project-headers.hmap -I/Users/EB/Desktop/builder/UploadedProjects/<user id>/Payload/include -I/Users/EB/Desktop/builder/UploadedProjects/<user id>/build/B4iProject.build/Release-iphonesimulator/B4iProject.build/DerivedSources/x86_64 -I/Users/EB/Desktop/builder/UploadedProjects/<user id>/build/B4iProject.build/Release-iphonesimulator/B4iProject.build/DerivedSources -F/Users/EB/Desktop/builder/UploadedProjects/<user id>/Payload -F../../Libs -MMD -MT dependencies -MF /Users/EB/Desktop/builder/UploadedProjects/<user id>/build/B4iProject.build/Release-iphonesimulator/B4iProject.build/Objects-normal/x86_64/b4i_customlistview.d --serialize-diagnostics /Users/EB/Desktop/builder/UploadedProjects/<user id>/build/B4iProject.build/Release-iphonesimulator/B4iProject.build/Objects-normal/x86_64/b4i_customlistview.dia -c /Users/EB/Desktop/builder/UploadedProjects/<user id>/B4iProject/b4i_customlistview.m -o /Users/EB/Desktop/builder/UploadedProjects/<user id>/build/B4iProject.build/Release-iphonesimulator/B4iProject.build/Objects-normal/x86_64/b4i_customlistview.o
/Users/EB/Desktop/builder/UploadedProjects/<user id>/B4iProject/b4i_customlistview.m:91:34: error: 'b4i_customlistview' does not have a member named '___c'
self->__highlightcolor = [[self->___c Colors] LightGray];
                           ~~~~  ^
/Users/EB/Desktop/builder/UploadedProjects/<user id>/B4iProject/b4i_customlistview.m:181:36: error: 'b4i_customlistview' does not have a member named '___c'
self->__defaulttextcolor = [[self->___c Colors] White];
                             ~~~~  ^
/Users/EB/Desktop/builder/UploadedProjects/<user id>/B4iProject/b4i_customlistview.m:183:35: error: 'b4i_customlistview' does not have a member named '___c'
self->__defaulttextfont = [[self->___c Font] CreateNew:(float) (16)];
                            ~~~~  ^
/Users/EB/Desktop/builder/UploadedProjects/<user id>/B4iProject/b4i_customlistview.m:185:46: error: 'b4i_customlistview' does not have a member named '___c'
self->__defaulttextbackgroundcolor = [[self->___c Colors] Black];
                                       ~~~~  ^
/Users/EB/Desktop/builder/UploadedProjects/<user id>/B4iProject/b4i_customlistview.m:207:24: error: 'b4i_customlistview' does not have a member named '___c'
[_pnl setColor:[[self->___c Colors] Transparent]];
                 ~~~~  ^


Error: ** BUILD FAILED **


The following build commands failed:
    CompileC build/B4iProject.build/Release-iphonesimulator/B4iProject.build/Objects-normal/x86_64/b4i_clstoastmsg.o B4iProject/b4i_clstoastmsg.m normal x86_64 objective-c com.apple.compilers.llvm.clang.1_0.compiler
(1 failure)
 
Upvote 0

marcick

Well-Known Member
Licensed User
Longtime User
this is the error on a new blank project
Maybe there is something corrupted in xcode ?
If I put xcode in the trash and then install another version, first time I launch it it doesn't ask for installing additional debug tool (I remember this in the past).
I'm tempted to factory reset my Imac ....

B4X:
B4i Version: 5.00
Parsing code.    (0.00s)
Compiling code.    (0.09s)
Compiling layouts code.    (0.00s)
Compiling debugger engine code.    (0.97s)
Building Xcode project    (0.60s)
Sending data to remote compiler.    Error
Out: Build settings from command line:
    ARCHS = arm64
    CODE_SIGN_IDENTITY = iPhone Distribution: Marco Blancato (VG3673LX37)
    CONFIGURATION_BUILD_DIR = /Users/EB/Desktop/b/UploadedProjects/<user id>/Payload
    OTHER_CODE_SIGN_FLAGS = --keychain <user id>
    PRODUCT_NAME = B4i Example
    PROVISIONING_PROFILE = 6c83544d-0696-4fc0-b49f-6fc7328911ed

=== BUILD TARGET B4iProject OF PROJECT B4iProject WITH CONFIGURATION Release ===

Check dependencies

Write auxiliary files
/bin/mkdir -p /Users/EB/Desktop/b/UploadedProjects/<user id>/build/B4iProject.build/Release-iphoneos/B4iProject.build/Objects-normal/arm64
write-file /Users/EB/Desktop/b/UploadedProjects/<user id>/build/B4iProject.build/Release-iphoneos/B4iProject.build/Objects-normal/arm64/B4i\ Example.LinkFileList
write-file /Users/EB/Desktop/b/UploadedProjects/<user id>/build/B4iProject.build/Release-iphoneos/B4iProject.build/B4i\ Example-own-target-headers.hmap
write-file /Users/EB/Desktop/b/UploadedProjects/<user id>/build/B4iProject.build/Release-iphoneos/B4iProject.build/B4i\ Example-generated-files.hmap
write-file /Users/EB/Desktop/b/UploadedProjects/<user id>/build/B4iProject.build/Release-iphoneos/B4iProject.build/B4i\ Example-all-non-framework-target-headers.hmap
write-file /Users/EB/Desktop/b/UploadedProjects/<user id>/build/B4iProject.build/Release-iphoneos/B4iProject.build/B4i\ Example-all-target-headers.hmap
write-file /Users/EB/Desktop/b/UploadedProjects/<user id>/build/B4iProject.build/Release-iphoneos/B4iProject.build/B4i\ Example-project-headers.hmap
write-file /Users/EB/Desktop/b/UploadedProjects/<user id>/build/B4iProject.build/Release-iphoneos/B4iProject.build/B4i\ Example.hmap

Create product structure
/bin/mkdir -p /Users/EB/Desktop/b/UploadedProjects/<user id>/Payload/B4i\ Example.app

CompileC build/B4iProject.build/Release-iphoneos/B4iProject.build/Objects-normal/arm64/b4i_main.o B4iProject/b4i_main.m normal arm64 objective-c com.apple.compilers.llvm.clang.1_0.compiler
    cd /Users/EB/Desktop/b/UploadedProjects/<user id>
    export LANG=en_US.US-ASCII
    export PATH="/Applications/Xcode.app/Contents/Developer/Platforms/iPhoneOS.platform/Developer/usr/bin:/Applications/Xcode.app/Contents/Developer/usr/bin:/usr/local/bin:/usr/bin:/bin:/usr/sbin:/sbin"
    /Applications/Xcode.app/Contents/Developer/Toolchains/XcodeDefault.xctoolchain/usr/bin/clang -x objective-c -arch arm64 -fmessage-length=0 -fdiagnostics-show-note-include-stack -fmacro-backtrace-limit=0 -std=gnu99 -fobjc-arc -fmodules -gmodules -fmodules-prune-interval=86400 -fmodules-prune-after=345600 -fbuild-session-file=/var/folders/4k/h9zmwgw96zz4744408wq6ltw0000gn/C/org.llvm.clang/ModuleCache/Session.modulevalidation -fmodules-validate-once-per-build-session -Wnon-modular-include-in-framework-module -Werror=non-modular-include-in-framework-module -Wno-trigraphs -fpascal-strings -O0 -Wno-missing-field-initializers -Wno-missing-prototypes -Werror=return-type -Wno-implicit-atomic-properties -Werror=deprecated-objc-isa-usage -Werror=objc-root-class -Wno-arc-repeated-use-of-weak -Wduplicate-method-match -Wno-missing-braces -Wparentheses -Wswitch -Wunused-function -Wno-unused-label -Wno-unused-parameter -Wunused-variable -Wunused-value -Wempty-body -Wuninitialized -Wconditional-uninitialized -Wno-unknown-pragmas -Wno-shadow -Wno-four-char-constants -Wno-conversion -Wconstant-conversion -Wint-conversion -Wbool-conversion -Wenum-conversion -Wno-float-conversion -Wno-non-literal-null-conversion -Wno-objc-literal-conversion -Wshorten-64-to-32 -Wpointer-sign -Wno-newline-eof -Wno-selector -Wno-strict-selector-match -Wundeclared-selector -Wno-deprecated-implementations -DB4I_VERSION=9 -DNS_BLOCK_ASSERTIONS=1 -isysroot /Applications/Xcode.app/Contents/Developer/Platforms/iPhoneOS.platform/Developer/SDKs/iPhoneOS11.2.sdk -fstrict-aliasing -Wprotocol -Wdeprecated-declarations -miphoneos-version-min=7.0 -fvisibility=hidden -Wno-sign-conversion -Wno-infinite-recursion -Wno-comma -Wno-block-capture-autoreleasing -Wno-strict-prototypes -iquote /Users/EB/Desktop/b/UploadedProjects/<user id>/build/B4iProject.build/Release-iphoneos/B4iProject.build/B4i\ Example-generated-files.hmap -I/Users/EB/Desktop/b/UploadedProjects/<user id>/build/B4iProject.build/Release-iphoneos/B4iProject.build/B4i\ Example-own-target-headers.hmap -I/Users/EB/Desktop/b/UploadedProjects/<user id>/build/B4iProject.build/Release-iphoneos/B4iProject.build/B4i\ Example-all-target-headers.hmap -iquote /Users/EB/Desktop/b/UploadedProjects/<user id>/build/B4iProject.build/Release-iphoneos/B4iProject.build/B4i\ Example-project-headers.hmap -I/Users/EB/Desktop/b/UploadedProjects/<user id>/Payload/include -I/Users/EB/Desktop/b/UploadedProjects/<user id>/build/B4iProject.build/Release-iphoneos/B4iProject.build/DerivedSources/arm64 -I/Users/EB/Desktop/b/UploadedProjects/<user id>/build/B4iProject.build/Release-iphoneos/B4iProject.build/DerivedSources -F/Users/EB/Desktop/b/UploadedProjects/<user id>/Payload -F../../Libs -MMD -MT dependencies -MF /Users/EB/Desktop/b/UploadedProjects/<user id>/build/B4iProject.build/Release-iphoneos/B4iProject.build/Objects-normal/arm64/b4i_main.d --serialize-diagnostics /Users/EB/Desktop/b/UploadedProjects/<user id>/build/B4iProject.build/Release-iphoneos/B4iProject.build/Objects-normal/arm64/b4i_main.dia -c /Users/EB/Desktop/b/UploadedProjects/<user id>/B4iProject/b4i_main.m -o /Users/EB/Desktop/b/UploadedProjects/<user id>/build/B4iProject.build/Release-iphoneos/B4iProject.build/Objects-normal/arm64/b4i_main.o
/Users/EB/Desktop/b/UploadedProjects/<user id>/B4iProject/b4i_main.m:23:16: error: property 'currentModule' not found on object of type 'B4IRDebugUtils'
B4IRDebugUtils.currentModule=@"main";
               ^
/Users/EB/Desktop/b/UploadedProjects/<user id>/B4iProject/b4i_main.m:26:16: error: property 'currentLine' not found on object of type 'B4IRDebugUtils'
B4IRDebugUtils.currentLine=196608;
               ^
/Users/EB/Desktop/b/UploadedProjects/<user id>/B4iProject/b4i_main.m:28:16: error: property 'currentLine' not found on object of type 'B4IRDebugUtils'
B4IRDebugUtils.currentLine=196610;
               ^
/Users/EB/Desktop/b/UploadedProjects/<user id>/B4iProject/b4i_main.m:33:16: error: property 'currentModule' not found on object of type 'B4IRDebugUtils'
B4IRDebugUtils.currentModule=@"main";
               ^
/Users/EB/Desktop/b/UploadedProjects/<user id>/B4iProject/b4i_main.m:36:16: error: property 'currentLine' not found on object of type 'B4IRDebugUtils'
B4IRDebugUtils.currentLine=65536;
               ^
/Users/EB/Desktop/b/UploadedProjects/<user id>/B4iProject/b4i_main.m:38:16: error: property 'currentLine' not found on object of type 'B4IRDebugUtils'
B4IRDebugUtils.currentLine=65538;
               ^
/Users/EB/Desktop/b/UploadedProjects/<user id>/B4iProject/b4i_main.m:41:16: error: property 'currentLine' not found on object of type 'B4IRDebugUtils'
B4IRDebugUtils.currentLine=65539;
               ^
/Users/EB/Desktop/b/UploadedProjects/<user id>/B4iProject/b4i_main.m:44:16: error: property 'currentLine' not found on object of type 'B4IRDebugUtils'
B4IRDebugUtils.currentLine=65540;
               ^
/Users/EB/Desktop/b/UploadedProjects/<user id>/B4iProject/b4i_main.m:47:16: error: property 'currentLine' not found on object of type 'B4IRDebugUtils'
B4IRDebugUtils.currentLine=65541;
               ^
/Users/EB/Desktop/b/UploadedProjects/<user id>/B4iProject/b4i_main.m:49:45: error: 'b4i_main' does not have a member named '___c'
[[self->__page1 RootPanel] setColor:[[self->___c Colors] White]];
                                      ~~~~  ^
/Users/EB/Desktop/b/UploadedProjects/<user id>/B4iProject/b4i_main.m:50:16: error: property 'currentLine' not found on object of type 'B4IRDebugUtils'
B4IRDebugUtils.currentLine=65542;
               ^
/Users/EB/Desktop/b/UploadedProjects/<user id>/B4iProject/b4i_main.m:53:16: error: property 'currentLine' not found on object of type 'B4IRDebugUtils'
B4IRDebugUtils.currentLine=65543;
               ^
/Users/EB/Desktop/b/UploadedProjects/<user id>/B4iProject/b4i_main.m:58:16: error: property 'currentModule' not found on object of type 'B4IRDebugUtils'
B4IRDebugUtils.currentModule=@"main";
               ^
/Users/EB/Desktop/b/UploadedProjects/<user id>/B4iProject/b4i_main.m:61:16: error: property 'currentLine' not found on object of type 'B4IRDebugUtils'
B4IRDebugUtils.currentLine=131072;
               ^
/Users/EB/Desktop/b/UploadedProjects/<user id>/B4iProject/b4i_main.m:63:16: error: property 'currentLine' not found on object of type 'B4IRDebugUtils'
B4IRDebugUtils.currentLine=131074;
               ^
/Users/EB/Desktop/b/UploadedProjects/<user id>/B4iProject/b4i_main.m:73:16: error: property 'currentModule' not found on object of type 'B4IRDebugUtils'
B4IRDebugUtils.currentModule=@"main";
               ^
/Users/EB/Desktop/b/UploadedProjects/<user id>/B4iProject/b4i_main.m:76:16: error: property 'currentLine' not found on object of type 'B4IRDebugUtils'
B4IRDebugUtils.currentLine=0;
               ^
/Users/EB/Desktop/b/UploadedProjects/<user id>/B4iProject/b4i_main.m:78:16: error: property 'currentLine' not found on object of type 'B4IRDebugUtils'
B4IRDebugUtils.currentLine=3;
               ^
/Users/EB/Desktop/b/UploadedProjects/<user id>/B4iProject/b4i_main.m:81:16: error: property 'currentLine' not found on object of type 'B4IRDebugUtils'
B4IRDebugUtils.currentLine=4;
               ^
fatal error: too many errors emitted, stopping now [-ferror-limit=]
20 errors generated.

CompileC build/B4iProject.build/Release-iphoneos/B4iProject.build/Objects-normal/arm64/main.o B4iProject/main.m normal arm64 objective-c com.apple.compilers.llvm.clang.1_0.compiler
    cd /Users/EB/Desktop/b/UploadedProjects/<user id>
    export LANG=en_US.US-ASCII
    export PATH="/Applications/Xcode.app/Contents/Developer/Platforms/iPhoneOS.platform/Developer/usr/bin:/Applications/Xcode.app/Contents/Developer/usr/bin:/usr/local/bin:/usr/bin:/bin:/usr/sbin:/sbin"
    /Applications/Xcode.app/Contents/Developer/Toolchains/XcodeDefault.xctoolchain/usr/bin/clang -x objective-c -arch arm64 -fmessage-length=0 -fdiagnostics-show-note-include-stack -fmacro-backtrace-limit=0 -std=gnu99 -fobjc-arc -fmodules -gmodules -fmodules-prune-interval=86400 -fmodules-prune-after=345600 -fbuild-session-file=/var/folders/4k/h9zmwgw96zz4744408wq6ltw0000gn/C/org.llvm.clang/ModuleCache/Session.modulevalidation -fmodules-validate-once-per-build-session -Wnon-modular-include-in-framework-module -Werror=non-modular-include-in-framework-module -Wno-trigraphs -fpascal-strings -O0 -Wno-missing-field-initializers -Wno-missing-prototypes -Werror=return-type -Wno-implicit-atomic-properties -Werror=deprecated-objc-isa-usage -Werror=objc-root-class -Wno-arc-repeated-use-of-weak -Wduplicate-method-match -Wno-missing-braces -Wparentheses -Wswitch -Wunused-function -Wno-unused-label -Wno-unused-parameter -Wunused-variable -Wunused-value -Wempty-body -Wuninitialized -Wconditional-uninitialized -Wno-unknown-pragmas -Wno-shadow -Wno-four-char-constants -Wno-conversion -Wconstant-conversion -Wint-conversion -Wbool-conversion -Wenum-conversion -Wno-float-conversion -Wno-non-literal-null-conversion -Wno-objc-literal-conversion -Wshorten-64-to-32 -Wpointer-sign -Wno-newline-eof -Wno-selector -Wno-strict-selector-match -Wundeclared-selector -Wno-deprecated-implementations -DB4I_VERSION=9 -DNS_BLOCK_ASSERTIONS=1 -isysroot /Applications/Xcode.app/Contents/Developer/Platforms/iPhoneOS.platform/Developer/SDKs/iPhoneOS11.2.sdk -fstrict-aliasing -Wprotocol -Wdeprecated-declarations -miphoneos-version-min=7.0 -fvisibility=hidden -Wno-sign-conversion -Wno-infinite-recursion -Wno-comma -Wno-block-capture-autoreleasing -Wno-strict-prototypes -iquote /Users/EB/Desktop/b/UploadedProjects/<user id>/build/B4iProject.build/Release-iphoneos/B4iProject.build/B4i\ Example-generated-files.hmap -I/Users/EB/Desktop/b/UploadedProjects/<user id>/build/B4iProject.build/Release-iphoneos/B4iProject.build/B4i\ Example-own-target-headers.hmap -I/Users/EB/Desktop/b/UploadedProjects/<user id>/build/B4iProject.build/Release-iphoneos/B4iProject.build/B4i\ Example-all-target-headers.hmap -iquote /Users/EB/Desktop/b/UploadedProjects/<user id>/build/B4iProject.build/Release-iphoneos/B4iProject.build/B4i\ Example-project-headers.hmap -I/Users/EB/Desktop/b/UploadedProjects/<user id>/Payload/include -I/Users/EB/Desktop/b/UploadedProjects/<user id>/build/B4iProject.build/Release-iphoneos/B4iProject.build/DerivedSources/arm64 -I/Users/EB/Desktop/b/UploadedProjects/<user id>/build/B4iProject.build/Release-iphoneos/B4iProject.build/DerivedSources -F/Users/EB/Desktop/b/UploadedProjects/<user id>/Payload -F../../Libs -MMD -MT dependencies -MF /Users/EB/Desktop/b/UploadedProjects/<user id>/build/B4iProject.build/Release-iphoneos/B4iProject.build/Objects-normal/arm64/main.d --serialize-diagnostics /Users/EB/Desktop/b/UploadedProjects/<user id>/build/B4iProject.build/Release-iphoneos/B4iProject.build/Objects-normal/arm64/main.dia -c /Users/EB/Desktop/b/UploadedProjects/<user id>/B4iProject/main.m -o /Users/EB/Desktop/b/UploadedProjects/<user id>/build/B4iProject.build/Release-iphoneos/B4iProject.build/Objects-normal/arm64/main.o


Error: ** BUILD FAILED **


The following build commands failed:
    CompileC build/B4iProject.build/Release-iphoneos/B4iProject.build/Objects-normal/arm64/b4i_main.o B4iProject/b4i_main.m normal arm64 objective-c com.apple.compilers.llvm.clang.1_0.compiler
(1 failure)
 
Upvote 0

marcick

Well-Known Member
Licensed User
Longtime User
Sooner or later I will turn crazy ... o_O:confused:
Looks like I didn't update correctly the BuildServer folder with the last B4I release. I'm sure I did it, but it's evident not ...
After one wasted day I can continue to work on my app.
Thanks ...... !!!!
 
Upvote 0
Top